nixbot

builds

Mic92/dotfiles build #597 failed

branch main · commit 806afe2667 · · took 19m 42s · eval 3m 11s

eval warnings 3 kinds · 6 occurrences
  • error ×4
  • warn 'system' has been renamed to/replaced by 'stdenv.hostPlatform.system' ×1
  • warn stdenv.isDarwin is deprecated, use stdenv.hostPlatform.isDarwin instead ×1

24 failed ⚠ 1
failed attributes
status attribute duration
failed checks.x86_64-linux.nixos-eve
  • 'system' has been renamed to/replaced by 'stdenv.hostPlatform.system'
  • stdenv.isDarwin is deprecated, use stdenv.hostPlatform.isDarwin instead
15m 51s
nix-util-tests-run-without-new-syscalls: [ FAILED ] 5 tests, listed below: [ FAILED ] ParseURLSuccessCases/ParseURLSuccess.parsesAsExpected/5, where GetPara …
nix-util-tests-run-without-new-syscalls:
[  FAILED  ] 5 tests, listed below:
[  FAILED  ] ParseURLSuccessCases/ParseURLSuccess.parsesAsExpected/5, where GetParam() = 288-byte object <31-00 00-00 00-00 00-00 A8-86 95-55 55-55 00-00 B0-C7 B0-55 55-55 00-00 04-00 00-00 00-00 00-00 68-74 74-70 00-68 74-74 70-73 00-00 00-00 00-00 02-00 00-00 00-00 00-00 00-56 B0-55 55-55 00-00 ... 00-00 00-00 00-00 00-00 68-C8 B0-55 55-55 00-00 68-C8 B0-55 55-55 00-00 00-00 00-00 00-00 00-00 A0-C8 B0-55 55-55 00-00 00-00 00-00 00-00 00-00 00-65 6C-6C 6F-00 00-00 98-C8 B0-55 55-55 00-00>
[  FAILED  ] ParseURLSuccessCases/ParseURLSuccess.toStringRoundTrips/5, where GetParam() = 288-byte object <31-00 00-00 00-00 00-00 A8-86 95-55 55-55 00-00 B0-C7 B0-55 55-55 00-00 04-00 00-00 00-00 00-00 68-74 74-70 00-68 74-74 70-73 00-00 00-00 00-00 02-00 00-00 00-00 00-00 F0-2F B1-55 55-55 00-00 ... 00-00 00-00 00-00 00-00 68-C8 B0-55 55-55 00-00 68-C8 B0-55 55-55 00-00 00-00 00-00 00-00 00-00 A0-C8 B0-55 55-55 00-00 00-00 00-00 00-00 00-00 00-65 6C-6C 6F-00 00-00 98-C8 B0-55 55-55 00-00>
[  FAILED  ] ParseURLSuccessCases/ParseURLSuccess.makeSureFixGitURLDoesNotModify/5, where GetParam() = 288-byte object <31-00 00-00 00-00 00-00 A8-86 95-55 55-55 00-00 B0-C7 B0-55 55-55 00-00 04-00 00-00 00-00 00-00 68-74 74-70 00-68 74-74 70-73 00-00 00-00 00-00 02-00 00-00 00-00 00-00 40-55 B1-55 55-55 00-00 ... 00-00 00-00 00-00 00-00 68-C8 B0-55 55-55 00-00 68-C8 B0-55 55-55 00-00 00-00 00-00 00-00 00-00 A0-C8 B0-55 55-55 00-00 00-00 00-00 00-00 00-00 00-65 6C-6C 6F-00 00-00 98-C8 B0-55 55-55 00-00>
[  FAILED  ] parseURLRelative/ParseURLRelativeTestSuite.resolve/resolvesRelativePathIpv6AddressWithZoneId, where GetParam() = 336-byte object <3F-00 00-00 00-00 00-00 18-90 95-55 55-55 00-00 10-00 00-00 00-00 00-00 68-34 94-55 55-55 00-00 B0-F2 AF-55 55-55 00-00 04-00 00-00 00-00 00-00 68-74 74-70 00-00 00-00 00-00 00-00 00-00 00-00 ... A0-F3 AF-55 55-55 00-00 00-00 00-00 00-00 00-00 00-F3 AF-55 55-55 00-00 00-00 00-00 00-00 00-00 90-74 B1-55 55-55 00-00 29-00 00-00 00-00 00-00 29-00 00-00 00-00 00-00 F0-F3 AF-55 55-55 00-00>
[  FAILED  ] parseURLRelative/ParseURLRelativeTestSuite.resolve/absOverrideWithZoneId, where GetParam() = 336-byte object <21-00 00-00 00-00 00-00 60-8E 95-55 55-55 00-00 3C-00 00-00 00-00 00-00 88-8E 95-55 55-55 00-00 B0-F2 AF-55 55-55 00-00 05-00 00-00 00-00 00-00 68-74 74-70 73-00 00-00 00-00 00-00 00-00 00-00 ... A0-F3 AF-55 55-55 00-00 00-00 00-00 00-00 00-00 00-72 61-67 00-55 00-00 00-00 00-00 00-00 00-00 C0-3B B1-55 55-55 00-00 15-00 00-00 00-00 00-00 15-00 00-00 00-00 00-00 69-64 65-00 55-55 00-00>
 5 FAILED TESTS
  YOU HAVE 1 DISABLED TEST

nix-util-tests-run:
[  FAILED  ] 5 tests, listed below:
[  FAILED  ] ParseURLSuccessCases/ParseURLSuccess.parsesAsExpected/5, where GetParam() = 288-byte object <31-00 00-00 00-00 00-00 A8-86 95-55 55-55 00-00 B0-C7 B0-55 55-55 00-00 04-00 00-00 00-00 00-00 68-74 74-70 00-68 74-74 70-73 00-00 00-00 00-00 02-00 00-00 00-00 00-00 00-56 B0-55 55-55 00-00 ... 00-00 00-00 00-00 00-00 68-C8 B0-55 55-55 00-00 68-C8 B0-55 55-55 00-00 00-00 00-00 00-00 00-00 A0-C8 B0-55 55-55 00-00 00-00 00-00 00-00 00-00 00-65 6C-6C 6F-00 00-00 98-C8 B0-55 55-55 00-00>
[  FAILED  ] ParseURLSuccessCases/ParseURLSuccess.toStringRoundTrips/5, where GetParam() = 288-byte object <31-00 00-00 00-00 00-00 A8-86 95-55 55-55 00-00 B0-C7 B0-55 55-55 00-00 04-00 00-00 00-00 00-00 68-74 74-70 00-68 74-74 70-73 00-00 00-00 00-00 02-00 00-00 00-00 00-00 F0-2F B1-55 55-55 00-00 ... 00-00 00-00 00-00 00-00 68-C8 B0-55 55-55 00-00 68-C8 B0-55 55-55 00-00 00-00 00-00 00-00 00-00 A0-C8 B0-55 55-55 00-00 00-00 00-00 00-00 00-00 00-65 6C-6C 6F-00 00-00 98-C8 B0-55 55-55 00-00>
[  FAILED  ] ParseURLSuccessCases/ParseURLSuccess.makeSureFixGitURLDoesNotModify/5, where GetParam() = 288-byte object <31-00 00-00 00-00 00-00 A8-86 95-55 55-55 00-00 B0-C7 B0-55 55-55 00-00 04-00 00-00 00-00 00-00 68-74 74-70 00-68 74-74 70-73 00-00 00-00 00-00 02-00 00-00 00-00 00-00 40-55 B1-55 55-55 00-00 ... 00-00 00-00 00-00 00-00 68-C8 B0-55 55-55 00-00 68-C8 B0-55 55-55 00-00 00-00 00-00 00-00 00-00 A0-C8 B0-55 55-55 00-00 00-00 00-00 00-00 00-00 00-65 6C-6C 6F-00 00-00 98-C8 B0-55 55-55 00-00>
[  FAILED  ] parseURLRelative/ParseURLRelativeTestSuite.resolve/resolvesRelativePathIpv6AddressWithZoneId, where GetParam() = 336-byte object <3F-00 00-00 00-00 00-00 18-90 95-55 55-55 00-00 10-00 00-00 00-00 00-00 68-34 94-55 55-55 00-00 B0-F2 AF-55 55-55 00-00 04-00 00-00 00-00 00-00 68-74 74-70 00-00 00-00 00-00 00-00 00-00 00-00 ... A0-F3 AF-55 55-55 00-00 00-00 00-00 00-00 00-00 00-F3 AF-55 55-55 00-00 00-00 00-00 00-00 00-00 90-74 B1-55 55-55 00-00 29-00 00-00 00-00 00-00 29-00 00-00 00-00 00-00 F0-F3 AF-55 55-55 00-00>
[  FAILED  ] parseURLRelative/ParseURLRelativeTestSuite.resolve/absOverrideWithZoneId, where GetParam() = 336-byte object <21-00 00-00 00-00 00-00 60-8E 95-55 55-55 00-00 3C-00 00-00 00-00 00-00 88-8E 95-55 55-55 00-00 B0-F2 AF-55 55-55 00-00 05-00 00-00 00-00 00-00 68-74 74-70 73-00 00-00 00-00 00-00 00-00 00-00 ... A0-F3 AF-55 55-55 00-00 00-00 00-00 00-00 00-00 00-72 61-67 00-55 00-00 00-00 00-00 00-00 00-00 C0-3B B1-55 55-55 00-00 15-00 00-00 00-00 00-00 15-00 00-00 00-00 00-00 69-64 65-00 55-55 00-00>
 5 FAILED TESTS
  YOU HAVE 1 DISABLED TEST

nix-store-tests-run:
[----------] 5 tests from S3ToHttpsConversionErrors/S3ToHttpsConversionErrorTest (0 ms total)
[----------] Global test environment tear-down
[==========] 798 tests from 90 test suites ran. (1409 ms total)
[  PASSED  ] 797 tests.
[  FAILED  ] 1 test, listed below:
[  FAILED  ] StoreReferenceTest.PathInfo_ssh_unbracketed_ipv6_5_from_uri
 1 FAILED TEST
  YOU HAVE 1 DISABLED TEST
dependency failed checks.aarch64-darwin.darwin-evo
failed checks.aarch64-darwin.home-manager-common 7m 41s
nix-util-tests-run: [ FAILED ] ParseURLSuccessCases/ParseURLSuccess.parsesAsExpected/5, where GetParam() = 224-byte object <66-29 84-04 01-00 00-00 31-00 00-0 …
nix-util-tests-run:
[  FAILED  ] ParseURLSuccessCases/ParseURLSuccess.parsesAsExpected/5, where GetParam() = 224-byte object <66-29 84-04 01-00 00-00 31-00 00-00 00-00 00-00 68-74 74-70 00-00 00-00 10-1A C2-54 0C-00 00-00 26-00 00-00 00-00 00-04 02-00 00-00 00-00 00-00 10-CE 02-55 0C-00 00-00 21-00 00-00 00-00 00-00 ... 38-0F 00-55 0C-00 00-00 38-0F 00-55 0C-00 00-00 B8-40 04-55 0C-00 00-00 00-00 00-00 00-00 00-00 00-00 00-00 00-00 00-00 00-C7 C4-54 0C-00 00-00 30-83 C1-54 0C-00 00-00 30-83 C1-54 0C-00 00-00>
[  FAILED  ] ParseURLSuccessCases/ParseURLSuccess.toStringRoundTrips/5, where GetParam() = 224-byte object <66-29 84-04 01-00 00-00 31-00 00-00 00-00 00-00 68-74 74-70 00-00 00-00 00-00 00-00 00-00 00-00 00-00 00-00 00-00 00-04 02-00 00-00 00-00 00-00 10-D4 02-55 0C-00 00-00 21-00 00-00 00-00 00-00 ... 38-0F 00-55 0C-00 00-00 38-0F 00-55 0C-00 00-00 B8-40 04-55 0C-00 00-00 00-00 00-00 00-00 00-00 00-00 00-00 00-00 00-00 00-00 00-00 00-00 00-00 00-00 00-00 00-00 00-00 00-00 00-00 00-00 00-00>
[  FAILED  ] ParseURLSuccessCases/ParseURLSuccess.makeSureFixGitURLDoesNotModify/5, where GetParam() = 224-byte object <66-29 84-04 01-00 00-00 31-00 00-00 00-00 00-00 68-74 74-70 00-00 00-00 00-00 00-00 00-00 00-00 00-00 00-00 00-00 00-04 02-00 00-00 00-00 00-00 B0-D6 02-55 0C-00 00-00 21-00 00-00 00-00 00-00 ... 38-0F 00-55 0C-00 00-00 38-0F 00-55 0C-00 00-00 B8-40 04-55 0C-00 00-00 00-00 00-00 00-00 00-00 00-00 00-00 00-00 00-00 00-00 00-00 00-00 00-00 00-00 00-00 00-00 00-00 00-00 00-00 00-00 00-00>
[  FAILED  ] parseURLRelative/ParseURLRelativeTestSuite.resolve/resolvesRelativePathIpv6AddressWithZoneId, where GetParam() = 264-byte object <F8-2A 84-04 01-00 00-00 3F-00 00-00 00-00 00-00 38-2B 84-04 01-00 00-00 10-00 00-00 00-00 00-00 68-74 74-70 00-00 00-00 00-00 00-00 00-00 00-00 00-00 00-00 00-00 00-04 02-00 00-00 00-00 00-00 ... 00-00 00-00 00-00 00-00 00-00 00-00 00-00 00-00 00-00 00-00 00-00 00-00 00-00 00-00 00-00 00-00 00-00 00-00 00-00 00-00 50-D9 02-55 0C-00 00-00 29-00 00-00 00-00 00-00 30-00 00-00 00-00 00-80>
[  FAILED  ] parseURLRelative/ParseURLRelativeTestSuite.resolve/absOverrideWithZoneId, where GetParam() = 264-byte object <FB-2C 84-04 01-00 00-00 21-00 00-00 00-00 00-00 54-2D 84-04 01-00 00-00 3C-00 00-00 00-00 00-00 68-74 74-70 73-00 00-00 00-AD 8E-6B 01-00 00-00 00-00 00-00 00-00 00-05 02-00 00-00 00-00 00-00 ... 10-84 08-55 0C-00 00-00 01-00 00-00 00-00 00-00 00-00 00-00 00-00 00-00 00-00 00-00 00-00 00-00 00-00 00-00 00-00 00-00 61-62 73-4F 76-65 72-72 69-64 65-57 69-74 68-5A 6F-6E 65-49 64-00 00-15>
 5 FAILED TESTS
  YOU HAVE 1 DISABLED TEST


nix-store-tests-run:
[  SKIPPED ] HttpsBinaryCacheStoreMtlsTest.rejectsWithoutClientCert
[  SKIPPED ] HttpsBinaryCacheStoreMtlsTest.rejectsWrongClientCert
[  SKIPPED ] HttpsBinaryCacheStoreMtlsTest.doesNotSendCertOnRedirectToDifferentAuthority
[  FAILED  ] 1 test, listed below:
[  FAILED  ] StoreReferenceTest.PathInfo_ssh_unbracketed_ipv6_5_from_uri
 1 FAILED TEST
  YOU HAVE 1 DISABLED TEST
failed checks.aarch64-darwin.home-manager-macos 6m 44s
nix-util-tests-run: [ FAILED ] ParseURLSuccessCases/ParseURLSuccess.parsesAsExpected/5, where GetParam() = 224-byte object <66-29 CC-02 01-00 00-00 31-00 00-0 …
nix-util-tests-run:
[  FAILED  ] ParseURLSuccessCases/ParseURLSuccess.parsesAsExpected/5, where GetParam() = 224-byte object <66-29 CC-02 01-00 00-00 31-00 00-00 00-00 00-00 68-74 74-70 00-00 00-00 50-62 C1-5A 0B-00 00-00 26-00 00-00 00-00 00-04 02-00 00-00 00-00 00-00 A0-60 C1-5A 0B-00 00-00 21-00 00-00 00-00 00-00 ... B8-1C C4-5A 0B-00 00-00 B8-1C C4-5A 0B-00 00-00 B8-C0 C2-5A 0B-00 00-00 00-00 00-00 00-00 00-00 00-00 00-00 00-00 00-00 00-CA 04-5B 0B-00 00-00 70-C2 C4-5A 0B-00 00-00 70-C2 C4-5A 0B-00 00-00>
[  FAILED  ] ParseURLSuccessCases/ParseURLSuccess.toStringRoundTrips/5, where GetParam() = 224-byte object <66-29 CC-02 01-00 00-00 31-00 00-00 00-00 00-00 68-74 74-70 00-00 00-00 00-00 00-00 00-00 00-00 00-00 00-00 00-00 00-04 02-00 00-00 00-00 00-00 80-62 C1-5A 0B-00 00-00 21-00 00-00 00-00 00-00 ... 58-24 C4-5A 0B-00 00-00 58-24 C4-5A 0B-00 00-00 B8-C0 C2-5A 0B-00 00-00 00-00 00-00 00-00 00-00 00-00 00-00 00-00 00-00 00-00 00-00 00-00 00-00 00-00 00-00 00-00 00-00 00-00 00-00 00-00 00-00>
[  FAILED  ] ParseURLSuccessCases/ParseURLSuccess.makeSureFixGitURLDoesNotModify/5, where GetParam() = 224-byte object <66-29 CC-02 01-00 00-00 31-00 00-00 00-00 00-00 68-74 74-70 00-00 00-00 00-00 00-00 00-00 00-00 00-00 00-00 00-00 00-04 02-00 00-00 00-00 00-00 B0-62 C1-5A 0B-00 00-00 21-00 00-00 00-00 00-00 ... 18-2C C4-5A 0B-00 00-00 18-2C C4-5A 0B-00 00-00 B8-C0 C2-5A 0B-00 00-00 00-00 00-00 00-00 00-00 00-00 00-00 00-00 00-00 00-00 00-00 00-00 00-00 00-00 00-00 00-00 00-00 00-00 00-00 00-00 00-00>
[  FAILED  ] parseURLRelative/ParseURLRelativeTestSuite.resolve/resolvesRelativePathIpv6AddressWithZoneId, where GetParam() = 264-byte object <F8-2A CC-02 01-00 00-00 3F-00 00-00 00-00 00-00 38-2B CC-02 01-00 00-00 10-00 00-00 00-00 00-00 68-74 74-70 00-00 00-00 00-00 00-00 00-00 00-00 00-00 00-00 00-00 00-04 02-00 00-00 00-00 00-00 ... 00-00 00-00 00-00 00-00 00-00 00-00 00-00 00-00 00-00 00-00 00-00 00-00 00-00 00-00 00-00 00-00 00-00 00-00 00-00 00-00 80-71 C1-5A 0B-00 00-00 29-00 00-00 00-00 00-00 30-00 00-00 00-00 00-80>
[  FAILED  ] parseURLRelative/ParseURLRelativeTestSuite.resolve/absOverrideWithZoneId, where GetParam() = 264-byte object <FB-2C CC-02 01-00 00-00 21-00 00-00 00-00 00-00 54-2D CC-02 01-00 00-00 3C-00 00-00 00-00 00-00 68-74 74-70 73-00 00-00 00-AD 46-6D 01-00 00-00 00-00 00-00 00-00 00-05 02-00 00-00 00-00 00-00 ... 20-03 C8-5A 0B-00 00-00 01-00 00-00 00-00 00-00 00-00 00-00 00-00 00-00 00-00 00-00 00-00 00-00 00-00 00-00 00-00 00-00 61-62 73-4F 76-65 72-72 69-64 65-57 69-74 68-5A 6F-6E 65-49 64-00 00-15>
 5 FAILED TESTS
  YOU HAVE 1 DISABLED TEST


nix-store-tests-run:
[  SKIPPED ] HttpsBinaryCacheStoreMtlsTest.rejectsWithoutClientCert
[  SKIPPED ] HttpsBinaryCacheStoreMtlsTest.rejectsWrongClientCert
[  SKIPPED ] HttpsBinaryCacheStoreMtlsTest.doesNotSendCertOnRedirectToDifferentAuthority
[  FAILED  ] 1 test, listed below:
[  FAILED  ] StoreReferenceTest.PathInfo_ssh_unbracketed_ipv6_5_from_uri
 1 FAILED TEST
  YOU HAVE 1 DISABLED TEST
failed checks.aarch64-darwin.home-manager-utm-vm 6m 44s
nix-util-tests-run: [ FAILED ] ParseURLSuccessCases/ParseURLSuccess.parsesAsExpected/5, where GetParam() = 224-byte object <66-A9 50-04 01-00 00-00 31-00 00-0 …
nix-util-tests-run:
[  FAILED  ] ParseURLSuccessCases/ParseURLSuccess.parsesAsExpected/5, where GetParam() = 224-byte object <66-A9 50-04 01-00 00-00 31-00 00-00 00-00 00-00 68-74 74-70 00-00 00-00 80-62 01-53 08-00 00-00 26-00 00-00 00-00 00-04 02-00 00-00 00-00 00-00 D0-60 01-53 08-00 00-00 21-00 00-00 00-00 00-00 ... 58-9D C3-52 08-00 00-00 58-9D C3-52 08-00 00-00 B8-80 C2-52 08-00 00-00 00-00 00-00 00-00 00-00 00-00 00-00 00-00 00-00 00-05 C2-52 08-00 00-00 70-02 C4-52 08-00 00-00 70-02 C4-52 08-00 00-00>
[  FAILED  ] ParseURLSuccessCases/ParseURLSuccess.toStringRoundTrips/5, where GetParam() = 224-byte object <66-A9 50-04 01-00 00-00 31-00 00-00 00-00 00-00 68-74 74-70 00-00 00-00 00-00 00-00 00-00 00-00 00-00 00-00 00-00 00-04 02-00 00-00 00-00 00-00 B0-62 01-53 08-00 00-00 21-00 00-00 00-00 00-00 ... F8-A4 C3-52 08-00 00-00 F8-A4 C3-52 08-00 00-00 B8-80 C2-52 08-00 00-00 00-00 00-00 00-00 00-00 00-00 00-00 00-00 00-00 00-00 00-00 00-00 00-00 00-00 00-00 00-00 00-00 00-00 00-00 00-00 00-00>
[  FAILED  ] ParseURLSuccessCases/ParseURLSuccess.makeSureFixGitURLDoesNotModify/5, where GetParam() = 224-byte object <66-A9 50-04 01-00 00-00 31-00 00-00 00-00 00-00 68-74 74-70 00-00 00-00 00-00 00-00 00-00 00-00 00-00 00-00 00-00 00-04 02-00 00-00 00-00 00-00 E0-62 01-53 08-00 00-00 21-00 00-00 00-00 00-00 ... B8-AC C3-52 08-00 00-00 B8-AC C3-52 08-00 00-00 B8-80 C2-52 08-00 00-00 00-00 00-00 00-00 00-00 00-00 00-00 00-00 00-00 00-00 00-00 00-00 00-00 00-00 00-00 00-00 00-00 00-00 00-00 00-00 00-00>
[  FAILED  ] parseURLRelative/ParseURLRelativeTestSuite.resolve/resolvesRelativePathIpv6AddressWithZoneId, where GetParam() = 264-byte object <F8-AA 50-04 01-00 00-00 3F-00 00-00 00-00 00-00 38-AB 50-04 01-00 00-00 10-00 00-00 00-00 00-00 68-74 74-70 00-00 00-00 00-00 00-00 00-00 00-00 00-00 00-00 00-00 00-04 02-00 00-00 00-00 00-00 ... 00-00 00-00 00-00 00-00 00-00 00-00 00-00 00-00 00-00 00-00 00-00 00-00 00-00 00-00 00-00 00-00 00-00 00-00 00-00 00-00 B0-71 01-53 08-00 00-00 29-00 00-00 00-00 00-00 30-00 00-00 00-00 00-80>
[  FAILED  ] parseURLRelative/ParseURLRelativeTestSuite.resolve/absOverrideWithZoneId, where GetParam() = 264-byte object <FB-AC 50-04 01-00 00-00 21-00 00-00 00-00 00-00 54-AD 50-04 01-00 00-00 3C-00 00-00 00-00 00-00 68-74 74-70 73-00 00-00 00-2D C2-6B 01-00 00-00 00-00 00-00 00-00 00-05 02-00 00-00 00-00 00-00 ... 20-43 08-53 08-00 00-00 01-00 00-00 00-00 00-00 00-00 00-00 00-00 00-00 00-00 00-00 00-00 00-00 00-00 00-00 00-00 00-00 61-62 73-4F 76-65 72-72 69-64 65-57 69-74 68-5A 6F-6E 65-49 64-00 00-15>
 5 FAILED TESTS
  YOU HAVE 1 DISABLED TEST


nix-store-tests-run:
[  SKIPPED ] HttpsBinaryCacheStoreMtlsTest.rejectsWithoutClientCert
[  SKIPPED ] HttpsBinaryCacheStoreMtlsTest.rejectsWrongClientCert
[  SKIPPED ] HttpsBinaryCacheStoreMtlsTest.doesNotSendCertOnRedirectToDifferentAuthority
[  FAILED  ] 1 test, listed below:
[  FAILED  ] StoreReferenceTest.PathInfo_ssh_unbracketed_ipv6_5_from_uri
 1 FAILED TEST
  YOU HAVE 1 DISABLED TEST
failed checks.aarch64-darwin.package-app-windows-extension 42s
app-windows-1.16: no configure script, doing nothing jsconfig.json:8:15 - error TS6046: Argument for '--module' option must be: 'commonjs', 'es6', 'es2015', 'es …
app-windows-1.16:
no configure script, doing nothing
jsconfig.json:8:15 - error TS6046: Argument for '--module' option must be: 'commonjs', 'es6', 'es2015', 'es2020', 'es2022', 'esnext', 'node16', 'node18', 'node20', 'nodenext', 'preserve'.
8     "module": "none",
                ~~~~~~
Found 1 error in jsconfig.json:8
failed checks.aarch64-linux.home-manager-common 8m 10s
nix-util-tests-run-without-new-syscalls: [ FAILED ] 5 tests, listed below: [ FAILED ] ParseURLSuccessCases/ParseURLSuccess.parsesAsExpected/5, where GetPara …
nix-util-tests-run-without-new-syscalls:
[  FAILED  ] 5 tests, listed below:
[  FAILED  ] ParseURLSuccessCases/ParseURLSuccess.parsesAsExpected/5, where GetParam() = 288-byte object <31-00 00-00 00-00 00-00 10-BE E4-AA AA-AA 00-00 00-B1 FF-AA AA-AA 00-00 04-00 00-00 00-00 00-00 68-74 74-70 00-68 74-74 70-73 00-00 00-00 00-00 02-00 00-00 00-00 00-00 10-FC FE-AA AA-AA 00-00 ... 00-00 00-00 00-00 00-00 B8-B1 FF-AA AA-AA 00-00 B8-B1 FF-AA AA-AA 00-00 00-00 00-00 00-00 00-00 F0-B1 FF-AA AA-AA 00-00 00-00 00-00 00-00 00-00 00-65 6C-6C 6F-00 00-00 E8-B1 FF-AA AA-AA 00-00>
[  FAILED  ] ParseURLSuccessCases/ParseURLSuccess.toStringRoundTrips/5, where GetParam() = 288-byte object <31-00 00-00 00-00 00-00 10-BE E4-AA AA-AA 00-00 00-B1 FF-AA AA-AA 00-00 04-00 00-00 00-00 00-00 68-74 74-70 00-68 74-74 70-73 00-00 00-00 00-00 02-00 00-00 00-00 00-00 60-1B 00-AB AA-AA 00-00 ... 00-00 00-00 00-00 00-00 B8-B1 FF-AA AA-AA 00-00 B8-B1 FF-AA AA-AA 00-00 00-00 00-00 00-00 00-00 F0-B1 FF-AA AA-AA 00-00 00-00 00-00 00-00 00-00 00-65 6C-6C 6F-00 00-00 E8-B1 FF-AA AA-AA 00-00>
[  FAILED  ] ParseURLSuccessCases/ParseURLSuccess.makeSureFixGitURLDoesNotModify/5, where GetParam() = 288-byte object <31-00 00-00 00-00 00-00 10-BE E4-AA AA-AA 00-00 00-B1 FF-AA AA-AA 00-00 04-00 00-00 00-00 00-00 68-74 74-70 00-68 74-74 70-73 00-00 00-00 00-00 02-00 00-00 00-00 00-00 C0-3F 00-AB AA-AA 00-00 ... 00-00 00-00 00-00 00-00 B8-B1 FF-AA AA-AA 00-00 B8-B1 FF-AA AA-AA 00-00 00-00 00-00 00-00 00-00 F0-B1 FF-AA AA-AA 00-00 00-00 00-00 00-00 00-00 00-65 6C-6C 6F-00 00-00 E8-B1 FF-AA AA-AA 00-00>
[  FAILED  ] parseURLRelative/ParseURLRelativeTestSuite.resolve/resolvesRelativePathIpv6AddressWithZoneId, where GetParam() = 336-byte object <3F-00 00-00 00-00 00-00 D8-C9 E4-AA AA-AA 00-00 10-00 00-00 00-00 00-00 18-CA E4-AA AA-AA 00-00 E0-4D FF-AA AA-AA 00-00 04-00 00-00 00-00 00-00 68-74 74-70 00-00 00-00 01-00 00-00 00-00 00-00 ... D0-4E FF-AA AA-AA 00-00 00-00 00-00 00-00 00-00 00-4E FF-AA AA-AA 00-00 00-00 00-00 00-00 00-00 A0-5E 00-AB AA-AA 00-00 29-00 00-00 00-00 00-00 29-00 00-00 00-00 00-00 30-96 FE-AA AA-AA 00-00>
[  FAILED  ] parseURLRelative/ParseURLRelativeTestSuite.resolve/absOverrideWithZoneId, where GetParam() = 336-byte object <21-00 00-00 00-00 00-00 18-CC E4-AA AA-AA 00-00 3C-00 00-00 00-00 00-00 80-CC E4-AA AA-AA 00-00 E0-4D FF-AA AA-AA 00-00 05-00 00-00 00-00 00-00 68-74 74-70 73-00 00-00 01-00 00-00 00-00 00-00 ... D0-4E FF-AA AA-AA 00-00 00-00 00-00 00-00 00-00 00-72 61-67 00-AA 00-00 00-00 00-00 00-00 00-00 10-2A 00-AB AA-AA 00-00 15-00 00-00 00-00 00-00 15-00 00-00 00-00 00-00 69-64 65-00 AA-AA 00-00>
 5 FAILED TESTS
  YOU HAVE 1 DISABLED TEST

nix-util-tests-run:
[  FAILED  ] 5 tests, listed below:
[  FAILED  ] ParseURLSuccessCases/ParseURLSuccess.parsesAsExpected/5, where GetParam() = 288-byte object <31-00 00-00 00-00 00-00 10-BE E4-AA AA-AA 00-00 00-B1 FF-AA AA-AA 00-00 04-00 00-00 00-00 00-00 68-74 74-70 00-68 74-74 70-73 00-00 00-00 00-00 02-00 00-00 00-00 00-00 10-FC FE-AA AA-AA 00-00 ... 00-00 00-00 00-00 00-00 B8-B1 FF-AA AA-AA 00-00 B8-B1 FF-AA AA-AA 00-00 00-00 00-00 00-00 00-00 F0-B1 FF-AA AA-AA 00-00 00-00 00-00 00-00 00-00 00-65 6C-6C 6F-00 00-00 E8-B1 FF-AA AA-AA 00-00>
[  FAILED  ] ParseURLSuccessCases/ParseURLSuccess.toStringRoundTrips/5, where GetParam() = 288-byte object <31-00 00-00 00-00 00-00 10-BE E4-AA AA-AA 00-00 00-B1 FF-AA AA-AA 00-00 04-00 00-00 00-00 00-00 68-74 74-70 00-68 74-74 70-73 00-00 00-00 00-00 02-00 00-00 00-00 00-00 60-1B 00-AB AA-AA 00-00 ... 00-00 00-00 00-00 00-00 B8-B1 FF-AA AA-AA 00-00 B8-B1 FF-AA AA-AA 00-00 00-00 00-00 00-00 00-00 F0-B1 FF-AA AA-AA 00-00 00-00 00-00 00-00 00-00 00-65 6C-6C 6F-00 00-00 E8-B1 FF-AA AA-AA 00-00>
[  FAILED  ] ParseURLSuccessCases/ParseURLSuccess.makeSureFixGitURLDoesNotModify/5, where GetParam() = 288-byte object <31-00 00-00 00-00 00-00 10-BE E4-AA AA-AA 00-00 00-B1 FF-AA AA-AA 00-00 04-00 00-00 00-00 00-00 68-74 74-70 00-68 74-74 70-73 00-00 00-00 00-00 02-00 00-00 00-00 00-00 C0-3F 00-AB AA-AA 00-00 ... 00-00 00-00 00-00 00-00 B8-B1 FF-AA AA-AA 00-00 B8-B1 FF-AA AA-AA 00-00 00-00 00-00 00-00 00-00 F0-B1 FF-AA AA-AA 00-00 00-00 00-00 00-00 00-00 00-65 6C-6C 6F-00 00-00 E8-B1 FF-AA AA-AA 00-00>
[  FAILED  ] parseURLRelative/ParseURLRelativeTestSuite.resolve/resolvesRelativePathIpv6AddressWithZoneId, where GetParam() = 336-byte object <3F-00 00-00 00-00 00-00 D8-C9 E4-AA AA-AA 00-00 10-00 00-00 00-00 00-00 18-CA E4-AA AA-AA 00-00 E0-4D FF-AA AA-AA 00-00 04-00 00-00 00-00 00-00 68-74 74-70 00-00 00-00 01-00 00-00 00-00 00-00 ... D0-4E FF-AA AA-AA 00-00 00-00 00-00 00-00 00-00 00-4E FF-AA AA-AA 00-00 00-00 00-00 00-00 00-00 A0-5E 00-AB AA-AA 00-00 29-00 00-00 00-00 00-00 29-00 00-00 00-00 00-00 30-96 FE-AA AA-AA 00-00>
[  FAILED  ] parseURLRelative/ParseURLRelativeTestSuite.resolve/absOverrideWithZoneId, where GetParam() = 336-byte object <21-00 00-00 00-00 00-00 18-CC E4-AA AA-AA 00-00 3C-00 00-00 00-00 00-00 80-CC E4-AA AA-AA 00-00 E0-4D FF-AA AA-AA 00-00 05-00 00-00 00-00 00-00 68-74 74-70 73-00 00-00 01-00 00-00 00-00 00-00 ... D0-4E FF-AA AA-AA 00-00 00-00 00-00 00-00 00-00 00-72 61-67 00-AA 00-00 00-00 00-00 00-00 00-00 10-2A 00-AB AA-AA 00-00 15-00 00-00 00-00 00-00 15-00 00-00 00-00 00-00 69-64 65-00 AA-AA 00-00>
 5 FAILED TESTS
  YOU HAVE 1 DISABLED TEST

nix-store-tests-run:
[----------] 5 tests from S3ToHttpsConversionErrors/S3ToHttpsConversionErrorTest (0 ms total)
[----------] Global test environment tear-down
[==========] 798 tests from 90 test suites ran. (1710 ms total)
[  PASSED  ] 797 tests.
[  FAILED  ] 1 test, listed below:
[  FAILED  ] StoreReferenceTest.PathInfo_ssh_unbracketed_ipv6_5_from_uri
 1 FAILED TEST
  YOU HAVE 1 DISABLED TEST
dependency failed checks.aarch64-linux.home-manager-utm-vm
failed checks.aarch64-linux.nixos-blob64 8m 26s
nix-util-tests-run-without-new-syscalls: [ FAILED ] 5 tests, listed below: [ FAILED ] ParseURLSuccessCases/ParseURLSuccess.parsesAsExpected/5, where GetPara …
nix-util-tests-run-without-new-syscalls:
[  FAILED  ] 5 tests, listed below:
[  FAILED  ] ParseURLSuccessCases/ParseURLSuccess.parsesAsExpected/5, where GetParam() = 288-byte object <31-00 00-00 00-00 00-00 10-BE E4-AA AA-AA 00-00 00-B1 FF-AA AA-AA 00-00 04-00 00-00 00-00 00-00 68-74 74-70 00-68 74-74 70-73 00-00 00-00 00-00 02-00 00-00 00-00 00-00 10-FC FE-AA AA-AA 00-00 ... 00-00 00-00 00-00 00-00 B8-B1 FF-AA AA-AA 00-00 B8-B1 FF-AA AA-AA 00-00 00-00 00-00 00-00 00-00 F0-B1 FF-AA AA-AA 00-00 00-00 00-00 00-00 00-00 00-65 6C-6C 6F-00 00-00 E8-B1 FF-AA AA-AA 00-00>
[  FAILED  ] ParseURLSuccessCases/ParseURLSuccess.toStringRoundTrips/5, where GetParam() = 288-byte object <31-00 00-00 00-00 00-00 10-BE E4-AA AA-AA 00-00 00-B1 FF-AA AA-AA 00-00 04-00 00-00 00-00 00-00 68-74 74-70 00-68 74-74 70-73 00-00 00-00 00-00 02-00 00-00 00-00 00-00 60-1B 00-AB AA-AA 00-00 ... 00-00 00-00 00-00 00-00 B8-B1 FF-AA AA-AA 00-00 B8-B1 FF-AA AA-AA 00-00 00-00 00-00 00-00 00-00 F0-B1 FF-AA AA-AA 00-00 00-00 00-00 00-00 00-00 00-65 6C-6C 6F-00 00-00 E8-B1 FF-AA AA-AA 00-00>
[  FAILED  ] ParseURLSuccessCases/ParseURLSuccess.makeSureFixGitURLDoesNotModify/5, where GetParam() = 288-byte object <31-00 00-00 00-00 00-00 10-BE E4-AA AA-AA 00-00 00-B1 FF-AA AA-AA 00-00 04-00 00-00 00-00 00-00 68-74 74-70 00-68 74-74 70-73 00-00 00-00 00-00 02-00 00-00 00-00 00-00 C0-3F 00-AB AA-AA 00-00 ... 00-00 00-00 00-00 00-00 B8-B1 FF-AA AA-AA 00-00 B8-B1 FF-AA AA-AA 00-00 00-00 00-00 00-00 00-00 F0-B1 FF-AA AA-AA 00-00 00-00 00-00 00-00 00-00 00-65 6C-6C 6F-00 00-00 E8-B1 FF-AA AA-AA 00-00>
[  FAILED  ] parseURLRelative/ParseURLRelativeTestSuite.resolve/resolvesRelativePathIpv6AddressWithZoneId, where GetParam() = 336-byte object <3F-00 00-00 00-00 00-00 D8-C9 E4-AA AA-AA 00-00 10-00 00-00 00-00 00-00 18-CA E4-AA AA-AA 00-00 E0-4D FF-AA AA-AA 00-00 04-00 00-00 00-00 00-00 68-74 74-70 00-00 00-00 01-00 00-00 00-00 00-00 ... D0-4E FF-AA AA-AA 00-00 00-00 00-00 00-00 00-00 00-4E FF-AA AA-AA 00-00 00-00 00-00 00-00 00-00 A0-5E 00-AB AA-AA 00-00 29-00 00-00 00-00 00-00 29-00 00-00 00-00 00-00 30-96 FE-AA AA-AA 00-00>
[  FAILED  ] parseURLRelative/ParseURLRelativeTestSuite.resolve/absOverrideWithZoneId, where GetParam() = 336-byte object <21-00 00-00 00-00 00-00 18-CC E4-AA AA-AA 00-00 3C-00 00-00 00-00 00-00 80-CC E4-AA AA-AA 00-00 E0-4D FF-AA AA-AA 00-00 05-00 00-00 00-00 00-00 68-74 74-70 73-00 00-00 01-00 00-00 00-00 00-00 ... D0-4E FF-AA AA-AA 00-00 00-00 00-00 00-00 00-00 00-72 61-67 00-AA 00-00 00-00 00-00 00-00 00-00 10-2A 00-AB AA-AA 00-00 15-00 00-00 00-00 00-00 15-00 00-00 00-00 00-00 69-64 65-00 AA-AA 00-00>
 5 FAILED TESTS
  YOU HAVE 1 DISABLED TEST

nix-util-tests-run:
[  FAILED  ] 5 tests, listed below:
[  FAILED  ] ParseURLSuccessCases/ParseURLSuccess.parsesAsExpected/5, where GetParam() = 288-byte object <31-00 00-00 00-00 00-00 10-BE E4-AA AA-AA 00-00 00-B1 FF-AA AA-AA 00-00 04-00 00-00 00-00 00-00 68-74 74-70 00-68 74-74 70-73 00-00 00-00 00-00 02-00 00-00 00-00 00-00 10-FC FE-AA AA-AA 00-00 ... 00-00 00-00 00-00 00-00 B8-B1 FF-AA AA-AA 00-00 B8-B1 FF-AA AA-AA 00-00 00-00 00-00 00-00 00-00 F0-B1 FF-AA AA-AA 00-00 00-00 00-00 00-00 00-00 00-65 6C-6C 6F-00 00-00 E8-B1 FF-AA AA-AA 00-00>
[  FAILED  ] ParseURLSuccessCases/ParseURLSuccess.toStringRoundTrips/5, where GetParam() = 288-byte object <31-00 00-00 00-00 00-00 10-BE E4-AA AA-AA 00-00 00-B1 FF-AA AA-AA 00-00 04-00 00-00 00-00 00-00 68-74 74-70 00-68 74-74 70-73 00-00 00-00 00-00 02-00 00-00 00-00 00-00 60-1B 00-AB AA-AA 00-00 ... 00-00 00-00 00-00 00-00 B8-B1 FF-AA AA-AA 00-00 B8-B1 FF-AA AA-AA 00-00 00-00 00-00 00-00 00-00 F0-B1 FF-AA AA-AA 00-00 00-00 00-00 00-00 00-00 00-65 6C-6C 6F-00 00-00 E8-B1 FF-AA AA-AA 00-00>
[  FAILED  ] ParseURLSuccessCases/ParseURLSuccess.makeSureFixGitURLDoesNotModify/5, where GetParam() = 288-byte object <31-00 00-00 00-00 00-00 10-BE E4-AA AA-AA 00-00 00-B1 FF-AA AA-AA 00-00 04-00 00-00 00-00 00-00 68-74 74-70 00-68 74-74 70-73 00-00 00-00 00-00 02-00 00-00 00-00 00-00 C0-3F 00-AB AA-AA 00-00 ... 00-00 00-00 00-00 00-00 B8-B1 FF-AA AA-AA 00-00 B8-B1 FF-AA AA-AA 00-00 00-00 00-00 00-00 00-00 F0-B1 FF-AA AA-AA 00-00 00-00 00-00 00-00 00-00 00-65 6C-6C 6F-00 00-00 E8-B1 FF-AA AA-AA 00-00>
[  FAILED  ] parseURLRelative/ParseURLRelativeTestSuite.resolve/resolvesRelativePathIpv6AddressWithZoneId, where GetParam() = 336-byte object <3F-00 00-00 00-00 00-00 D8-C9 E4-AA AA-AA 00-00 10-00 00-00 00-00 00-00 18-CA E4-AA AA-AA 00-00 E0-4D FF-AA AA-AA 00-00 04-00 00-00 00-00 00-00 68-74 74-70 00-00 00-00 01-00 00-00 00-00 00-00 ... D0-4E FF-AA AA-AA 00-00 00-00 00-00 00-00 00-00 00-4E FF-AA AA-AA 00-00 00-00 00-00 00-00 00-00 A0-5E 00-AB AA-AA 00-00 29-00 00-00 00-00 00-00 29-00 00-00 00-00 00-00 30-96 FE-AA AA-AA 00-00>
[  FAILED  ] parseURLRelative/ParseURLRelativeTestSuite.resolve/absOverrideWithZoneId, where GetParam() = 336-byte object <21-00 00-00 00-00 00-00 18-CC E4-AA AA-AA 00-00 3C-00 00-00 00-00 00-00 80-CC E4-AA AA-AA 00-00 E0-4D FF-AA AA-AA 00-00 05-00 00-00 00-00 00-00 68-74 74-70 73-00 00-00 01-00 00-00 00-00 00-00 ... D0-4E FF-AA AA-AA 00-00 00-00 00-00 00-00 00-00 00-72 61-67 00-AA 00-00 00-00 00-00 00-00 00-00 10-2A 00-AB AA-AA 00-00 15-00 00-00 00-00 00-00 15-00 00-00 00-00 00-00 69-64 65-00 AA-AA 00-00>
 5 FAILED TESTS
  YOU HAVE 1 DISABLED TEST

nix-store-tests-run:
[----------] 5 tests from S3ToHttpsConversionErrors/S3ToHttpsConversionErrorTest (0 ms total)
[----------] Global test environment tear-down
[==========] 798 tests from 90 test suites ran. (1730 ms total)
[  PASSED  ] 797 tests.
[  FAILED  ] 1 test, listed below:
[  FAILED  ] StoreReferenceTest.PathInfo_ssh_unbracketed_ipv6_5_from_uri
 1 FAILED TEST
  YOU HAVE 1 DISABLED TEST
failed checks.aarch64-linux.package-app-windows-extension 3s
app-windows-1.16: tribuchet: building on eliza no configure script, doing nothing jsconfig.json(8,15): error TS6046: Argument for '--module' option must be: 'co …
app-windows-1.16:
tribuchet: building on eliza
no configure script, doing nothing
jsconfig.json(8,15): error TS6046: Argument for '--module' option must be: 'commonjs', 'es6', 'es2015', 'es2020', 'es2022', 'esnext', 'node16', 'node18', 'node20', 'nodenext', 'preserve'.
failed checks.x86_64-linux.home-manager-bernie 8m 44s
nix-util-tests-run-without-new-syscalls: [ FAILED ] 5 tests, listed below: [ FAILED ] ParseURLSuccessCases/ParseURLSuccess.parsesAsExpected/5, where GetPara …
nix-util-tests-run-without-new-syscalls:
[  FAILED  ] 5 tests, listed below:
[  FAILED  ] ParseURLSuccessCases/ParseURLSuccess.parsesAsExpected/5, where GetParam() = 288-byte object <31-00 00-00 00-00 00-00 A8-86 95-55 55-55 00-00 B0-C7 B0-55 55-55 00-00 04-00 00-00 00-00 00-00 68-74 74-70 00-68 74-74 70-73 00-00 00-00 00-00 02-00 00-00 00-00 00-00 00-56 B0-55 55-55 00-00 ... 00-00 00-00 00-00 00-00 68-C8 B0-55 55-55 00-00 68-C8 B0-55 55-55 00-00 00-00 00-00 00-00 00-00 A0-C8 B0-55 55-55 00-00 00-00 00-00 00-00 00-00 00-65 6C-6C 6F-00 00-00 98-C8 B0-55 55-55 00-00>
[  FAILED  ] ParseURLSuccessCases/ParseURLSuccess.toStringRoundTrips/5, where GetParam() = 288-byte object <31-00 00-00 00-00 00-00 A8-86 95-55 55-55 00-00 B0-C7 B0-55 55-55 00-00 04-00 00-00 00-00 00-00 68-74 74-70 00-68 74-74 70-73 00-00 00-00 00-00 02-00 00-00 00-00 00-00 F0-2F B1-55 55-55 00-00 ... 00-00 00-00 00-00 00-00 68-C8 B0-55 55-55 00-00 68-C8 B0-55 55-55 00-00 00-00 00-00 00-00 00-00 A0-C8 B0-55 55-55 00-00 00-00 00-00 00-00 00-00 00-65 6C-6C 6F-00 00-00 98-C8 B0-55 55-55 00-00>
[  FAILED  ] ParseURLSuccessCases/ParseURLSuccess.makeSureFixGitURLDoesNotModify/5, where GetParam() = 288-byte object <31-00 00-00 00-00 00-00 A8-86 95-55 55-55 00-00 B0-C7 B0-55 55-55 00-00 04-00 00-00 00-00 00-00 68-74 74-70 00-68 74-74 70-73 00-00 00-00 00-00 02-00 00-00 00-00 00-00 40-55 B1-55 55-55 00-00 ... 00-00 00-00 00-00 00-00 68-C8 B0-55 55-55 00-00 68-C8 B0-55 55-55 00-00 00-00 00-00 00-00 00-00 A0-C8 B0-55 55-55 00-00 00-00 00-00 00-00 00-00 00-65 6C-6C 6F-00 00-00 98-C8 B0-55 55-55 00-00>
[  FAILED  ] parseURLRelative/ParseURLRelativeTestSuite.resolve/resolvesRelativePathIpv6AddressWithZoneId, where GetParam() = 336-byte object <3F-00 00-00 00-00 00-00 18-90 95-55 55-55 00-00 10-00 00-00 00-00 00-00 68-34 94-55 55-55 00-00 B0-F2 AF-55 55-55 00-00 04-00 00-00 00-00 00-00 68-74 74-70 00-00 00-00 00-00 00-00 00-00 00-00 ... A0-F3 AF-55 55-55 00-00 00-00 00-00 00-00 00-00 00-F3 AF-55 55-55 00-00 00-00 00-00 00-00 00-00 90-74 B1-55 55-55 00-00 29-00 00-00 00-00 00-00 29-00 00-00 00-00 00-00 F0-F3 AF-55 55-55 00-00>
[  FAILED  ] parseURLRelative/ParseURLRelativeTestSuite.resolve/absOverrideWithZoneId, where GetParam() = 336-byte object <21-00 00-00 00-00 00-00 60-8E 95-55 55-55 00-00 3C-00 00-00 00-00 00-00 88-8E 95-55 55-55 00-00 B0-F2 AF-55 55-55 00-00 05-00 00-00 00-00 00-00 68-74 74-70 73-00 00-00 00-00 00-00 00-00 00-00 ... A0-F3 AF-55 55-55 00-00 00-00 00-00 00-00 00-00 00-72 61-67 00-55 00-00 00-00 00-00 00-00 00-00 C0-3B B1-55 55-55 00-00 15-00 00-00 00-00 00-00 15-00 00-00 00-00 00-00 69-64 65-00 55-55 00-00>
 5 FAILED TESTS
  YOU HAVE 1 DISABLED TEST

nix-util-tests-run:
[  FAILED  ] 5 tests, listed below:
[  FAILED  ] ParseURLSuccessCases/ParseURLSuccess.parsesAsExpected/5, where GetParam() = 288-byte object <31-00 00-00 00-00 00-00 A8-86 95-55 55-55 00-00 B0-C7 B0-55 55-55 00-00 04-00 00-00 00-00 00-00 68-74 74-70 00-68 74-74 70-73 00-00 00-00 00-00 02-00 00-00 00-00 00-00 00-56 B0-55 55-55 00-00 ... 00-00 00-00 00-00 00-00 68-C8 B0-55 55-55 00-00 68-C8 B0-55 55-55 00-00 00-00 00-00 00-00 00-00 A0-C8 B0-55 55-55 00-00 00-00 00-00 00-00 00-00 00-65 6C-6C 6F-00 00-00 98-C8 B0-55 55-55 00-00>
[  FAILED  ] ParseURLSuccessCases/ParseURLSuccess.toStringRoundTrips/5, where GetParam() = 288-byte object <31-00 00-00 00-00 00-00 A8-86 95-55 55-55 00-00 B0-C7 B0-55 55-55 00-00 04-00 00-00 00-00 00-00 68-74 74-70 00-68 74-74 70-73 00-00 00-00 00-00 02-00 00-00 00-00 00-00 F0-2F B1-55 55-55 00-00 ... 00-00 00-00 00-00 00-00 68-C8 B0-55 55-55 00-00 68-C8 B0-55 55-55 00-00 00-00 00-00 00-00 00-00 A0-C8 B0-55 55-55 00-00 00-00 00-00 00-00 00-00 00-65 6C-6C 6F-00 00-00 98-C8 B0-55 55-55 00-00>
[  FAILED  ] ParseURLSuccessCases/ParseURLSuccess.makeSureFixGitURLDoesNotModify/5, where GetParam() = 288-byte object <31-00 00-00 00-00 00-00 A8-86 95-55 55-55 00-00 B0-C7 B0-55 55-55 00-00 04-00 00-00 00-00 00-00 68-74 74-70 00-68 74-74 70-73 00-00 00-00 00-00 02-00 00-00 00-00 00-00 40-55 B1-55 55-55 00-00 ... 00-00 00-00 00-00 00-00 68-C8 B0-55 55-55 00-00 68-C8 B0-55 55-55 00-00 00-00 00-00 00-00 00-00 A0-C8 B0-55 55-55 00-00 00-00 00-00 00-00 00-00 00-65 6C-6C 6F-00 00-00 98-C8 B0-55 55-55 00-00>
[  FAILED  ] parseURLRelative/ParseURLRelativeTestSuite.resolve/resolvesRelativePathIpv6AddressWithZoneId, where GetParam() = 336-byte object <3F-00 00-00 00-00 00-00 18-90 95-55 55-55 00-00 10-00 00-00 00-00 00-00 68-34 94-55 55-55 00-00 B0-F2 AF-55 55-55 00-00 04-00 00-00 00-00 00-00 68-74 74-70 00-00 00-00 00-00 00-00 00-00 00-00 ... A0-F3 AF-55 55-55 00-00 00-00 00-00 00-00 00-00 00-F3 AF-55 55-55 00-00 00-00 00-00 00-00 00-00 90-74 B1-55 55-55 00-00 29-00 00-00 00-00 00-00 29-00 00-00 00-00 00-00 F0-F3 AF-55 55-55 00-00>
[  FAILED  ] parseURLRelative/ParseURLRelativeTestSuite.resolve/absOverrideWithZoneId, where GetParam() = 336-byte object <21-00 00-00 00-00 00-00 60-8E 95-55 55-55 00-00 3C-00 00-00 00-00 00-00 88-8E 95-55 55-55 00-00 B0-F2 AF-55 55-55 00-00 05-00 00-00 00-00 00-00 68-74 74-70 73-00 00-00 00-00 00-00 00-00 00-00 ... A0-F3 AF-55 55-55 00-00 00-00 00-00 00-00 00-00 00-72 61-67 00-55 00-00 00-00 00-00 00-00 00-00 C0-3B B1-55 55-55 00-00 15-00 00-00 00-00 00-00 15-00 00-00 00-00 00-00 69-64 65-00 55-55 00-00>
 5 FAILED TESTS
  YOU HAVE 1 DISABLED TEST

nix-store-tests-run:
[----------] 5 tests from S3ToHttpsConversionErrors/S3ToHttpsConversionErrorTest (0 ms total)
[----------] Global test environment tear-down
[==========] 798 tests from 90 test suites ran. (1453 ms total)
[  PASSED  ] 797 tests.
[  FAILED  ] 1 test, listed below:
[  FAILED  ] StoreReferenceTest.PathInfo_ssh_unbracketed_ipv6_5_from_uri
 1 FAILED TEST
  YOU HAVE 1 DISABLED TEST
failed checks.x86_64-linux.home-manager-coder 8m 40s
nix-util-tests-run-without-new-syscalls: [ FAILED ] 5 tests, listed below: [ FAILED ] ParseURLSuccessCases/ParseURLSuccess.parsesAsExpected/5, where GetPara …
nix-util-tests-run-without-new-syscalls:
[  FAILED  ] 5 tests, listed below:
[  FAILED  ] ParseURLSuccessCases/ParseURLSuccess.parsesAsExpected/5, where GetParam() = 288-byte object <31-00 00-00 00-00 00-00 A8-86 95-55 55-55 00-00 B0-C7 B0-55 55-55 00-00 04-00 00-00 00-00 00-00 68-74 74-70 00-68 74-74 70-73 00-00 00-00 00-00 02-00 00-00 00-00 00-00 00-56 B0-55 55-55 00-00 ... 00-00 00-00 00-00 00-00 68-C8 B0-55 55-55 00-00 68-C8 B0-55 55-55 00-00 00-00 00-00 00-00 00-00 A0-C8 B0-55 55-55 00-00 00-00 00-00 00-00 00-00 00-65 6C-6C 6F-00 00-00 98-C8 B0-55 55-55 00-00>
[  FAILED  ] ParseURLSuccessCases/ParseURLSuccess.toStringRoundTrips/5, where GetParam() = 288-byte object <31-00 00-00 00-00 00-00 A8-86 95-55 55-55 00-00 B0-C7 B0-55 55-55 00-00 04-00 00-00 00-00 00-00 68-74 74-70 00-68 74-74 70-73 00-00 00-00 00-00 02-00 00-00 00-00 00-00 F0-2F B1-55 55-55 00-00 ... 00-00 00-00 00-00 00-00 68-C8 B0-55 55-55 00-00 68-C8 B0-55 55-55 00-00 00-00 00-00 00-00 00-00 A0-C8 B0-55 55-55 00-00 00-00 00-00 00-00 00-00 00-65 6C-6C 6F-00 00-00 98-C8 B0-55 55-55 00-00>
[  FAILED  ] ParseURLSuccessCases/ParseURLSuccess.makeSureFixGitURLDoesNotModify/5, where GetParam() = 288-byte object <31-00 00-00 00-00 00-00 A8-86 95-55 55-55 00-00 B0-C7 B0-55 55-55 00-00 04-00 00-00 00-00 00-00 68-74 74-70 00-68 74-74 70-73 00-00 00-00 00-00 02-00 00-00 00-00 00-00 40-55 B1-55 55-55 00-00 ... 00-00 00-00 00-00 00-00 68-C8 B0-55 55-55 00-00 68-C8 B0-55 55-55 00-00 00-00 00-00 00-00 00-00 A0-C8 B0-55 55-55 00-00 00-00 00-00 00-00 00-00 00-65 6C-6C 6F-00 00-00 98-C8 B0-55 55-55 00-00>
[  FAILED  ] parseURLRelative/ParseURLRelativeTestSuite.resolve/resolvesRelativePathIpv6AddressWithZoneId, where GetParam() = 336-byte object <3F-00 00-00 00-00 00-00 18-90 95-55 55-55 00-00 10-00 00-00 00-00 00-00 68-34 94-55 55-55 00-00 B0-F2 AF-55 55-55 00-00 04-00 00-00 00-00 00-00 68-74 74-70 00-00 00-00 00-00 00-00 00-00 00-00 ... A0-F3 AF-55 55-55 00-00 00-00 00-00 00-00 00-00 00-F3 AF-55 55-55 00-00 00-00 00-00 00-00 00-00 90-74 B1-55 55-55 00-00 29-00 00-00 00-00 00-00 29-00 00-00 00-00 00-00 F0-F3 AF-55 55-55 00-00>
[  FAILED  ] parseURLRelative/ParseURLRelativeTestSuite.resolve/absOverrideWithZoneId, where GetParam() = 336-byte object <21-00 00-00 00-00 00-00 60-8E 95-55 55-55 00-00 3C-00 00-00 00-00 00-00 88-8E 95-55 55-55 00-00 B0-F2 AF-55 55-55 00-00 05-00 00-00 00-00 00-00 68-74 74-70 73-00 00-00 00-00 00-00 00-00 00-00 ... A0-F3 AF-55 55-55 00-00 00-00 00-00 00-00 00-00 00-72 61-67 00-55 00-00 00-00 00-00 00-00 00-00 C0-3B B1-55 55-55 00-00 15-00 00-00 00-00 00-00 15-00 00-00 00-00 00-00 69-64 65-00 55-55 00-00>
 5 FAILED TESTS
  YOU HAVE 1 DISABLED TEST

nix-util-tests-run:
[  FAILED  ] 5 tests, listed below:
[  FAILED  ] ParseURLSuccessCases/ParseURLSuccess.parsesAsExpected/5, where GetParam() = 288-byte object <31-00 00-00 00-00 00-00 A8-86 95-55 55-55 00-00 B0-C7 B0-55 55-55 00-00 04-00 00-00 00-00 00-00 68-74 74-70 00-68 74-74 70-73 00-00 00-00 00-00 02-00 00-00 00-00 00-00 00-56 B0-55 55-55 00-00 ... 00-00 00-00 00-00 00-00 68-C8 B0-55 55-55 00-00 68-C8 B0-55 55-55 00-00 00-00 00-00 00-00 00-00 A0-C8 B0-55 55-55 00-00 00-00 00-00 00-00 00-00 00-65 6C-6C 6F-00 00-00 98-C8 B0-55 55-55 00-00>
[  FAILED  ] ParseURLSuccessCases/ParseURLSuccess.toStringRoundTrips/5, where GetParam() = 288-byte object <31-00 00-00 00-00 00-00 A8-86 95-55 55-55 00-00 B0-C7 B0-55 55-55 00-00 04-00 00-00 00-00 00-00 68-74 74-70 00-68 74-74 70-73 00-00 00-00 00-00 02-00 00-00 00-00 00-00 F0-2F B1-55 55-55 00-00 ... 00-00 00-00 00-00 00-00 68-C8 B0-55 55-55 00-00 68-C8 B0-55 55-55 00-00 00-00 00-00 00-00 00-00 A0-C8 B0-55 55-55 00-00 00-00 00-00 00-00 00-00 00-65 6C-6C 6F-00 00-00 98-C8 B0-55 55-55 00-00>
[  FAILED  ] ParseURLSuccessCases/ParseURLSuccess.makeSureFixGitURLDoesNotModify/5, where GetParam() = 288-byte object <31-00 00-00 00-00 00-00 A8-86 95-55 55-55 00-00 B0-C7 B0-55 55-55 00-00 04-00 00-00 00-00 00-00 68-74 74-70 00-68 74-74 70-73 00-00 00-00 00-00 02-00 00-00 00-00 00-00 40-55 B1-55 55-55 00-00 ... 00-00 00-00 00-00 00-00 68-C8 B0-55 55-55 00-00 68-C8 B0-55 55-55 00-00 00-00 00-00 00-00 00-00 A0-C8 B0-55 55-55 00-00 00-00 00-00 00-00 00-00 00-65 6C-6C 6F-00 00-00 98-C8 B0-55 55-55 00-00>
[  FAILED  ] parseURLRelative/ParseURLRelativeTestSuite.resolve/resolvesRelativePathIpv6AddressWithZoneId, where GetParam() = 336-byte object <3F-00 00-00 00-00 00-00 18-90 95-55 55-55 00-00 10-00 00-00 00-00 00-00 68-34 94-55 55-55 00-00 B0-F2 AF-55 55-55 00-00 04-00 00-00 00-00 00-00 68-74 74-70 00-00 00-00 00-00 00-00 00-00 00-00 ... A0-F3 AF-55 55-55 00-00 00-00 00-00 00-00 00-00 00-F3 AF-55 55-55 00-00 00-00 00-00 00-00 00-00 90-74 B1-55 55-55 00-00 29-00 00-00 00-00 00-00 29-00 00-00 00-00 00-00 F0-F3 AF-55 55-55 00-00>
[  FAILED  ] parseURLRelative/ParseURLRelativeTestSuite.resolve/absOverrideWithZoneId, where GetParam() = 336-byte object <21-00 00-00 00-00 00-00 60-8E 95-55 55-55 00-00 3C-00 00-00 00-00 00-00 88-8E 95-55 55-55 00-00 B0-F2 AF-55 55-55 00-00 05-00 00-00 00-00 00-00 68-74 74-70 73-00 00-00 00-00 00-00 00-00 00-00 ... A0-F3 AF-55 55-55 00-00 00-00 00-00 00-00 00-00 00-72 61-67 00-55 00-00 00-00 00-00 00-00 00-00 C0-3B B1-55 55-55 00-00 15-00 00-00 00-00 00-00 15-00 00-00 00-00 00-00 69-64 65-00 55-55 00-00>
 5 FAILED TESTS
  YOU HAVE 1 DISABLED TEST

nix-store-tests-run:
[----------] 5 tests from S3ToHttpsConversionErrors/S3ToHttpsConversionErrorTest (0 ms total)
[----------] Global test environment tear-down
[==========] 798 tests from 90 test suites ran. (1460 ms total)
[  PASSED  ] 797 tests.
[  FAILED  ] 1 test, listed below:
[  FAILED  ] StoreReferenceTest.PathInfo_ssh_unbracketed_ipv6_5_from_uri
 1 FAILED TEST
  YOU HAVE 1 DISABLED TEST

… and 1 more failed derivation
failed checks.x86_64-linux.home-manager-common 8m 47s
nix-util-tests-run: [ FAILED ] 5 tests, listed below: [ FAILED ] ParseURLSuccessCases/ParseURLSuccess.parsesAsExpected/5, where GetParam() = 288-byte object …
nix-util-tests-run:
[  FAILED  ] 5 tests, listed below:
[  FAILED  ] ParseURLSuccessCases/ParseURLSuccess.parsesAsExpected/5, where GetParam() = 288-byte object <31-00 00-00 00-00 00-00 A8-86 95-55 55-55 00-00 B0-C7 B0-55 55-55 00-00 04-00 00-00 00-00 00-00 68-74 74-70 00-68 74-74 70-73 00-00 00-00 00-00 02-00 00-00 00-00 00-00 00-56 B0-55 55-55 00-00 ... 00-00 00-00 00-00 00-00 68-C8 B0-55 55-55 00-00 68-C8 B0-55 55-55 00-00 00-00 00-00 00-00 00-00 A0-C8 B0-55 55-55 00-00 00-00 00-00 00-00 00-00 00-65 6C-6C 6F-00 00-00 98-C8 B0-55 55-55 00-00>
[  FAILED  ] ParseURLSuccessCases/ParseURLSuccess.toStringRoundTrips/5, where GetParam() = 288-byte object <31-00 00-00 00-00 00-00 A8-86 95-55 55-55 00-00 B0-C7 B0-55 55-55 00-00 04-00 00-00 00-00 00-00 68-74 74-70 00-68 74-74 70-73 00-00 00-00 00-00 02-00 00-00 00-00 00-00 F0-2F B1-55 55-55 00-00 ... 00-00 00-00 00-00 00-00 68-C8 B0-55 55-55 00-00 68-C8 B0-55 55-55 00-00 00-00 00-00 00-00 00-00 A0-C8 B0-55 55-55 00-00 00-00 00-00 00-00 00-00 00-65 6C-6C 6F-00 00-00 98-C8 B0-55 55-55 00-00>
[  FAILED  ] ParseURLSuccessCases/ParseURLSuccess.makeSureFixGitURLDoesNotModify/5, where GetParam() = 288-byte object <31-00 00-00 00-00 00-00 A8-86 95-55 55-55 00-00 B0-C7 B0-55 55-55 00-00 04-00 00-00 00-00 00-00 68-74 74-70 00-68 74-74 70-73 00-00 00-00 00-00 02-00 00-00 00-00 00-00 40-55 B1-55 55-55 00-00 ... 00-00 00-00 00-00 00-00 68-C8 B0-55 55-55 00-00 68-C8 B0-55 55-55 00-00 00-00 00-00 00-00 00-00 A0-C8 B0-55 55-55 00-00 00-00 00-00 00-00 00-00 00-65 6C-6C 6F-00 00-00 98-C8 B0-55 55-55 00-00>
[  FAILED  ] parseURLRelative/ParseURLRelativeTestSuite.resolve/resolvesRelativePathIpv6AddressWithZoneId, where GetParam() = 336-byte object <3F-00 00-00 00-00 00-00 18-90 95-55 55-55 00-00 10-00 00-00 00-00 00-00 68-34 94-55 55-55 00-00 B0-F2 AF-55 55-55 00-00 04-00 00-00 00-00 00-00 68-74 74-70 00-00 00-00 00-00 00-00 00-00 00-00 ... A0-F3 AF-55 55-55 00-00 00-00 00-00 00-00 00-00 00-F3 AF-55 55-55 00-00 00-00 00-00 00-00 00-00 90-74 B1-55 55-55 00-00 29-00 00-00 00-00 00-00 29-00 00-00 00-00 00-00 F0-F3 AF-55 55-55 00-00>
[  FAILED  ] parseURLRelative/ParseURLRelativeTestSuite.resolve/absOverrideWithZoneId, where GetParam() = 336-byte object <21-00 00-00 00-00 00-00 60-8E 95-55 55-55 00-00 3C-00 00-00 00-00 00-00 88-8E 95-55 55-55 00-00 B0-F2 AF-55 55-55 00-00 05-00 00-00 00-00 00-00 68-74 74-70 73-00 00-00 00-00 00-00 00-00 00-00 ... A0-F3 AF-55 55-55 00-00 00-00 00-00 00-00 00-00 00-72 61-67 00-55 00-00 00-00 00-00 00-00 00-00 C0-3B B1-55 55-55 00-00 15-00 00-00 00-00 00-00 15-00 00-00 00-00 00-00 69-64 65-00 55-55 00-00>
 5 FAILED TESTS
  YOU HAVE 1 DISABLED TEST

nix-util-tests-run-without-new-syscalls:
[  FAILED  ] 5 tests, listed below:
[  FAILED  ] ParseURLSuccessCases/ParseURLSuccess.parsesAsExpected/5, where GetParam() = 288-byte object <31-00 00-00 00-00 00-00 A8-86 95-55 55-55 00-00 B0-C7 B0-55 55-55 00-00 04-00 00-00 00-00 00-00 68-74 74-70 00-68 74-74 70-73 00-00 00-00 00-00 02-00 00-00 00-00 00-00 00-56 B0-55 55-55 00-00 ... 00-00 00-00 00-00 00-00 68-C8 B0-55 55-55 00-00 68-C8 B0-55 55-55 00-00 00-00 00-00 00-00 00-00 A0-C8 B0-55 55-55 00-00 00-00 00-00 00-00 00-00 00-65 6C-6C 6F-00 00-00 98-C8 B0-55 55-55 00-00>
[  FAILED  ] ParseURLSuccessCases/ParseURLSuccess.toStringRoundTrips/5, where GetParam() = 288-byte object <31-00 00-00 00-00 00-00 A8-86 95-55 55-55 00-00 B0-C7 B0-55 55-55 00-00 04-00 00-00 00-00 00-00 68-74 74-70 00-68 74-74 70-73 00-00 00-00 00-00 02-00 00-00 00-00 00-00 F0-2F B1-55 55-55 00-00 ... 00-00 00-00 00-00 00-00 68-C8 B0-55 55-55 00-00 68-C8 B0-55 55-55 00-00 00-00 00-00 00-00 00-00 A0-C8 B0-55 55-55 00-00 00-00 00-00 00-00 00-00 00-65 6C-6C 6F-00 00-00 98-C8 B0-55 55-55 00-00>
[  FAILED  ] ParseURLSuccessCases/ParseURLSuccess.makeSureFixGitURLDoesNotModify/5, where GetParam() = 288-byte object <31-00 00-00 00-00 00-00 A8-86 95-55 55-55 00-00 B0-C7 B0-55 55-55 00-00 04-00 00-00 00-00 00-00 68-74 74-70 00-68 74-74 70-73 00-00 00-00 00-00 02-00 00-00 00-00 00-00 40-55 B1-55 55-55 00-00 ... 00-00 00-00 00-00 00-00 68-C8 B0-55 55-55 00-00 68-C8 B0-55 55-55 00-00 00-00 00-00 00-00 00-00 A0-C8 B0-55 55-55 00-00 00-00 00-00 00-00 00-00 00-65 6C-6C 6F-00 00-00 98-C8 B0-55 55-55 00-00>
[  FAILED  ] parseURLRelative/ParseURLRelativeTestSuite.resolve/resolvesRelativePathIpv6AddressWithZoneId, where GetParam() = 336-byte object <3F-00 00-00 00-00 00-00 18-90 95-55 55-55 00-00 10-00 00-00 00-00 00-00 68-34 94-55 55-55 00-00 B0-F2 AF-55 55-55 00-00 04-00 00-00 00-00 00-00 68-74 74-70 00-00 00-00 00-00 00-00 00-00 00-00 ... A0-F3 AF-55 55-55 00-00 00-00 00-00 00-00 00-00 00-F3 AF-55 55-55 00-00 00-00 00-00 00-00 00-00 90-74 B1-55 55-55 00-00 29-00 00-00 00-00 00-00 29-00 00-00 00-00 00-00 F0-F3 AF-55 55-55 00-00>
[  FAILED  ] parseURLRelative/ParseURLRelativeTestSuite.resolve/absOverrideWithZoneId, where GetParam() = 336-byte object <21-00 00-00 00-00 00-00 60-8E 95-55 55-55 00-00 3C-00 00-00 00-00 00-00 88-8E 95-55 55-55 00-00 B0-F2 AF-55 55-55 00-00 05-00 00-00 00-00 00-00 68-74 74-70 73-00 00-00 00-00 00-00 00-00 00-00 ... A0-F3 AF-55 55-55 00-00 00-00 00-00 00-00 00-00 00-72 61-67 00-55 00-00 00-00 00-00 00-00 00-00 C0-3B B1-55 55-55 00-00 15-00 00-00 00-00 00-00 15-00 00-00 00-00 00-00 69-64 65-00 55-55 00-00>
 5 FAILED TESTS
  YOU HAVE 1 DISABLED TEST

nix-store-tests-run:
[----------] 5 tests from S3ToHttpsConversionErrors/S3ToHttpsConversionErrorTest (0 ms total)
[----------] Global test environment tear-down
[==========] 798 tests from 90 test suites ran. (1487 ms total)
[  PASSED  ] 797 tests.
[  FAILED  ] 1 test, listed below:
[  FAILED  ] StoreReferenceTest.PathInfo_ssh_unbracketed_ipv6_5_from_uri
 1 FAILED TEST
  YOU HAVE 1 DISABLED TEST
failed checks.x86_64-linux.home-manager-desktop 8m 41s
nix-util-tests-run-without-new-syscalls: [ FAILED ] 5 tests, listed below: [ FAILED ] ParseURLSuccessCases/ParseURLSuccess.parsesAsExpected/5, where GetPara …
nix-util-tests-run-without-new-syscalls:
[  FAILED  ] 5 tests, listed below:
[  FAILED  ] ParseURLSuccessCases/ParseURLSuccess.parsesAsExpected/5, where GetParam() = 288-byte object <31-00 00-00 00-00 00-00 A8-86 95-55 55-55 00-00 B0-C7 B0-55 55-55 00-00 04-00 00-00 00-00 00-00 68-74 74-70 00-68 74-74 70-73 00-00 00-00 00-00 02-00 00-00 00-00 00-00 00-56 B0-55 55-55 00-00 ... 00-00 00-00 00-00 00-00 68-C8 B0-55 55-55 00-00 68-C8 B0-55 55-55 00-00 00-00 00-00 00-00 00-00 A0-C8 B0-55 55-55 00-00 00-00 00-00 00-00 00-00 00-65 6C-6C 6F-00 00-00 98-C8 B0-55 55-55 00-00>
[  FAILED  ] ParseURLSuccessCases/ParseURLSuccess.toStringRoundTrips/5, where GetParam() = 288-byte object <31-00 00-00 00-00 00-00 A8-86 95-55 55-55 00-00 B0-C7 B0-55 55-55 00-00 04-00 00-00 00-00 00-00 68-74 74-70 00-68 74-74 70-73 00-00 00-00 00-00 02-00 00-00 00-00 00-00 F0-2F B1-55 55-55 00-00 ... 00-00 00-00 00-00 00-00 68-C8 B0-55 55-55 00-00 68-C8 B0-55 55-55 00-00 00-00 00-00 00-00 00-00 A0-C8 B0-55 55-55 00-00 00-00 00-00 00-00 00-00 00-65 6C-6C 6F-00 00-00 98-C8 B0-55 55-55 00-00>
[  FAILED  ] ParseURLSuccessCases/ParseURLSuccess.makeSureFixGitURLDoesNotModify/5, where GetParam() = 288-byte object <31-00 00-00 00-00 00-00 A8-86 95-55 55-55 00-00 B0-C7 B0-55 55-55 00-00 04-00 00-00 00-00 00-00 68-74 74-70 00-68 74-74 70-73 00-00 00-00 00-00 02-00 00-00 00-00 00-00 40-55 B1-55 55-55 00-00 ... 00-00 00-00 00-00 00-00 68-C8 B0-55 55-55 00-00 68-C8 B0-55 55-55 00-00 00-00 00-00 00-00 00-00 A0-C8 B0-55 55-55 00-00 00-00 00-00 00-00 00-00 00-65 6C-6C 6F-00 00-00 98-C8 B0-55 55-55 00-00>
[  FAILED  ] parseURLRelative/ParseURLRelativeTestSuite.resolve/resolvesRelativePathIpv6AddressWithZoneId, where GetParam() = 336-byte object <3F-00 00-00 00-00 00-00 18-90 95-55 55-55 00-00 10-00 00-00 00-00 00-00 68-34 94-55 55-55 00-00 B0-F2 AF-55 55-55 00-00 04-00 00-00 00-00 00-00 68-74 74-70 00-00 00-00 00-00 00-00 00-00 00-00 ... A0-F3 AF-55 55-55 00-00 00-00 00-00 00-00 00-00 00-F3 AF-55 55-55 00-00 00-00 00-00 00-00 00-00 90-74 B1-55 55-55 00-00 29-00 00-00 00-00 00-00 29-00 00-00 00-00 00-00 F0-F3 AF-55 55-55 00-00>
[  FAILED  ] parseURLRelative/ParseURLRelativeTestSuite.resolve/absOverrideWithZoneId, where GetParam() = 336-byte object <21-00 00-00 00-00 00-00 60-8E 95-55 55-55 00-00 3C-00 00-00 00-00 00-00 88-8E 95-55 55-55 00-00 B0-F2 AF-55 55-55 00-00 05-00 00-00 00-00 00-00 68-74 74-70 73-00 00-00 00-00 00-00 00-00 00-00 ... A0-F3 AF-55 55-55 00-00 00-00 00-00 00-00 00-00 00-72 61-67 00-55 00-00 00-00 00-00 00-00 00-00 C0-3B B1-55 55-55 00-00 15-00 00-00 00-00 00-00 15-00 00-00 00-00 00-00 69-64 65-00 55-55 00-00>
 5 FAILED TESTS
  YOU HAVE 1 DISABLED TEST

nix-util-tests-run:
[  FAILED  ] 5 tests, listed below:
[  FAILED  ] ParseURLSuccessCases/ParseURLSuccess.parsesAsExpected/5, where GetParam() = 288-byte object <31-00 00-00 00-00 00-00 A8-86 95-55 55-55 00-00 B0-C7 B0-55 55-55 00-00 04-00 00-00 00-00 00-00 68-74 74-70 00-68 74-74 70-73 00-00 00-00 00-00 02-00 00-00 00-00 00-00 00-56 B0-55 55-55 00-00 ... 00-00 00-00 00-00 00-00 68-C8 B0-55 55-55 00-00 68-C8 B0-55 55-55 00-00 00-00 00-00 00-00 00-00 A0-C8 B0-55 55-55 00-00 00-00 00-00 00-00 00-00 00-65 6C-6C 6F-00 00-00 98-C8 B0-55 55-55 00-00>
[  FAILED  ] ParseURLSuccessCases/ParseURLSuccess.toStringRoundTrips/5, where GetParam() = 288-byte object <31-00 00-00 00-00 00-00 A8-86 95-55 55-55 00-00 B0-C7 B0-55 55-55 00-00 04-00 00-00 00-00 00-00 68-74 74-70 00-68 74-74 70-73 00-00 00-00 00-00 02-00 00-00 00-00 00-00 F0-2F B1-55 55-55 00-00 ... 00-00 00-00 00-00 00-00 68-C8 B0-55 55-55 00-00 68-C8 B0-55 55-55 00-00 00-00 00-00 00-00 00-00 A0-C8 B0-55 55-55 00-00 00-00 00-00 00-00 00-00 00-65 6C-6C 6F-00 00-00 98-C8 B0-55 55-55 00-00>
[  FAILED  ] ParseURLSuccessCases/ParseURLSuccess.makeSureFixGitURLDoesNotModify/5, where GetParam() = 288-byte object <31-00 00-00 00-00 00-00 A8-86 95-55 55-55 00-00 B0-C7 B0-55 55-55 00-00 04-00 00-00 00-00 00-00 68-74 74-70 00-68 74-74 70-73 00-00 00-00 00-00 02-00 00-00 00-00 00-00 40-55 B1-55 55-55 00-00 ... 00-00 00-00 00-00 00-00 68-C8 B0-55 55-55 00-00 68-C8 B0-55 55-55 00-00 00-00 00-00 00-00 00-00 A0-C8 B0-55 55-55 00-00 00-00 00-00 00-00 00-00 00-65 6C-6C 6F-00 00-00 98-C8 B0-55 55-55 00-00>
[  FAILED  ] parseURLRelative/ParseURLRelativeTestSuite.resolve/resolvesRelativePathIpv6AddressWithZoneId, where GetParam() = 336-byte object <3F-00 00-00 00-00 00-00 18-90 95-55 55-55 00-00 10-00 00-00 00-00 00-00 68-34 94-55 55-55 00-00 B0-F2 AF-55 55-55 00-00 04-00 00-00 00-00 00-00 68-74 74-70 00-00 00-00 00-00 00-00 00-00 00-00 ... A0-F3 AF-55 55-55 00-00 00-00 00-00 00-00 00-00 00-F3 AF-55 55-55 00-00 00-00 00-00 00-00 00-00 90-74 B1-55 55-55 00-00 29-00 00-00 00-00 00-00 29-00 00-00 00-00 00-00 F0-F3 AF-55 55-55 00-00>
[  FAILED  ] parseURLRelative/ParseURLRelativeTestSuite.resolve/absOverrideWithZoneId, where GetParam() = 336-byte object <21-00 00-00 00-00 00-00 60-8E 95-55 55-55 00-00 3C-00 00-00 00-00 00-00 88-8E 95-55 55-55 00-00 B0-F2 AF-55 55-55 00-00 05-00 00-00 00-00 00-00 68-74 74-70 73-00 00-00 00-00 00-00 00-00 00-00 ... A0-F3 AF-55 55-55 00-00 00-00 00-00 00-00 00-00 00-72 61-67 00-55 00-00 00-00 00-00 00-00 00-00 C0-3B B1-55 55-55 00-00 15-00 00-00 00-00 00-00 15-00 00-00 00-00 00-00 69-64 65-00 55-55 00-00>
 5 FAILED TESTS
  YOU HAVE 1 DISABLED TEST

nix-store-tests-run:
[----------] 5 tests from S3ToHttpsConversionErrors/S3ToHttpsConversionErrorTest (0 ms total)
[----------] Global test environment tear-down
[==========] 798 tests from 90 test suites ran. (1540 ms total)
[  PASSED  ] 797 tests.
[  FAILED  ] 1 test, listed below:
[  FAILED  ] StoreReferenceTest.PathInfo_ssh_unbracketed_ipv6_5_from_uri
 1 FAILED TEST
  YOU HAVE 1 DISABLED TEST

… and 1 more failed derivation
failed checks.x86_64-linux.home-manager-eve 8m 37s
nix-util-tests-run-without-new-syscalls: [ FAILED ] 5 tests, listed below: [ FAILED ] ParseURLSuccessCases/ParseURLSuccess.parsesAsExpected/5, where GetPara …
nix-util-tests-run-without-new-syscalls:
[  FAILED  ] 5 tests, listed below:
[  FAILED  ] ParseURLSuccessCases/ParseURLSuccess.parsesAsExpected/5, where GetParam() = 288-byte object <31-00 00-00 00-00 00-00 A8-86 95-55 55-55 00-00 B0-C7 B0-55 55-55 00-00 04-00 00-00 00-00 00-00 68-74 74-70 00-68 74-74 70-73 00-00 00-00 00-00 02-00 00-00 00-00 00-00 00-56 B0-55 55-55 00-00 ... 00-00 00-00 00-00 00-00 68-C8 B0-55 55-55 00-00 68-C8 B0-55 55-55 00-00 00-00 00-00 00-00 00-00 A0-C8 B0-55 55-55 00-00 00-00 00-00 00-00 00-00 00-65 6C-6C 6F-00 00-00 98-C8 B0-55 55-55 00-00>
[  FAILED  ] ParseURLSuccessCases/ParseURLSuccess.toStringRoundTrips/5, where GetParam() = 288-byte object <31-00 00-00 00-00 00-00 A8-86 95-55 55-55 00-00 B0-C7 B0-55 55-55 00-00 04-00 00-00 00-00 00-00 68-74 74-70 00-68 74-74 70-73 00-00 00-00 00-00 02-00 00-00 00-00 00-00 F0-2F B1-55 55-55 00-00 ... 00-00 00-00 00-00 00-00 68-C8 B0-55 55-55 00-00 68-C8 B0-55 55-55 00-00 00-00 00-00 00-00 00-00 A0-C8 B0-55 55-55 00-00 00-00 00-00 00-00 00-00 00-65 6C-6C 6F-00 00-00 98-C8 B0-55 55-55 00-00>
[  FAILED  ] ParseURLSuccessCases/ParseURLSuccess.makeSureFixGitURLDoesNotModify/5, where GetParam() = 288-byte object <31-00 00-00 00-00 00-00 A8-86 95-55 55-55 00-00 B0-C7 B0-55 55-55 00-00 04-00 00-00 00-00 00-00 68-74 74-70 00-68 74-74 70-73 00-00 00-00 00-00 02-00 00-00 00-00 00-00 40-55 B1-55 55-55 00-00 ... 00-00 00-00 00-00 00-00 68-C8 B0-55 55-55 00-00 68-C8 B0-55 55-55 00-00 00-00 00-00 00-00 00-00 A0-C8 B0-55 55-55 00-00 00-00 00-00 00-00 00-00 00-65 6C-6C 6F-00 00-00 98-C8 B0-55 55-55 00-00>
[  FAILED  ] parseURLRelative/ParseURLRelativeTestSuite.resolve/resolvesRelativePathIpv6AddressWithZoneId, where GetParam() = 336-byte object <3F-00 00-00 00-00 00-00 18-90 95-55 55-55 00-00 10-00 00-00 00-00 00-00 68-34 94-55 55-55 00-00 B0-F2 AF-55 55-55 00-00 04-00 00-00 00-00 00-00 68-74 74-70 00-00 00-00 00-00 00-00 00-00 00-00 ... A0-F3 AF-55 55-55 00-00 00-00 00-00 00-00 00-00 00-F3 AF-55 55-55 00-00 00-00 00-00 00-00 00-00 90-74 B1-55 55-55 00-00 29-00 00-00 00-00 00-00 29-00 00-00 00-00 00-00 F0-F3 AF-55 55-55 00-00>
[  FAILED  ] parseURLRelative/ParseURLRelativeTestSuite.resolve/absOverrideWithZoneId, where GetParam() = 336-byte object <21-00 00-00 00-00 00-00 60-8E 95-55 55-55 00-00 3C-00 00-00 00-00 00-00 88-8E 95-55 55-55 00-00 B0-F2 AF-55 55-55 00-00 05-00 00-00 00-00 00-00 68-74 74-70 73-00 00-00 00-00 00-00 00-00 00-00 ... A0-F3 AF-55 55-55 00-00 00-00 00-00 00-00 00-00 00-72 61-67 00-55 00-00 00-00 00-00 00-00 00-00 C0-3B B1-55 55-55 00-00 15-00 00-00 00-00 00-00 15-00 00-00 00-00 00-00 69-64 65-00 55-55 00-00>
 5 FAILED TESTS
  YOU HAVE 1 DISABLED TEST

nix-util-tests-run:
[  FAILED  ] 5 tests, listed below:
[  FAILED  ] ParseURLSuccessCases/ParseURLSuccess.parsesAsExpected/5, where GetParam() = 288-byte object <31-00 00-00 00-00 00-00 A8-86 95-55 55-55 00-00 B0-C7 B0-55 55-55 00-00 04-00 00-00 00-00 00-00 68-74 74-70 00-68 74-74 70-73 00-00 00-00 00-00 02-00 00-00 00-00 00-00 00-56 B0-55 55-55 00-00 ... 00-00 00-00 00-00 00-00 68-C8 B0-55 55-55 00-00 68-C8 B0-55 55-55 00-00 00-00 00-00 00-00 00-00 A0-C8 B0-55 55-55 00-00 00-00 00-00 00-00 00-00 00-65 6C-6C 6F-00 00-00 98-C8 B0-55 55-55 00-00>
[  FAILED  ] ParseURLSuccessCases/ParseURLSuccess.toStringRoundTrips/5, where GetParam() = 288-byte object <31-00 00-00 00-00 00-00 A8-86 95-55 55-55 00-00 B0-C7 B0-55 55-55 00-00 04-00 00-00 00-00 00-00 68-74 74-70 00-68 74-74 70-73 00-00 00-00 00-00 02-00 00-00 00-00 00-00 F0-2F B1-55 55-55 00-00 ... 00-00 00-00 00-00 00-00 68-C8 B0-55 55-55 00-00 68-C8 B0-55 55-55 00-00 00-00 00-00 00-00 00-00 A0-C8 B0-55 55-55 00-00 00-00 00-00 00-00 00-00 00-65 6C-6C 6F-00 00-00 98-C8 B0-55 55-55 00-00>
[  FAILED  ] ParseURLSuccessCases/ParseURLSuccess.makeSureFixGitURLDoesNotModify/5, where GetParam() = 288-byte object <31-00 00-00 00-00 00-00 A8-86 95-55 55-55 00-00 B0-C7 B0-55 55-55 00-00 04-00 00-00 00-00 00-00 68-74 74-70 00-68 74-74 70-73 00-00 00-00 00-00 02-00 00-00 00-00 00-00 40-55 B1-55 55-55 00-00 ... 00-00 00-00 00-00 00-00 68-C8 B0-55 55-55 00-00 68-C8 B0-55 55-55 00-00 00-00 00-00 00-00 00-00 A0-C8 B0-55 55-55 00-00 00-00 00-00 00-00 00-00 00-65 6C-6C 6F-00 00-00 98-C8 B0-55 55-55 00-00>
[  FAILED  ] parseURLRelative/ParseURLRelativeTestSuite.resolve/resolvesRelativePathIpv6AddressWithZoneId, where GetParam() = 336-byte object <3F-00 00-00 00-00 00-00 18-90 95-55 55-55 00-00 10-00 00-00 00-00 00-00 68-34 94-55 55-55 00-00 B0-F2 AF-55 55-55 00-00 04-00 00-00 00-00 00-00 68-74 74-70 00-00 00-00 00-00 00-00 00-00 00-00 ... A0-F3 AF-55 55-55 00-00 00-00 00-00 00-00 00-00 00-F3 AF-55 55-55 00-00 00-00 00-00 00-00 00-00 90-74 B1-55 55-55 00-00 29-00 00-00 00-00 00-00 29-00 00-00 00-00 00-00 F0-F3 AF-55 55-55 00-00>
[  FAILED  ] parseURLRelative/ParseURLRelativeTestSuite.resolve/absOverrideWithZoneId, where GetParam() = 336-byte object <21-00 00-00 00-00 00-00 60-8E 95-55 55-55 00-00 3C-00 00-00 00-00 00-00 88-8E 95-55 55-55 00-00 B0-F2 AF-55 55-55 00-00 05-00 00-00 00-00 00-00 68-74 74-70 73-00 00-00 00-00 00-00 00-00 00-00 ... A0-F3 AF-55 55-55 00-00 00-00 00-00 00-00 00-00 00-72 61-67 00-55 00-00 00-00 00-00 00-00 00-00 C0-3B B1-55 55-55 00-00 15-00 00-00 00-00 00-00 15-00 00-00 00-00 00-00 69-64 65-00 55-55 00-00>
 5 FAILED TESTS
  YOU HAVE 1 DISABLED TEST

nix-store-tests-run:
[----------] 5 tests from S3ToHttpsConversionErrors/S3ToHttpsConversionErrorTest (0 ms total)
[----------] Global test environment tear-down
[==========] 798 tests from 90 test suites ran. (1409 ms total)
[  PASSED  ] 797 tests.
[  FAILED  ] 1 test, listed below:
[  FAILED  ] StoreReferenceTest.PathInfo_ssh_unbracketed_ipv6_5_from_uri
 1 FAILED TEST
  YOU HAVE 1 DISABLED TEST

… and 1 more failed derivation
failed checks.x86_64-linux.home-manager-mic92 8m 39s
nix-util-tests-run: [ FAILED ] 5 tests, listed below: [ FAILED ] ParseURLSuccessCases/ParseURLSuccess.parsesAsExpected/5, where GetParam() = 288-byte object …
nix-util-tests-run:
[  FAILED  ] 5 tests, listed below:
[  FAILED  ] ParseURLSuccessCases/ParseURLSuccess.parsesAsExpected/5, where GetParam() = 288-byte object <31-00 00-00 00-00 00-00 A8-86 95-55 55-55 00-00 B0-C7 B0-55 55-55 00-00 04-00 00-00 00-00 00-00 68-74 74-70 00-68 74-74 70-73 00-00 00-00 00-00 02-00 00-00 00-00 00-00 00-56 B0-55 55-55 00-00 ... 00-00 00-00 00-00 00-00 68-C8 B0-55 55-55 00-00 68-C8 B0-55 55-55 00-00 00-00 00-00 00-00 00-00 A0-C8 B0-55 55-55 00-00 00-00 00-00 00-00 00-00 00-65 6C-6C 6F-00 00-00 98-C8 B0-55 55-55 00-00>
[  FAILED  ] ParseURLSuccessCases/ParseURLSuccess.toStringRoundTrips/5, where GetParam() = 288-byte object <31-00 00-00 00-00 00-00 A8-86 95-55 55-55 00-00 B0-C7 B0-55 55-55 00-00 04-00 00-00 00-00 00-00 68-74 74-70 00-68 74-74 70-73 00-00 00-00 00-00 02-00 00-00 00-00 00-00 F0-2F B1-55 55-55 00-00 ... 00-00 00-00 00-00 00-00 68-C8 B0-55 55-55 00-00 68-C8 B0-55 55-55 00-00 00-00 00-00 00-00 00-00 A0-C8 B0-55 55-55 00-00 00-00 00-00 00-00 00-00 00-65 6C-6C 6F-00 00-00 98-C8 B0-55 55-55 00-00>
[  FAILED  ] ParseURLSuccessCases/ParseURLSuccess.makeSureFixGitURLDoesNotModify/5, where GetParam() = 288-byte object <31-00 00-00 00-00 00-00 A8-86 95-55 55-55 00-00 B0-C7 B0-55 55-55 00-00 04-00 00-00 00-00 00-00 68-74 74-70 00-68 74-74 70-73 00-00 00-00 00-00 02-00 00-00 00-00 00-00 40-55 B1-55 55-55 00-00 ... 00-00 00-00 00-00 00-00 68-C8 B0-55 55-55 00-00 68-C8 B0-55 55-55 00-00 00-00 00-00 00-00 00-00 A0-C8 B0-55 55-55 00-00 00-00 00-00 00-00 00-00 00-65 6C-6C 6F-00 00-00 98-C8 B0-55 55-55 00-00>
[  FAILED  ] parseURLRelative/ParseURLRelativeTestSuite.resolve/resolvesRelativePathIpv6AddressWithZoneId, where GetParam() = 336-byte object <3F-00 00-00 00-00 00-00 18-90 95-55 55-55 00-00 10-00 00-00 00-00 00-00 68-34 94-55 55-55 00-00 B0-F2 AF-55 55-55 00-00 04-00 00-00 00-00 00-00 68-74 74-70 00-00 00-00 00-00 00-00 00-00 00-00 ... A0-F3 AF-55 55-55 00-00 00-00 00-00 00-00 00-00 00-F3 AF-55 55-55 00-00 00-00 00-00 00-00 00-00 90-74 B1-55 55-55 00-00 29-00 00-00 00-00 00-00 29-00 00-00 00-00 00-00 F0-F3 AF-55 55-55 00-00>
[  FAILED  ] parseURLRelative/ParseURLRelativeTestSuite.resolve/absOverrideWithZoneId, where GetParam() = 336-byte object <21-00 00-00 00-00 00-00 60-8E 95-55 55-55 00-00 3C-00 00-00 00-00 00-00 88-8E 95-55 55-55 00-00 B0-F2 AF-55 55-55 00-00 05-00 00-00 00-00 00-00 68-74 74-70 73-00 00-00 00-00 00-00 00-00 00-00 ... A0-F3 AF-55 55-55 00-00 00-00 00-00 00-00 00-00 00-72 61-67 00-55 00-00 00-00 00-00 00-00 00-00 C0-3B B1-55 55-55 00-00 15-00 00-00 00-00 00-00 15-00 00-00 00-00 00-00 69-64 65-00 55-55 00-00>
 5 FAILED TESTS
  YOU HAVE 1 DISABLED TEST

nix-util-tests-run-without-new-syscalls:
[  FAILED  ] 5 tests, listed below:
[  FAILED  ] ParseURLSuccessCases/ParseURLSuccess.parsesAsExpected/5, where GetParam() = 288-byte object <31-00 00-00 00-00 00-00 A8-86 95-55 55-55 00-00 B0-C7 B0-55 55-55 00-00 04-00 00-00 00-00 00-00 68-74 74-70 00-68 74-74 70-73 00-00 00-00 00-00 02-00 00-00 00-00 00-00 00-56 B0-55 55-55 00-00 ... 00-00 00-00 00-00 00-00 68-C8 B0-55 55-55 00-00 68-C8 B0-55 55-55 00-00 00-00 00-00 00-00 00-00 A0-C8 B0-55 55-55 00-00 00-00 00-00 00-00 00-00 00-65 6C-6C 6F-00 00-00 98-C8 B0-55 55-55 00-00>
[  FAILED  ] ParseURLSuccessCases/ParseURLSuccess.toStringRoundTrips/5, where GetParam() = 288-byte object <31-00 00-00 00-00 00-00 A8-86 95-55 55-55 00-00 B0-C7 B0-55 55-55 00-00 04-00 00-00 00-00 00-00 68-74 74-70 00-68 74-74 70-73 00-00 00-00 00-00 02-00 00-00 00-00 00-00 F0-2F B1-55 55-55 00-00 ... 00-00 00-00 00-00 00-00 68-C8 B0-55 55-55 00-00 68-C8 B0-55 55-55 00-00 00-00 00-00 00-00 00-00 A0-C8 B0-55 55-55 00-00 00-00 00-00 00-00 00-00 00-65 6C-6C 6F-00 00-00 98-C8 B0-55 55-55 00-00>
[  FAILED  ] ParseURLSuccessCases/ParseURLSuccess.makeSureFixGitURLDoesNotModify/5, where GetParam() = 288-byte object <31-00 00-00 00-00 00-00 A8-86 95-55 55-55 00-00 B0-C7 B0-55 55-55 00-00 04-00 00-00 00-00 00-00 68-74 74-70 00-68 74-74 70-73 00-00 00-00 00-00 02-00 00-00 00-00 00-00 40-55 B1-55 55-55 00-00 ... 00-00 00-00 00-00 00-00 68-C8 B0-55 55-55 00-00 68-C8 B0-55 55-55 00-00 00-00 00-00 00-00 00-00 A0-C8 B0-55 55-55 00-00 00-00 00-00 00-00 00-00 00-65 6C-6C 6F-00 00-00 98-C8 B0-55 55-55 00-00>
[  FAILED  ] parseURLRelative/ParseURLRelativeTestSuite.resolve/resolvesRelativePathIpv6AddressWithZoneId, where GetParam() = 336-byte object <3F-00 00-00 00-00 00-00 18-90 95-55 55-55 00-00 10-00 00-00 00-00 00-00 68-34 94-55 55-55 00-00 B0-F2 AF-55 55-55 00-00 04-00 00-00 00-00 00-00 68-74 74-70 00-00 00-00 00-00 00-00 00-00 00-00 ... A0-F3 AF-55 55-55 00-00 00-00 00-00 00-00 00-00 00-F3 AF-55 55-55 00-00 00-00 00-00 00-00 00-00 90-74 B1-55 55-55 00-00 29-00 00-00 00-00 00-00 29-00 00-00 00-00 00-00 F0-F3 AF-55 55-55 00-00>
[  FAILED  ] parseURLRelative/ParseURLRelativeTestSuite.resolve/absOverrideWithZoneId, where GetParam() = 336-byte object <21-00 00-00 00-00 00-00 60-8E 95-55 55-55 00-00 3C-00 00-00 00-00 00-00 88-8E 95-55 55-55 00-00 B0-F2 AF-55 55-55 00-00 05-00 00-00 00-00 00-00 68-74 74-70 73-00 00-00 00-00 00-00 00-00 00-00 ... A0-F3 AF-55 55-55 00-00 00-00 00-00 00-00 00-00 00-72 61-67 00-55 00-00 00-00 00-00 00-00 00-00 C0-3B B1-55 55-55 00-00 15-00 00-00 00-00 00-00 15-00 00-00 00-00 00-00 69-64 65-00 55-55 00-00>
 5 FAILED TESTS
  YOU HAVE 1 DISABLED TEST

nix-store-tests-run:
[----------] 5 tests from S3ToHttpsConversionErrors/S3ToHttpsConversionErrorTest (0 ms total)
[----------] Global test environment tear-down
[==========] 798 tests from 90 test suites ran. (1469 ms total)
[  PASSED  ] 797 tests.
[  FAILED  ] 1 test, listed below:
[  FAILED  ] StoreReferenceTest.PathInfo_ssh_unbracketed_ipv6_5_from_uri
 1 FAILED TEST
  YOU HAVE 1 DISABLED TEST
failed checks.x86_64-linux.home-manager-utm-vm 8m 31s
nix-util-tests-run: [ FAILED ] 5 tests, listed below: [ FAILED ] ParseURLSuccessCases/ParseURLSuccess.parsesAsExpected/5, where GetParam() = 288-byte object …
nix-util-tests-run:
[  FAILED  ] 5 tests, listed below:
[  FAILED  ] ParseURLSuccessCases/ParseURLSuccess.parsesAsExpected/5, where GetParam() = 288-byte object <31-00 00-00 00-00 00-00 A8-86 95-55 55-55 00-00 B0-C7 B0-55 55-55 00-00 04-00 00-00 00-00 00-00 68-74 74-70 00-68 74-74 70-73 00-00 00-00 00-00 02-00 00-00 00-00 00-00 00-56 B0-55 55-55 00-00 ... 00-00 00-00 00-00 00-00 68-C8 B0-55 55-55 00-00 68-C8 B0-55 55-55 00-00 00-00 00-00 00-00 00-00 A0-C8 B0-55 55-55 00-00 00-00 00-00 00-00 00-00 00-65 6C-6C 6F-00 00-00 98-C8 B0-55 55-55 00-00>
[  FAILED  ] ParseURLSuccessCases/ParseURLSuccess.toStringRoundTrips/5, where GetParam() = 288-byte object <31-00 00-00 00-00 00-00 A8-86 95-55 55-55 00-00 B0-C7 B0-55 55-55 00-00 04-00 00-00 00-00 00-00 68-74 74-70 00-68 74-74 70-73 00-00 00-00 00-00 02-00 00-00 00-00 00-00 F0-2F B1-55 55-55 00-00 ... 00-00 00-00 00-00 00-00 68-C8 B0-55 55-55 00-00 68-C8 B0-55 55-55 00-00 00-00 00-00 00-00 00-00 A0-C8 B0-55 55-55 00-00 00-00 00-00 00-00 00-00 00-65 6C-6C 6F-00 00-00 98-C8 B0-55 55-55 00-00>
[  FAILED  ] ParseURLSuccessCases/ParseURLSuccess.makeSureFixGitURLDoesNotModify/5, where GetParam() = 288-byte object <31-00 00-00 00-00 00-00 A8-86 95-55 55-55 00-00 B0-C7 B0-55 55-55 00-00 04-00 00-00 00-00 00-00 68-74 74-70 00-68 74-74 70-73 00-00 00-00 00-00 02-00 00-00 00-00 00-00 40-55 B1-55 55-55 00-00 ... 00-00 00-00 00-00 00-00 68-C8 B0-55 55-55 00-00 68-C8 B0-55 55-55 00-00 00-00 00-00 00-00 00-00 A0-C8 B0-55 55-55 00-00 00-00 00-00 00-00 00-00 00-65 6C-6C 6F-00 00-00 98-C8 B0-55 55-55 00-00>
[  FAILED  ] parseURLRelative/ParseURLRelativeTestSuite.resolve/resolvesRelativePathIpv6AddressWithZoneId, where GetParam() = 336-byte object <3F-00 00-00 00-00 00-00 18-90 95-55 55-55 00-00 10-00 00-00 00-00 00-00 68-34 94-55 55-55 00-00 B0-F2 AF-55 55-55 00-00 04-00 00-00 00-00 00-00 68-74 74-70 00-00 00-00 00-00 00-00 00-00 00-00 ... A0-F3 AF-55 55-55 00-00 00-00 00-00 00-00 00-00 00-F3 AF-55 55-55 00-00 00-00 00-00 00-00 00-00 90-74 B1-55 55-55 00-00 29-00 00-00 00-00 00-00 29-00 00-00 00-00 00-00 F0-F3 AF-55 55-55 00-00>
[  FAILED  ] parseURLRelative/ParseURLRelativeTestSuite.resolve/absOverrideWithZoneId, where GetParam() = 336-byte object <21-00 00-00 00-00 00-00 60-8E 95-55 55-55 00-00 3C-00 00-00 00-00 00-00 88-8E 95-55 55-55 00-00 B0-F2 AF-55 55-55 00-00 05-00 00-00 00-00 00-00 68-74 74-70 73-00 00-00 00-00 00-00 00-00 00-00 ... A0-F3 AF-55 55-55 00-00 00-00 00-00 00-00 00-00 00-72 61-67 00-55 00-00 00-00 00-00 00-00 00-00 C0-3B B1-55 55-55 00-00 15-00 00-00 00-00 00-00 15-00 00-00 00-00 00-00 69-64 65-00 55-55 00-00>
 5 FAILED TESTS
  YOU HAVE 1 DISABLED TEST

nix-util-tests-run-without-new-syscalls:
[  FAILED  ] 5 tests, listed below:
[  FAILED  ] ParseURLSuccessCases/ParseURLSuccess.parsesAsExpected/5, where GetParam() = 288-byte object <31-00 00-00 00-00 00-00 A8-86 95-55 55-55 00-00 B0-C7 B0-55 55-55 00-00 04-00 00-00 00-00 00-00 68-74 74-70 00-68 74-74 70-73 00-00 00-00 00-00 02-00 00-00 00-00 00-00 00-56 B0-55 55-55 00-00 ... 00-00 00-00 00-00 00-00 68-C8 B0-55 55-55 00-00 68-C8 B0-55 55-55 00-00 00-00 00-00 00-00 00-00 A0-C8 B0-55 55-55 00-00 00-00 00-00 00-00 00-00 00-65 6C-6C 6F-00 00-00 98-C8 B0-55 55-55 00-00>
[  FAILED  ] ParseURLSuccessCases/ParseURLSuccess.toStringRoundTrips/5, where GetParam() = 288-byte object <31-00 00-00 00-00 00-00 A8-86 95-55 55-55 00-00 B0-C7 B0-55 55-55 00-00 04-00 00-00 00-00 00-00 68-74 74-70 00-68 74-74 70-73 00-00 00-00 00-00 02-00 00-00 00-00 00-00 F0-2F B1-55 55-55 00-00 ... 00-00 00-00 00-00 00-00 68-C8 B0-55 55-55 00-00 68-C8 B0-55 55-55 00-00 00-00 00-00 00-00 00-00 A0-C8 B0-55 55-55 00-00 00-00 00-00 00-00 00-00 00-65 6C-6C 6F-00 00-00 98-C8 B0-55 55-55 00-00>
[  FAILED  ] ParseURLSuccessCases/ParseURLSuccess.makeSureFixGitURLDoesNotModify/5, where GetParam() = 288-byte object <31-00 00-00 00-00 00-00 A8-86 95-55 55-55 00-00 B0-C7 B0-55 55-55 00-00 04-00 00-00 00-00 00-00 68-74 74-70 00-68 74-74 70-73 00-00 00-00 00-00 02-00 00-00 00-00 00-00 40-55 B1-55 55-55 00-00 ... 00-00 00-00 00-00 00-00 68-C8 B0-55 55-55 00-00 68-C8 B0-55 55-55 00-00 00-00 00-00 00-00 00-00 A0-C8 B0-55 55-55 00-00 00-00 00-00 00-00 00-00 00-65 6C-6C 6F-00 00-00 98-C8 B0-55 55-55 00-00>
[  FAILED  ] parseURLRelative/ParseURLRelativeTestSuite.resolve/resolvesRelativePathIpv6AddressWithZoneId, where GetParam() = 336-byte object <3F-00 00-00 00-00 00-00 18-90 95-55 55-55 00-00 10-00 00-00 00-00 00-00 68-34 94-55 55-55 00-00 B0-F2 AF-55 55-55 00-00 04-00 00-00 00-00 00-00 68-74 74-70 00-00 00-00 00-00 00-00 00-00 00-00 ... A0-F3 AF-55 55-55 00-00 00-00 00-00 00-00 00-00 00-F3 AF-55 55-55 00-00 00-00 00-00 00-00 00-00 90-74 B1-55 55-55 00-00 29-00 00-00 00-00 00-00 29-00 00-00 00-00 00-00 F0-F3 AF-55 55-55 00-00>
[  FAILED  ] parseURLRelative/ParseURLRelativeTestSuite.resolve/absOverrideWithZoneId, where GetParam() = 336-byte object <21-00 00-00 00-00 00-00 60-8E 95-55 55-55 00-00 3C-00 00-00 00-00 00-00 88-8E 95-55 55-55 00-00 B0-F2 AF-55 55-55 00-00 05-00 00-00 00-00 00-00 68-74 74-70 73-00 00-00 00-00 00-00 00-00 00-00 ... A0-F3 AF-55 55-55 00-00 00-00 00-00 00-00 00-00 00-72 61-67 00-55 00-00 00-00 00-00 00-00 00-00 C0-3B B1-55 55-55 00-00 15-00 00-00 00-00 00-00 15-00 00-00 00-00 00-00 69-64 65-00 55-55 00-00>
 5 FAILED TESTS
  YOU HAVE 1 DISABLED TEST

nix-store-tests-run:
[----------] 5 tests from S3ToHttpsConversionErrors/S3ToHttpsConversionErrorTest (0 ms total)
[----------] Global test environment tear-down
[==========] 798 tests from 90 test suites ran. (1460 ms total)
[  PASSED  ] 797 tests.
[  FAILED  ] 1 test, listed below:
[  FAILED  ] StoreReferenceTest.PathInfo_ssh_unbracketed_ipv6_5_from_uri
 1 FAILED TEST
  YOU HAVE 1 DISABLED TEST

… and 1 more failed derivation
failed checks.x86_64-linux.nixos-bernie 7m 17s
nix-util-tests-run-without-new-syscalls: [ FAILED ] 5 tests, listed below: [ FAILED ] ParseURLSuccessCases/ParseURLSuccess.parsesAsExpected/5, where GetPara …
nix-util-tests-run-without-new-syscalls:
[  FAILED  ] 5 tests, listed below:
[  FAILED  ] ParseURLSuccessCases/ParseURLSuccess.parsesAsExpected/5, where GetParam() = 288-byte object <31-00 00-00 00-00 00-00 A8-86 95-55 55-55 00-00 B0-C7 B0-55 55-55 00-00 04-00 00-00 00-00 00-00 68-74 74-70 00-68 74-74 70-73 00-00 00-00 00-00 02-00 00-00 00-00 00-00 00-56 B0-55 55-55 00-00 ... 00-00 00-00 00-00 00-00 68-C8 B0-55 55-55 00-00 68-C8 B0-55 55-55 00-00 00-00 00-00 00-00 00-00 A0-C8 B0-55 55-55 00-00 00-00 00-00 00-00 00-00 00-65 6C-6C 6F-00 00-00 98-C8 B0-55 55-55 00-00>
[  FAILED  ] ParseURLSuccessCases/ParseURLSuccess.toStringRoundTrips/5, where GetParam() = 288-byte object <31-00 00-00 00-00 00-00 A8-86 95-55 55-55 00-00 B0-C7 B0-55 55-55 00-00 04-00 00-00 00-00 00-00 68-74 74-70 00-68 74-74 70-73 00-00 00-00 00-00 02-00 00-00 00-00 00-00 F0-2F B1-55 55-55 00-00 ... 00-00 00-00 00-00 00-00 68-C8 B0-55 55-55 00-00 68-C8 B0-55 55-55 00-00 00-00 00-00 00-00 00-00 A0-C8 B0-55 55-55 00-00 00-00 00-00 00-00 00-00 00-65 6C-6C 6F-00 00-00 98-C8 B0-55 55-55 00-00>
[  FAILED  ] ParseURLSuccessCases/ParseURLSuccess.makeSureFixGitURLDoesNotModify/5, where GetParam() = 288-byte object <31-00 00-00 00-00 00-00 A8-86 95-55 55-55 00-00 B0-C7 B0-55 55-55 00-00 04-00 00-00 00-00 00-00 68-74 74-70 00-68 74-74 70-73 00-00 00-00 00-00 02-00 00-00 00-00 00-00 40-55 B1-55 55-55 00-00 ... 00-00 00-00 00-00 00-00 68-C8 B0-55 55-55 00-00 68-C8 B0-55 55-55 00-00 00-00 00-00 00-00 00-00 A0-C8 B0-55 55-55 00-00 00-00 00-00 00-00 00-00 00-65 6C-6C 6F-00 00-00 98-C8 B0-55 55-55 00-00>
[  FAILED  ] parseURLRelative/ParseURLRelativeTestSuite.resolve/resolvesRelativePathIpv6AddressWithZoneId, where GetParam() = 336-byte object <3F-00 00-00 00-00 00-00 18-90 95-55 55-55 00-00 10-00 00-00 00-00 00-00 68-34 94-55 55-55 00-00 B0-F2 AF-55 55-55 00-00 04-00 00-00 00-00 00-00 68-74 74-70 00-00 00-00 00-00 00-00 00-00 00-00 ... A0-F3 AF-55 55-55 00-00 00-00 00-00 00-00 00-00 00-F3 AF-55 55-55 00-00 00-00 00-00 00-00 00-00 90-74 B1-55 55-55 00-00 29-00 00-00 00-00 00-00 29-00 00-00 00-00 00-00 F0-F3 AF-55 55-55 00-00>
[  FAILED  ] parseURLRelative/ParseURLRelativeTestSuite.resolve/absOverrideWithZoneId, where GetParam() = 336-byte object <21-00 00-00 00-00 00-00 60-8E 95-55 55-55 00-00 3C-00 00-00 00-00 00-00 88-8E 95-55 55-55 00-00 B0-F2 AF-55 55-55 00-00 05-00 00-00 00-00 00-00 68-74 74-70 73-00 00-00 00-00 00-00 00-00 00-00 ... A0-F3 AF-55 55-55 00-00 00-00 00-00 00-00 00-00 00-72 61-67 00-55 00-00 00-00 00-00 00-00 00-00 C0-3B B1-55 55-55 00-00 15-00 00-00 00-00 00-00 15-00 00-00 00-00 00-00 69-64 65-00 55-55 00-00>
 5 FAILED TESTS
  YOU HAVE 1 DISABLED TEST

nix-util-tests-run:
[  FAILED  ] 5 tests, listed below:
[  FAILED  ] ParseURLSuccessCases/ParseURLSuccess.parsesAsExpected/5, where GetParam() = 288-byte object <31-00 00-00 00-00 00-00 A8-86 95-55 55-55 00-00 B0-C7 B0-55 55-55 00-00 04-00 00-00 00-00 00-00 68-74 74-70 00-68 74-74 70-73 00-00 00-00 00-00 02-00 00-00 00-00 00-00 00-56 B0-55 55-55 00-00 ... 00-00 00-00 00-00 00-00 68-C8 B0-55 55-55 00-00 68-C8 B0-55 55-55 00-00 00-00 00-00 00-00 00-00 A0-C8 B0-55 55-55 00-00 00-00 00-00 00-00 00-00 00-65 6C-6C 6F-00 00-00 98-C8 B0-55 55-55 00-00>
[  FAILED  ] ParseURLSuccessCases/ParseURLSuccess.toStringRoundTrips/5, where GetParam() = 288-byte object <31-00 00-00 00-00 00-00 A8-86 95-55 55-55 00-00 B0-C7 B0-55 55-55 00-00 04-00 00-00 00-00 00-00 68-74 74-70 00-68 74-74 70-73 00-00 00-00 00-00 02-00 00-00 00-00 00-00 F0-2F B1-55 55-55 00-00 ... 00-00 00-00 00-00 00-00 68-C8 B0-55 55-55 00-00 68-C8 B0-55 55-55 00-00 00-00 00-00 00-00 00-00 A0-C8 B0-55 55-55 00-00 00-00 00-00 00-00 00-00 00-65 6C-6C 6F-00 00-00 98-C8 B0-55 55-55 00-00>
[  FAILED  ] ParseURLSuccessCases/ParseURLSuccess.makeSureFixGitURLDoesNotModify/5, where GetParam() = 288-byte object <31-00 00-00 00-00 00-00 A8-86 95-55 55-55 00-00 B0-C7 B0-55 55-55 00-00 04-00 00-00 00-00 00-00 68-74 74-70 00-68 74-74 70-73 00-00 00-00 00-00 02-00 00-00 00-00 00-00 40-55 B1-55 55-55 00-00 ... 00-00 00-00 00-00 00-00 68-C8 B0-55 55-55 00-00 68-C8 B0-55 55-55 00-00 00-00 00-00 00-00 00-00 A0-C8 B0-55 55-55 00-00 00-00 00-00 00-00 00-00 00-65 6C-6C 6F-00 00-00 98-C8 B0-55 55-55 00-00>
[  FAILED  ] parseURLRelative/ParseURLRelativeTestSuite.resolve/resolvesRelativePathIpv6AddressWithZoneId, where GetParam() = 336-byte object <3F-00 00-00 00-00 00-00 18-90 95-55 55-55 00-00 10-00 00-00 00-00 00-00 68-34 94-55 55-55 00-00 B0-F2 AF-55 55-55 00-00 04-00 00-00 00-00 00-00 68-74 74-70 00-00 00-00 00-00 00-00 00-00 00-00 ... A0-F3 AF-55 55-55 00-00 00-00 00-00 00-00 00-00 00-F3 AF-55 55-55 00-00 00-00 00-00 00-00 00-00 90-74 B1-55 55-55 00-00 29-00 00-00 00-00 00-00 29-00 00-00 00-00 00-00 F0-F3 AF-55 55-55 00-00>
[  FAILED  ] parseURLRelative/ParseURLRelativeTestSuite.resolve/absOverrideWithZoneId, where GetParam() = 336-byte object <21-00 00-00 00-00 00-00 60-8E 95-55 55-55 00-00 3C-00 00-00 00-00 00-00 88-8E 95-55 55-55 00-00 B0-F2 AF-55 55-55 00-00 05-00 00-00 00-00 00-00 68-74 74-70 73-00 00-00 00-00 00-00 00-00 00-00 ... A0-F3 AF-55 55-55 00-00 00-00 00-00 00-00 00-00 00-72 61-67 00-55 00-00 00-00 00-00 00-00 00-00 C0-3B B1-55 55-55 00-00 15-00 00-00 00-00 00-00 15-00 00-00 00-00 00-00 69-64 65-00 55-55 00-00>
 5 FAILED TESTS
  YOU HAVE 1 DISABLED TEST

nix-store-tests-run:
[----------] 5 tests from S3ToHttpsConversionErrors/S3ToHttpsConversionErrorTest (0 ms total)
[----------] Global test environment tear-down
[==========] 798 tests from 90 test suites ran. (1518 ms total)
[  PASSED  ] 797 tests.
[  FAILED  ] 1 test, listed below:
[  FAILED  ] StoreReferenceTest.PathInfo_ssh_unbracketed_ipv6_5_from_uri
 1 FAILED TEST
  YOU HAVE 1 DISABLED TEST
failed checks.x86_64-linux.nixos-dorits-laptop 7m 22s
nix-util-tests-run-without-new-syscalls: [ FAILED ] 5 tests, listed below: [ FAILED ] ParseURLSuccessCases/ParseURLSuccess.parsesAsExpected/5, where GetPara …
nix-util-tests-run-without-new-syscalls:
[  FAILED  ] 5 tests, listed below:
[  FAILED  ] ParseURLSuccessCases/ParseURLSuccess.parsesAsExpected/5, where GetParam() = 288-byte object <31-00 00-00 00-00 00-00 A8-86 95-55 55-55 00-00 B0-C7 B0-55 55-55 00-00 04-00 00-00 00-00 00-00 68-74 74-70 00-68 74-74 70-73 00-00 00-00 00-00 02-00 00-00 00-00 00-00 00-56 B0-55 55-55 00-00 ... 00-00 00-00 00-00 00-00 68-C8 B0-55 55-55 00-00 68-C8 B0-55 55-55 00-00 00-00 00-00 00-00 00-00 A0-C8 B0-55 55-55 00-00 00-00 00-00 00-00 00-00 00-65 6C-6C 6F-00 00-00 98-C8 B0-55 55-55 00-00>
[  FAILED  ] ParseURLSuccessCases/ParseURLSuccess.toStringRoundTrips/5, where GetParam() = 288-byte object <31-00 00-00 00-00 00-00 A8-86 95-55 55-55 00-00 B0-C7 B0-55 55-55 00-00 04-00 00-00 00-00 00-00 68-74 74-70 00-68 74-74 70-73 00-00 00-00 00-00 02-00 00-00 00-00 00-00 F0-2F B1-55 55-55 00-00 ... 00-00 00-00 00-00 00-00 68-C8 B0-55 55-55 00-00 68-C8 B0-55 55-55 00-00 00-00 00-00 00-00 00-00 A0-C8 B0-55 55-55 00-00 00-00 00-00 00-00 00-00 00-65 6C-6C 6F-00 00-00 98-C8 B0-55 55-55 00-00>
[  FAILED  ] ParseURLSuccessCases/ParseURLSuccess.makeSureFixGitURLDoesNotModify/5, where GetParam() = 288-byte object <31-00 00-00 00-00 00-00 A8-86 95-55 55-55 00-00 B0-C7 B0-55 55-55 00-00 04-00 00-00 00-00 00-00 68-74 74-70 00-68 74-74 70-73 00-00 00-00 00-00 02-00 00-00 00-00 00-00 40-55 B1-55 55-55 00-00 ... 00-00 00-00 00-00 00-00 68-C8 B0-55 55-55 00-00 68-C8 B0-55 55-55 00-00 00-00 00-00 00-00 00-00 A0-C8 B0-55 55-55 00-00 00-00 00-00 00-00 00-00 00-65 6C-6C 6F-00 00-00 98-C8 B0-55 55-55 00-00>
[  FAILED  ] parseURLRelative/ParseURLRelativeTestSuite.resolve/resolvesRelativePathIpv6AddressWithZoneId, where GetParam() = 336-byte object <3F-00 00-00 00-00 00-00 18-90 95-55 55-55 00-00 10-00 00-00 00-00 00-00 68-34 94-55 55-55 00-00 B0-F2 AF-55 55-55 00-00 04-00 00-00 00-00 00-00 68-74 74-70 00-00 00-00 00-00 00-00 00-00 00-00 ... A0-F3 AF-55 55-55 00-00 00-00 00-00 00-00 00-00 00-F3 AF-55 55-55 00-00 00-00 00-00 00-00 00-00 90-74 B1-55 55-55 00-00 29-00 00-00 00-00 00-00 29-00 00-00 00-00 00-00 F0-F3 AF-55 55-55 00-00>
[  FAILED  ] parseURLRelative/ParseURLRelativeTestSuite.resolve/absOverrideWithZoneId, where GetParam() = 336-byte object <21-00 00-00 00-00 00-00 60-8E 95-55 55-55 00-00 3C-00 00-00 00-00 00-00 88-8E 95-55 55-55 00-00 B0-F2 AF-55 55-55 00-00 05-00 00-00 00-00 00-00 68-74 74-70 73-00 00-00 00-00 00-00 00-00 00-00 ... A0-F3 AF-55 55-55 00-00 00-00 00-00 00-00 00-00 00-72 61-67 00-55 00-00 00-00 00-00 00-00 00-00 C0-3B B1-55 55-55 00-00 15-00 00-00 00-00 00-00 15-00 00-00 00-00 00-00 69-64 65-00 55-55 00-00>
 5 FAILED TESTS
  YOU HAVE 1 DISABLED TEST

nix-util-tests-run:
[  FAILED  ] 5 tests, listed below:
[  FAILED  ] ParseURLSuccessCases/ParseURLSuccess.parsesAsExpected/5, where GetParam() = 288-byte object <31-00 00-00 00-00 00-00 A8-86 95-55 55-55 00-00 B0-C7 B0-55 55-55 00-00 04-00 00-00 00-00 00-00 68-74 74-70 00-68 74-74 70-73 00-00 00-00 00-00 02-00 00-00 00-00 00-00 00-56 B0-55 55-55 00-00 ... 00-00 00-00 00-00 00-00 68-C8 B0-55 55-55 00-00 68-C8 B0-55 55-55 00-00 00-00 00-00 00-00 00-00 A0-C8 B0-55 55-55 00-00 00-00 00-00 00-00 00-00 00-65 6C-6C 6F-00 00-00 98-C8 B0-55 55-55 00-00>
[  FAILED  ] ParseURLSuccessCases/ParseURLSuccess.toStringRoundTrips/5, where GetParam() = 288-byte object <31-00 00-00 00-00 00-00 A8-86 95-55 55-55 00-00 B0-C7 B0-55 55-55 00-00 04-00 00-00 00-00 00-00 68-74 74-70 00-68 74-74 70-73 00-00 00-00 00-00 02-00 00-00 00-00 00-00 F0-2F B1-55 55-55 00-00 ... 00-00 00-00 00-00 00-00 68-C8 B0-55 55-55 00-00 68-C8 B0-55 55-55 00-00 00-00 00-00 00-00 00-00 A0-C8 B0-55 55-55 00-00 00-00 00-00 00-00 00-00 00-65 6C-6C 6F-00 00-00 98-C8 B0-55 55-55 00-00>
[  FAILED  ] ParseURLSuccessCases/ParseURLSuccess.makeSureFixGitURLDoesNotModify/5, where GetParam() = 288-byte object <31-00 00-00 00-00 00-00 A8-86 95-55 55-55 00-00 B0-C7 B0-55 55-55 00-00 04-00 00-00 00-00 00-00 68-74 74-70 00-68 74-74 70-73 00-00 00-00 00-00 02-00 00-00 00-00 00-00 40-55 B1-55 55-55 00-00 ... 00-00 00-00 00-00 00-00 68-C8 B0-55 55-55 00-00 68-C8 B0-55 55-55 00-00 00-00 00-00 00-00 00-00 A0-C8 B0-55 55-55 00-00 00-00 00-00 00-00 00-00 00-65 6C-6C 6F-00 00-00 98-C8 B0-55 55-55 00-00>
[  FAILED  ] parseURLRelative/ParseURLRelativeTestSuite.resolve/resolvesRelativePathIpv6AddressWithZoneId, where GetParam() = 336-byte object <3F-00 00-00 00-00 00-00 18-90 95-55 55-55 00-00 10-00 00-00 00-00 00-00 68-34 94-55 55-55 00-00 B0-F2 AF-55 55-55 00-00 04-00 00-00 00-00 00-00 68-74 74-70 00-00 00-00 00-00 00-00 00-00 00-00 ... A0-F3 AF-55 55-55 00-00 00-00 00-00 00-00 00-00 00-F3 AF-55 55-55 00-00 00-00 00-00 00-00 00-00 90-74 B1-55 55-55 00-00 29-00 00-00 00-00 00-00 29-00 00-00 00-00 00-00 F0-F3 AF-55 55-55 00-00>
[  FAILED  ] parseURLRelative/ParseURLRelativeTestSuite.resolve/absOverrideWithZoneId, where GetParam() = 336-byte object <21-00 00-00 00-00 00-00 60-8E 95-55 55-55 00-00 3C-00 00-00 00-00 00-00 88-8E 95-55 55-55 00-00 B0-F2 AF-55 55-55 00-00 05-00 00-00 00-00 00-00 68-74 74-70 73-00 00-00 00-00 00-00 00-00 00-00 ... A0-F3 AF-55 55-55 00-00 00-00 00-00 00-00 00-00 00-72 61-67 00-55 00-00 00-00 00-00 00-00 00-00 C0-3B B1-55 55-55 00-00 15-00 00-00 00-00 00-00 15-00 00-00 00-00 00-00 69-64 65-00 55-55 00-00>
 5 FAILED TESTS
  YOU HAVE 1 DISABLED TEST

nix-store-tests-run:
[----------] 5 tests from S3ToHttpsConversionErrors/S3ToHttpsConversionErrorTest (0 ms total)
[----------] Global test environment tear-down
[==========] 798 tests from 90 test suites ran. (1489 ms total)
[  PASSED  ] 797 tests.
[  FAILED  ] 1 test, listed below:
[  FAILED  ] StoreReferenceTest.PathInfo_ssh_unbracketed_ipv6_5_from_uri
 1 FAILED TEST
  YOU HAVE 1 DISABLED TEST
failed checks.x86_64-linux.nixos-eva 17m 11s
nix-util-tests-run-without-new-syscalls: [ FAILED ] 5 tests, listed below: [ FAILED ] ParseURLSuccessCases/ParseURLSuccess.parsesAsExpected/5, where GetPara …
nix-util-tests-run-without-new-syscalls:
[  FAILED  ] 5 tests, listed below:
[  FAILED  ] ParseURLSuccessCases/ParseURLSuccess.parsesAsExpected/5, where GetParam() = 288-byte object <31-00 00-00 00-00 00-00 10-BE E4-AA AA-AA 00-00 00-B1 FF-AA AA-AA 00-00 04-00 00-00 00-00 00-00 68-74 74-70 00-68 74-74 70-73 00-00 00-00 00-00 02-00 00-00 00-00 00-00 10-FC FE-AA AA-AA 00-00 ... 00-00 00-00 00-00 00-00 B8-B1 FF-AA AA-AA 00-00 B8-B1 FF-AA AA-AA 00-00 00-00 00-00 00-00 00-00 F0-B1 FF-AA AA-AA 00-00 00-00 00-00 00-00 00-00 00-65 6C-6C 6F-00 00-00 E8-B1 FF-AA AA-AA 00-00>
[  FAILED  ] ParseURLSuccessCases/ParseURLSuccess.toStringRoundTrips/5, where GetParam() = 288-byte object <31-00 00-00 00-00 00-00 10-BE E4-AA AA-AA 00-00 00-B1 FF-AA AA-AA 00-00 04-00 00-00 00-00 00-00 68-74 74-70 00-68 74-74 70-73 00-00 00-00 00-00 02-00 00-00 00-00 00-00 60-1B 00-AB AA-AA 00-00 ... 00-00 00-00 00-00 00-00 B8-B1 FF-AA AA-AA 00-00 B8-B1 FF-AA AA-AA 00-00 00-00 00-00 00-00 00-00 F0-B1 FF-AA AA-AA 00-00 00-00 00-00 00-00 00-00 00-65 6C-6C 6F-00 00-00 E8-B1 FF-AA AA-AA 00-00>
[  FAILED  ] ParseURLSuccessCases/ParseURLSuccess.makeSureFixGitURLDoesNotModify/5, where GetParam() = 288-byte object <31-00 00-00 00-00 00-00 10-BE E4-AA AA-AA 00-00 00-B1 FF-AA AA-AA 00-00 04-00 00-00 00-00 00-00 68-74 74-70 00-68 74-74 70-73 00-00 00-00 00-00 02-00 00-00 00-00 00-00 C0-3F 00-AB AA-AA 00-00 ... 00-00 00-00 00-00 00-00 B8-B1 FF-AA AA-AA 00-00 B8-B1 FF-AA AA-AA 00-00 00-00 00-00 00-00 00-00 F0-B1 FF-AA AA-AA 00-00 00-00 00-00 00-00 00-00 00-65 6C-6C 6F-00 00-00 E8-B1 FF-AA AA-AA 00-00>
[  FAILED  ] parseURLRelative/ParseURLRelativeTestSuite.resolve/resolvesRelativePathIpv6AddressWithZoneId, where GetParam() = 336-byte object <3F-00 00-00 00-00 00-00 D8-C9 E4-AA AA-AA 00-00 10-00 00-00 00-00 00-00 18-CA E4-AA AA-AA 00-00 E0-4D FF-AA AA-AA 00-00 04-00 00-00 00-00 00-00 68-74 74-70 00-00 00-00 01-00 00-00 00-00 00-00 ... D0-4E FF-AA AA-AA 00-00 00-00 00-00 00-00 00-00 00-4E FF-AA AA-AA 00-00 00-00 00-00 00-00 00-00 A0-5E 00-AB AA-AA 00-00 29-00 00-00 00-00 00-00 29-00 00-00 00-00 00-00 30-96 FE-AA AA-AA 00-00>
[  FAILED  ] parseURLRelative/ParseURLRelativeTestSuite.resolve/absOverrideWithZoneId, where GetParam() = 336-byte object <21-00 00-00 00-00 00-00 18-CC E4-AA AA-AA 00-00 3C-00 00-00 00-00 00-00 80-CC E4-AA AA-AA 00-00 E0-4D FF-AA AA-AA 00-00 05-00 00-00 00-00 00-00 68-74 74-70 73-00 00-00 01-00 00-00 00-00 00-00 ... D0-4E FF-AA AA-AA 00-00 00-00 00-00 00-00 00-00 00-72 61-67 00-AA 00-00 00-00 00-00 00-00 00-00 10-2A 00-AB AA-AA 00-00 15-00 00-00 00-00 00-00 15-00 00-00 00-00 00-00 69-64 65-00 AA-AA 00-00>
 5 FAILED TESTS
  YOU HAVE 1 DISABLED TEST

nix-util-tests-run:
[  FAILED  ] 5 tests, listed below:
[  FAILED  ] ParseURLSuccessCases/ParseURLSuccess.parsesAsExpected/5, where GetParam() = 288-byte object <31-00 00-00 00-00 00-00 10-BE E4-AA AA-AA 00-00 00-B1 FF-AA AA-AA 00-00 04-00 00-00 00-00 00-00 68-74 74-70 00-68 74-74 70-73 00-00 00-00 00-00 02-00 00-00 00-00 00-00 10-FC FE-AA AA-AA 00-00 ... 00-00 00-00 00-00 00-00 B8-B1 FF-AA AA-AA 00-00 B8-B1 FF-AA AA-AA 00-00 00-00 00-00 00-00 00-00 F0-B1 FF-AA AA-AA 00-00 00-00 00-00 00-00 00-00 00-65 6C-6C 6F-00 00-00 E8-B1 FF-AA AA-AA 00-00>
[  FAILED  ] ParseURLSuccessCases/ParseURLSuccess.toStringRoundTrips/5, where GetParam() = 288-byte object <31-00 00-00 00-00 00-00 10-BE E4-AA AA-AA 00-00 00-B1 FF-AA AA-AA 00-00 04-00 00-00 00-00 00-00 68-74 74-70 00-68 74-74 70-73 00-00 00-00 00-00 02-00 00-00 00-00 00-00 60-1B 00-AB AA-AA 00-00 ... 00-00 00-00 00-00 00-00 B8-B1 FF-AA AA-AA 00-00 B8-B1 FF-AA AA-AA 00-00 00-00 00-00 00-00 00-00 F0-B1 FF-AA AA-AA 00-00 00-00 00-00 00-00 00-00 00-65 6C-6C 6F-00 00-00 E8-B1 FF-AA AA-AA 00-00>
[  FAILED  ] ParseURLSuccessCases/ParseURLSuccess.makeSureFixGitURLDoesNotModify/5, where GetParam() = 288-byte object <31-00 00-00 00-00 00-00 10-BE E4-AA AA-AA 00-00 00-B1 FF-AA AA-AA 00-00 04-00 00-00 00-00 00-00 68-74 74-70 00-68 74-74 70-73 00-00 00-00 00-00 02-00 00-00 00-00 00-00 C0-3F 00-AB AA-AA 00-00 ... 00-00 00-00 00-00 00-00 B8-B1 FF-AA AA-AA 00-00 B8-B1 FF-AA AA-AA 00-00 00-00 00-00 00-00 00-00 F0-B1 FF-AA AA-AA 00-00 00-00 00-00 00-00 00-00 00-65 6C-6C 6F-00 00-00 E8-B1 FF-AA AA-AA 00-00>
[  FAILED  ] parseURLRelative/ParseURLRelativeTestSuite.resolve/resolvesRelativePathIpv6AddressWithZoneId, where GetParam() = 336-byte object <3F-00 00-00 00-00 00-00 D8-C9 E4-AA AA-AA 00-00 10-00 00-00 00-00 00-00 18-CA E4-AA AA-AA 00-00 E0-4D FF-AA AA-AA 00-00 04-00 00-00 00-00 00-00 68-74 74-70 00-00 00-00 01-00 00-00 00-00 00-00 ... D0-4E FF-AA AA-AA 00-00 00-00 00-00 00-00 00-00 00-4E FF-AA AA-AA 00-00 00-00 00-00 00-00 00-00 A0-5E 00-AB AA-AA 00-00 29-00 00-00 00-00 00-00 29-00 00-00 00-00 00-00 30-96 FE-AA AA-AA 00-00>
[  FAILED  ] parseURLRelative/ParseURLRelativeTestSuite.resolve/absOverrideWithZoneId, where GetParam() = 336-byte object <21-00 00-00 00-00 00-00 18-CC E4-AA AA-AA 00-00 3C-00 00-00 00-00 00-00 80-CC E4-AA AA-AA 00-00 E0-4D FF-AA AA-AA 00-00 05-00 00-00 00-00 00-00 68-74 74-70 73-00 00-00 01-00 00-00 00-00 00-00 ... D0-4E FF-AA AA-AA 00-00 00-00 00-00 00-00 00-00 00-72 61-67 00-AA 00-00 00-00 00-00 00-00 00-00 10-2A 00-AB AA-AA 00-00 15-00 00-00 00-00 00-00 15-00 00-00 00-00 00-00 69-64 65-00 AA-AA 00-00>
 5 FAILED TESTS
  YOU HAVE 1 DISABLED TEST

nix-store-tests-run:
[----------] 5 tests from S3ToHttpsConversionErrors/S3ToHttpsConversionErrorTest (0 ms total)
[----------] Global test environment tear-down
[==========] 798 tests from 90 test suites ran. (1690 ms total)
[  PASSED  ] 797 tests.
[  FAILED  ] 1 test, listed below:
[  FAILED  ] StoreReferenceTest.PathInfo_ssh_unbracketed_ipv6_5_from_uri
 1 FAILED TEST
  YOU HAVE 1 DISABLED TEST
failed eval checks.x86_64-linux.nixos-jacquardmachine
error: … while evaluating a branch condition at «string»:25:5: 24| v: 25| if !builtins.isAttrs v || isDrv v then …
error:
       … while evaluating a branch condition
         at «string»:25:5:
           24|     v:
           25|     if !builtins.isAttrs v || isDrv v then
             |     ^
           26|       v

       … in the left operand of the OR (||) operator
         at «string»:25:28:
           24|     v:
           25|     if !builtins.isAttrs v || isDrv v then
             |                            ^
           26|       v

       … while evaluating the option `system.build.toplevel':

       … while evaluating definitions from `/nix/store/5x23x1akdim64im7bq7wsqy3j723wjzr-source/nixos/modules/system/activation/top-level.nix':

       (stack trace truncated; use '--show-trace' to show the full, detailed trace)

       error:
       Failed assertions:
       - The option definition `services.journald.extraConfig' in `/nix/store/30r3sfk9z7jp7agf1p8hi3jfwacjsv50-source/nixosModules/workstation.nix' no longer has any effect; please remove it.
       Use services.journald.settings.Journal instead.
failed checks.x86_64-linux.nixos-matchbox 7m 8s
nix-util-tests-run-without-new-syscalls: [ FAILED ] 5 tests, listed below: [ FAILED ] ParseURLSuccessCases/ParseURLSuccess.parsesAsExpected/5, where GetPara …
nix-util-tests-run-without-new-syscalls:
[  FAILED  ] 5 tests, listed below:
[  FAILED  ] ParseURLSuccessCases/ParseURLSuccess.parsesAsExpected/5, where GetParam() = 288-byte object <31-00 00-00 00-00 00-00 A8-86 95-55 55-55 00-00 B0-C7 B0-55 55-55 00-00 04-00 00-00 00-00 00-00 68-74 74-70 00-68 74-74 70-73 00-00 00-00 00-00 02-00 00-00 00-00 00-00 00-56 B0-55 55-55 00-00 ... 00-00 00-00 00-00 00-00 68-C8 B0-55 55-55 00-00 68-C8 B0-55 55-55 00-00 00-00 00-00 00-00 00-00 A0-C8 B0-55 55-55 00-00 00-00 00-00 00-00 00-00 00-65 6C-6C 6F-00 00-00 98-C8 B0-55 55-55 00-00>
[  FAILED  ] ParseURLSuccessCases/ParseURLSuccess.toStringRoundTrips/5, where GetParam() = 288-byte object <31-00 00-00 00-00 00-00 A8-86 95-55 55-55 00-00 B0-C7 B0-55 55-55 00-00 04-00 00-00 00-00 00-00 68-74 74-70 00-68 74-74 70-73 00-00 00-00 00-00 02-00 00-00 00-00 00-00 F0-2F B1-55 55-55 00-00 ... 00-00 00-00 00-00 00-00 68-C8 B0-55 55-55 00-00 68-C8 B0-55 55-55 00-00 00-00 00-00 00-00 00-00 A0-C8 B0-55 55-55 00-00 00-00 00-00 00-00 00-00 00-65 6C-6C 6F-00 00-00 98-C8 B0-55 55-55 00-00>
[  FAILED  ] ParseURLSuccessCases/ParseURLSuccess.makeSureFixGitURLDoesNotModify/5, where GetParam() = 288-byte object <31-00 00-00 00-00 00-00 A8-86 95-55 55-55 00-00 B0-C7 B0-55 55-55 00-00 04-00 00-00 00-00 00-00 68-74 74-70 00-68 74-74 70-73 00-00 00-00 00-00 02-00 00-00 00-00 00-00 40-55 B1-55 55-55 00-00 ... 00-00 00-00 00-00 00-00 68-C8 B0-55 55-55 00-00 68-C8 B0-55 55-55 00-00 00-00 00-00 00-00 00-00 A0-C8 B0-55 55-55 00-00 00-00 00-00 00-00 00-00 00-65 6C-6C 6F-00 00-00 98-C8 B0-55 55-55 00-00>
[  FAILED  ] parseURLRelative/ParseURLRelativeTestSuite.resolve/resolvesRelativePathIpv6AddressWithZoneId, where GetParam() = 336-byte object <3F-00 00-00 00-00 00-00 18-90 95-55 55-55 00-00 10-00 00-00 00-00 00-00 68-34 94-55 55-55 00-00 B0-F2 AF-55 55-55 00-00 04-00 00-00 00-00 00-00 68-74 74-70 00-00 00-00 00-00 00-00 00-00 00-00 ... A0-F3 AF-55 55-55 00-00 00-00 00-00 00-00 00-00 00-F3 AF-55 55-55 00-00 00-00 00-00 00-00 00-00 90-74 B1-55 55-55 00-00 29-00 00-00 00-00 00-00 29-00 00-00 00-00 00-00 F0-F3 AF-55 55-55 00-00>
[  FAILED  ] parseURLRelative/ParseURLRelativeTestSuite.resolve/absOverrideWithZoneId, where GetParam() = 336-byte object <21-00 00-00 00-00 00-00 60-8E 95-55 55-55 00-00 3C-00 00-00 00-00 00-00 88-8E 95-55 55-55 00-00 B0-F2 AF-55 55-55 00-00 05-00 00-00 00-00 00-00 68-74 74-70 73-00 00-00 00-00 00-00 00-00 00-00 ... A0-F3 AF-55 55-55 00-00 00-00 00-00 00-00 00-00 00-72 61-67 00-55 00-00 00-00 00-00 00-00 00-00 C0-3B B1-55 55-55 00-00 15-00 00-00 00-00 00-00 15-00 00-00 00-00 00-00 69-64 65-00 55-55 00-00>
 5 FAILED TESTS
  YOU HAVE 1 DISABLED TEST

nix-util-tests-run:
[  FAILED  ] 5 tests, listed below:
[  FAILED  ] ParseURLSuccessCases/ParseURLSuccess.parsesAsExpected/5, where GetParam() = 288-byte object <31-00 00-00 00-00 00-00 A8-86 95-55 55-55 00-00 B0-C7 B0-55 55-55 00-00 04-00 00-00 00-00 00-00 68-74 74-70 00-68 74-74 70-73 00-00 00-00 00-00 02-00 00-00 00-00 00-00 00-56 B0-55 55-55 00-00 ... 00-00 00-00 00-00 00-00 68-C8 B0-55 55-55 00-00 68-C8 B0-55 55-55 00-00 00-00 00-00 00-00 00-00 A0-C8 B0-55 55-55 00-00 00-00 00-00 00-00 00-00 00-65 6C-6C 6F-00 00-00 98-C8 B0-55 55-55 00-00>
[  FAILED  ] ParseURLSuccessCases/ParseURLSuccess.toStringRoundTrips/5, where GetParam() = 288-byte object <31-00 00-00 00-00 00-00 A8-86 95-55 55-55 00-00 B0-C7 B0-55 55-55 00-00 04-00 00-00 00-00 00-00 68-74 74-70 00-68 74-74 70-73 00-00 00-00 00-00 02-00 00-00 00-00 00-00 F0-2F B1-55 55-55 00-00 ... 00-00 00-00 00-00 00-00 68-C8 B0-55 55-55 00-00 68-C8 B0-55 55-55 00-00 00-00 00-00 00-00 00-00 A0-C8 B0-55 55-55 00-00 00-00 00-00 00-00 00-00 00-65 6C-6C 6F-00 00-00 98-C8 B0-55 55-55 00-00>
[  FAILED  ] ParseURLSuccessCases/ParseURLSuccess.makeSureFixGitURLDoesNotModify/5, where GetParam() = 288-byte object <31-00 00-00 00-00 00-00 A8-86 95-55 55-55 00-00 B0-C7 B0-55 55-55 00-00 04-00 00-00 00-00 00-00 68-74 74-70 00-68 74-74 70-73 00-00 00-00 00-00 02-00 00-00 00-00 00-00 40-55 B1-55 55-55 00-00 ... 00-00 00-00 00-00 00-00 68-C8 B0-55 55-55 00-00 68-C8 B0-55 55-55 00-00 00-00 00-00 00-00 00-00 A0-C8 B0-55 55-55 00-00 00-00 00-00 00-00 00-00 00-65 6C-6C 6F-00 00-00 98-C8 B0-55 55-55 00-00>
[  FAILED  ] parseURLRelative/ParseURLRelativeTestSuite.resolve/resolvesRelativePathIpv6AddressWithZoneId, where GetParam() = 336-byte object <3F-00 00-00 00-00 00-00 18-90 95-55 55-55 00-00 10-00 00-00 00-00 00-00 68-34 94-55 55-55 00-00 B0-F2 AF-55 55-55 00-00 04-00 00-00 00-00 00-00 68-74 74-70 00-00 00-00 00-00 00-00 00-00 00-00 ... A0-F3 AF-55 55-55 00-00 00-00 00-00 00-00 00-00 00-F3 AF-55 55-55 00-00 00-00 00-00 00-00 00-00 90-74 B1-55 55-55 00-00 29-00 00-00 00-00 00-00 29-00 00-00 00-00 00-00 F0-F3 AF-55 55-55 00-00>
[  FAILED  ] parseURLRelative/ParseURLRelativeTestSuite.resolve/absOverrideWithZoneId, where GetParam() = 336-byte object <21-00 00-00 00-00 00-00 60-8E 95-55 55-55 00-00 3C-00 00-00 00-00 00-00 88-8E 95-55 55-55 00-00 B0-F2 AF-55 55-55 00-00 05-00 00-00 00-00 00-00 68-74 74-70 73-00 00-00 00-00 00-00 00-00 00-00 ... A0-F3 AF-55 55-55 00-00 00-00 00-00 00-00 00-00 00-72 61-67 00-55 00-00 00-00 00-00 00-00 00-00 C0-3B B1-55 55-55 00-00 15-00 00-00 00-00 00-00 15-00 00-00 00-00 00-00 69-64 65-00 55-55 00-00>
 5 FAILED TESTS
  YOU HAVE 1 DISABLED TEST

nix-store-tests-run:
[----------] 5 tests from S3ToHttpsConversionErrors/S3ToHttpsConversionErrorTest (0 ms total)
[----------] Global test environment tear-down
[==========] 798 tests from 90 test suites ran. (1458 ms total)
[  PASSED  ] 797 tests.
[  FAILED  ] 1 test, listed below:
[  FAILED  ] StoreReferenceTest.PathInfo_ssh_unbracketed_ipv6_5_from_uri
 1 FAILED TEST
  YOU HAVE 1 DISABLED TEST
failed eval checks.x86_64-linux.nixos-turingmachine
error: … while evaluating a branch condition at «string»:25:5: 24| v: 25| if !builtins.isAttrs v || isDrv v then …
error:
       … while evaluating a branch condition
         at «string»:25:5:
           24|     v:
           25|     if !builtins.isAttrs v || isDrv v then
             |     ^
           26|       v

       … in the left operand of the OR (||) operator
         at «string»:25:28:
           24|     v:
           25|     if !builtins.isAttrs v || isDrv v then
             |                            ^
           26|       v

       … while evaluating the option `system.build.toplevel':

       … while evaluating definitions from `/nix/store/5x23x1akdim64im7bq7wsqy3j723wjzr-source/nixos/modules/system/activation/top-level.nix':

       (stack trace truncated; use '--show-trace' to show the full, detailed trace)

       error:
       Failed assertions:
       - The option definition `services.journald.extraConfig' in `/nix/store/30r3sfk9z7jp7agf1p8hi3jfwacjsv50-source/nixosModules/workstation.nix' no longer has any effect; please remove it.
       Use services.journald.settings.Journal instead.
failed checks.x86_64-linux.package-app-windows-extension 1s
app-windows-1.16: tribuchet: building on jamie no configure script, doing nothing jsconfig.json(8,15): error TS6046: Argument for '--module' option must be: 'co …
app-windows-1.16:
tribuchet: building on jamie
no configure script, doing nothing
jsconfig.json(8,15): error TS6046: Argument for '--module' option must be: 'commonjs', 'es6', 'es2015', 'es2020', 'es2022', 'esnext', 'node16', 'node18', 'node20', 'nodenext', 'preserve'.
240 succeeded
succeeded attributes
status attribute duration
loading…
3 already built
skipped attributes
status attribute duration
loading…