setup
checks.x86_64-linux.nixos-matchbox
· build #600
· raw
1these 37 derivations will be built:2 /nix/store/jna1xqxfq1v5wpck4z3qn8bnj9wmd9ch-nix-util-tests-run-without-new-syscalls.drv3 /nix/store/pywn97agf1aqg32llx7x0qi7gdd9yvhq-nix-store-tests-run.drv4 /nix/store/wdlzb0mq8kr7ixw4nkwkam6ijbkzdhb7-nix-util-tests-run.drv5 /nix/store/dpbmzyi65g0hwvj6g8669f62cc96s4lr-nix-2.36.0pre20260916_1de45ba.drv6 /nix/store/w0883kc1z6dljmrn6ylnbmqhma69py3y-unit-script-nix-gc-start.drv7 /nix/store/0c5k3547p45n0nmwzybmkqmbni0vvc7m-unit-nix-gc.service.drv8 /nix/store/3fkrmlg888561wnl10bb60g9zr30w9yl-nixos-rebuild-ng-26.11.drv9 /nix/store/kc36sra7230l1gsjnnfh07g3d4hbawm6-nixos-option-26.11.drv10 /nix/store/ja7172sfrzg56d8jamil7iki079d3yih-system-path.drv11 /nix/store/ipjncylbvjjzvgaybjf1ysqzb0z8qv8c-dbus-1.drv12 /nix/store/ra7ynzby8kwi2wflpb400728id3phik2-X-Restart-Triggers-dbus-broker.drv13 /nix/store/6rc6n35cwy2xl536l7q6pbgh2znvsgcc-unit-dbus-broker.service.drv14 /nix/store/1wanrq4krs4gi6c5n1alssipb9j2k1kn-user-units.drv15 /nix/store/264q86rc8pgsddipjj9ar5jkzjghgm6n-unit-harmonia-gc.service.drv16 /nix/store/2w0vrz5yy7jd6jbhfvj88wjcg1mqmd4y-unit-nix-optimise.service.drv17 /nix/store/3rax01746zvpx9ql8iha2s0ij4zv7pvn-config.toml.drv18 /nix/store/anr3cd9r3abpph6m5yxw4fms9zdnl3my-tmpfiles.d.drv19 /nix/store/4m8sfxd0lb2mjf8603dziif66m1irlhp-X-Restart-Triggers-systemd-tmpfiles-resetup.drv20 /nix/store/6gc6rrmxhhfz4zi7mhrgawzvwxn7qmjb-user-generators.drv21 /nix/store/8n9cspnyv5vwkpj0m47i80l23qpimr4c-system-generators.drv22 /nix/store/8sq6zqnpkr2fxrmdx3y9ja0ppig12rbl-unit-telegraf.service.drv23 /nix/store/dwcvghspj4yg8a53a71bmvdsv7yb9vn5-unit-systemd-tmpfiles-resetup.service.drv24 /nix/store/z54bnc5j0c9x58b03dk95aybkqrl7580-nix.conf.drv25 /nix/store/g5qs928a590bj9a1briszl4pi97dn701-X-Restart-Triggers-nix-daemon.drv26 /nix/store/dzhmgqbbcjmgxxkgfw94l7hxs07wzslj-unit-nix-daemon.service.drv27 /nix/store/h6qfxmdlq9c5vgk4vi9v6v7zy4h203aq-system-crontab.drv28 /nix/store/wp7b3hisna454c79kn1l1s7a68rsscms-unit-script-update-prefetch-start.drv29 /nix/store/lh7y2vw9zq406cw9fc4blg62102sqqap-unit-update-prefetch.service.drv30 /nix/store/q8pc4dmgirbnx37zwd5lk4fs091bv928-unit-dbus-broker.service.drv31 /nix/store/qgzxj0lmrzb2np8cna2s6b5b55fdzr1y-system-units.drv32 /nix/store/swzh93fbxws58z849wjfzk1b24272mzl-crontabs.drv33 /nix/store/xw107nhvhxvfaag435608db7g5r4hryj-system-shutdown.drv34 /nix/store/rbpcnc5305yc9kzwy4xnwyk81b7s6zwr-etc.drv35 /nix/store/kh2mq01pv71j7yyjr1403b1f3yzrrm03-activate.drv36 /nix/store/nw3fy8m0nn5glzndcq67gkdhc07gbdgv-systemd-boot.drv37 /nix/store/l4cb01a6apx5s8j5siyjdgz2vc01vlhh-install-systemd-boot.sh.drv38 /nix/store/jkaqzn2dnrs4j3d184ri7wvs5cwmk02k-nixos-system-matchbox-26.11.20260917.397d52b.drv39error: Cannot build '/nix/store/pywn97agf1aqg32llx7x0qi7gdd9yvhq-nix-store-tests-run.drv'.40 Reason: builder failed with exit code 1.41 Output paths:42 /nix/store/24plkfymp8qndabbhwpgwflhp0wc7qvl-nix-store-tests-run43 Last 25 log lines:44 > [ OK ] S3ToHttpsConversion/S3ToHttpsConversionTest.ConvertsCorrectly/dotted_bucket_with_auto_style_custom_endpoint (0 ms)45 > [----------] 13 tests from S3ToHttpsConversion/S3ToHttpsConversionTest (0 ms total)46 >47 > [----------] 5 tests from S3ToHttpsConversionErrors/S3ToHttpsConversionErrorTest48 > [ RUN ] S3ToHttpsConversionErrors/S3ToHttpsConversionErrorTest.ThrowsOnConversion/virtual_style_with_empty_host_authority49 > [ OK ] S3ToHttpsConversionErrors/S3ToHttpsConversionErrorTest.ThrowsOnConversion/virtual_style_with_empty_host_authority (0 ms)50 > [ RUN ] S3ToHttpsConversionErrors/S3ToHttpsConversionErrorTest.ThrowsOnConversion/dotted_bucket_with_explicit_virtual_style51 > [ OK ] S3ToHttpsConversionErrors/S3ToHttpsConversionErrorTest.ThrowsOnConversion/dotted_bucket_with_explicit_virtual_style (0 ms)52 > [ RUN ] S3ToHttpsConversionErrors/S3ToHttpsConversionErrorTest.ThrowsOnConversion/dotted_bucket_with_explicit_virtual_style_multi_dot53 > [ OK ] S3ToHttpsConversionErrors/S3ToHttpsConversionErrorTest.ThrowsOnConversion/dotted_bucket_with_explicit_virtual_style_multi_dot (0 ms)54 > [ RUN ] S3ToHttpsConversionErrors/S3ToHttpsConversionErrorTest.ThrowsOnConversion/dotted_bucket_with_explicit_virtual_style_custom_authority55 > [ OK ] S3ToHttpsConversionErrors/S3ToHttpsConversionErrorTest.ThrowsOnConversion/dotted_bucket_with_explicit_virtual_style_custom_authority (0 ms)56 > [ RUN ] S3ToHttpsConversionErrors/S3ToHttpsConversionErrorTest.ThrowsOnConversion/dotted_bucket_with_explicit_virtual_style_full_endpoint_url57 > [ OK ] S3ToHttpsConversionErrors/S3ToHttpsConversionErrorTest.ThrowsOnConversion/dotted_bucket_with_explicit_virtual_style_full_endpoint_url (0 ms)58 > [----------] 5 tests from S3ToHttpsConversionErrors/S3ToHttpsConversionErrorTest (0 ms total)59 >60 > [----------] Global test environment tear-down61 > [==========] 798 tests from 90 test suites ran. (1397 ms total)62 > [ PASSED ] 797 tests.63 > [ FAILED ] 1 test, listed below:64 > [ FAILED ] StoreReferenceTest.PathInfo_ssh_unbracketed_ipv6_5_from_uri65 >66 > 1 FAILED TEST67 > YOU HAVE 1 DISABLED TEST68 >69 For full logs, run:70 nix log /nix/store/pywn97agf1aqg32llx7x0qi7gdd9yvhq-nix-store-tests-run.drv71error: Cannot build '/nix/store/jna1xqxfq1v5wpck4z3qn8bnj9wmd9ch-nix-util-tests-run-without-new-syscalls.drv'.72 Reason: builder failed with exit code 1.73 Output paths:74 /nix/store/jlahqnixx9m0q1c9q858imlga6ri4fhg-nix-util-tests-run-without-new-syscalls75 Last 25 log lines:76 > [ RUN ] Unix/UrlPathTest.urlToString/absolute_path77 > [ OK ] Unix/UrlPathTest.urlToString/absolute_path (0 ms)78 > [ RUN ] Unix/UrlPathTest.urlToString/root_path79 > [ OK ] Unix/UrlPathTest.urlToString/root_path (0 ms)80 > [ RUN ] Unix/UrlPathTest.stringToUrl/absolute_path81 > [ OK ] Unix/UrlPathTest.stringToUrl/absolute_path (0 ms)82 > [ RUN ] Unix/UrlPathTest.stringToUrl/root_path83 > [ OK ] Unix/UrlPathTest.stringToUrl/root_path (0 ms)84 > [----------] 8 tests from Unix/UrlPathTest (0 ms total)85 >86 > [----------] Global test environment tear-down87 > [==========] 818 tests from 156 test suites ran. (3050 ms total)88 > [ PASSED ] 812 tests.89 > [ SKIPPED ] 1 test, listed below:90 > [ SKIPPED ] CompressionDecompression/CompressionDecompressionTest.invalidDecompression/none91 > [ FAILED ] 5 tests, listed below:92 > [ FAILED ] ParseURLSuccessCases/ParseURLSuccess.parsesAsExpected/5, where GetParam() = 288-byte object <31-00 00-00 00-00 00-00 A8-86 95-55 55-55 00-00 B0-C7 B0-55 55-55 00-00 04-00 00-00 00-00 00-00 68-74 74-70 00-68 74-74 70-73 00-00 00-00 00-00 02-00 00-00 00-00 00-00 00-56 B0-55 55-55 00-00 ... 00-00 00-00 00-00 00-00 68-C8 B0-55 55-55 00-00 68-C8 B0-55 55-55 00-00 00-00 00-00 00-00 00-00 A0-C8 B0-55 55-55 00-00 00-00 00-00 00-00 00-00 00-65 6C-6C 6F-00 00-00 98-C8 B0-55 55-55 00-00>93 > [ FAILED ] ParseURLSuccessCases/ParseURLSuccess.toStringRoundTrips/5, where GetParam() = 288-byte object <31-00 00-00 00-00 00-00 A8-86 95-55 55-55 00-00 B0-C7 B0-55 55-55 00-00 04-00 00-00 00-00 00-00 68-74 74-70 00-68 74-74 70-73 00-00 00-00 00-00 02-00 00-00 00-00 00-00 F0-2F B1-55 55-55 00-00 ... 00-00 00-00 00-00 00-00 68-C8 B0-55 55-55 00-00 68-C8 B0-55 55-55 00-00 00-00 00-00 00-00 00-00 A0-C8 B0-55 55-55 00-00 00-00 00-00 00-00 00-00 00-65 6C-6C 6F-00 00-00 98-C8 B0-55 55-55 00-00>94 > [ FAILED ] ParseURLSuccessCases/ParseURLSuccess.makeSureFixGitURLDoesNotModify/5, where GetParam() = 288-byte object <31-00 00-00 00-00 00-00 A8-86 95-55 55-55 00-00 B0-C7 B0-55 55-55 00-00 04-00 00-00 00-00 00-00 68-74 74-70 00-68 74-74 70-73 00-00 00-00 00-00 02-00 00-00 00-00 00-00 40-55 B1-55 55-55 00-00 ... 00-00 00-00 00-00 00-00 68-C8 B0-55 55-55 00-00 68-C8 B0-55 55-55 00-00 00-00 00-00 00-00 00-00 A0-C8 B0-55 55-55 00-00 00-00 00-00 00-00 00-00 00-65 6C-6C 6F-00 00-00 98-C8 B0-55 55-55 00-00>95 > [ FAILED ] parseURLRelative/ParseURLRelativeTestSuite.resolve/resolvesRelativePathIpv6AddressWithZoneId, where GetParam() = 336-byte object <3F-00 00-00 00-00 00-00 18-90 95-55 55-55 00-00 10-00 00-00 00-00 00-00 68-34 94-55 55-55 00-00 B0-F2 AF-55 55-55 00-00 04-00 00-00 00-00 00-00 68-74 74-70 00-00 00-00 00-00 00-00 00-00 00-00 ... A0-F3 AF-55 55-55 00-00 00-00 00-00 00-00 00-00 00-F3 AF-55 55-55 00-00 00-00 00-00 00-00 00-00 90-74 B1-55 55-55 00-00 29-00 00-00 00-00 00-00 29-00 00-00 00-00 00-00 F0-F3 AF-55 55-55 00-00>96 > [ FAILED ] parseURLRelative/ParseURLRelativeTestSuite.resolve/absOverrideWithZoneId, where GetParam() = 336-byte object <21-00 00-00 00-00 00-00 60-8E 95-55 55-55 00-00 3C-00 00-00 00-00 00-00 88-8E 95-55 55-55 00-00 B0-F2 AF-55 55-55 00-00 05-00 00-00 00-00 00-00 68-74 74-70 73-00 00-00 00-00 00-00 00-00 00-00 ... A0-F3 AF-55 55-55 00-00 00-00 00-00 00-00 00-00 00-72 61-67 00-55 00-00 00-00 00-00 00-00 00-00 C0-3B B1-55 55-55 00-00 15-00 00-00 00-00 00-00 15-00 00-00 00-00 00-00 69-64 65-00 55-55 00-00>97 >98 > 5 FAILED TESTS99 > YOU HAVE 1 DISABLED TEST100 >101 For full logs, run:102 nix log /nix/store/jna1xqxfq1v5wpck4z3qn8bnj9wmd9ch-nix-util-tests-run-without-new-syscalls.drv103error: Cannot build '/nix/store/wdlzb0mq8kr7ixw4nkwkam6ijbkzdhb7-nix-util-tests-run.drv'.104 Reason: builder failed with exit code 1.105 Output paths:106 /nix/store/wbg4wirj55rfsaifv3nwy7mwkqa2xy5h-nix-util-tests-run107 Last 25 log lines:108 > [ RUN ] Unix/UrlPathTest.urlToString/absolute_path109 > [ OK ] Unix/UrlPathTest.urlToString/absolute_path (0 ms)110 > [ RUN ] Unix/UrlPathTest.urlToString/root_path111 > [ OK ] Unix/UrlPathTest.urlToString/root_path (0 ms)112 > [ RUN ] Unix/UrlPathTest.stringToUrl/absolute_path113 > [ OK ] Unix/UrlPathTest.stringToUrl/absolute_path (0 ms)114 > [ RUN ] Unix/UrlPathTest.stringToUrl/root_path115 > [ OK ] Unix/UrlPathTest.stringToUrl/root_path (0 ms)116 > [----------] 8 tests from Unix/UrlPathTest (0 ms total)117 >118 > [----------] Global test environment tear-down119 > [==========] 818 tests from 156 test suites ran. (3035 ms total)120 > [ PASSED ] 812 tests.121 > [ SKIPPED ] 1 test, listed below:122 > [ SKIPPED ] CompressionDecompression/CompressionDecompressionTest.invalidDecompression/none123 > [ FAILED ] 5 tests, listed below:124 > [ FAILED ] ParseURLSuccessCases/ParseURLSuccess.parsesAsExpected/5, where GetParam() = 288-byte object <31-00 00-00 00-00 00-00 A8-86 95-55 55-55 00-00 B0-C7 B0-55 55-55 00-00 04-00 00-00 00-00 00-00 68-74 74-70 00-68 74-74 70-73 00-00 00-00 00-00 02-00 00-00 00-00 00-00 00-56 B0-55 55-55 00-00 ... 00-00 00-00 00-00 00-00 68-C8 B0-55 55-55 00-00 68-C8 B0-55 55-55 00-00 00-00 00-00 00-00 00-00 A0-C8 B0-55 55-55 00-00 00-00 00-00 00-00 00-00 00-65 6C-6C 6F-00 00-00 98-C8 B0-55 55-55 00-00>125 > [ FAILED ] ParseURLSuccessCases/ParseURLSuccess.toStringRoundTrips/5, where GetParam() = 288-byte object <31-00 00-00 00-00 00-00 A8-86 95-55 55-55 00-00 B0-C7 B0-55 55-55 00-00 04-00 00-00 00-00 00-00 68-74 74-70 00-68 74-74 70-73 00-00 00-00 00-00 02-00 00-00 00-00 00-00 F0-2F B1-55 55-55 00-00 ... 00-00 00-00 00-00 00-00 68-C8 B0-55 55-55 00-00 68-C8 B0-55 55-55 00-00 00-00 00-00 00-00 00-00 A0-C8 B0-55 55-55 00-00 00-00 00-00 00-00 00-00 00-65 6C-6C 6F-00 00-00 98-C8 B0-55 55-55 00-00>126 > [ FAILED ] ParseURLSuccessCases/ParseURLSuccess.makeSureFixGitURLDoesNotModify/5, where GetParam() = 288-byte object <31-00 00-00 00-00 00-00 A8-86 95-55 55-55 00-00 B0-C7 B0-55 55-55 00-00 04-00 00-00 00-00 00-00 68-74 74-70 00-68 74-74 70-73 00-00 00-00 00-00 02-00 00-00 00-00 00-00 40-55 B1-55 55-55 00-00 ... 00-00 00-00 00-00 00-00 68-C8 B0-55 55-55 00-00 68-C8 B0-55 55-55 00-00 00-00 00-00 00-00 00-00 A0-C8 B0-55 55-55 00-00 00-00 00-00 00-00 00-00 00-65 6C-6C 6F-00 00-00 98-C8 B0-55 55-55 00-00>127 > [ FAILED ] parseURLRelative/ParseURLRelativeTestSuite.resolve/resolvesRelativePathIpv6AddressWithZoneId, where GetParam() = 336-byte object <3F-00 00-00 00-00 00-00 18-90 95-55 55-55 00-00 10-00 00-00 00-00 00-00 68-34 94-55 55-55 00-00 B0-F2 AF-55 55-55 00-00 04-00 00-00 00-00 00-00 68-74 74-70 00-00 00-00 00-00 00-00 00-00 00-00 ... A0-F3 AF-55 55-55 00-00 00-00 00-00 00-00 00-00 00-F3 AF-55 55-55 00-00 00-00 00-00 00-00 00-00 90-74 B1-55 55-55 00-00 29-00 00-00 00-00 00-00 29-00 00-00 00-00 00-00 F0-F3 AF-55 55-55 00-00>128 > [ FAILED ] parseURLRelative/ParseURLRelativeTestSuite.resolve/absOverrideWithZoneId, where GetParam() = 336-byte object <21-00 00-00 00-00 00-00 60-8E 95-55 55-55 00-00 3C-00 00-00 00-00 00-00 88-8E 95-55 55-55 00-00 B0-F2 AF-55 55-55 00-00 05-00 00-00 00-00 00-00 68-74 74-70 73-00 00-00 00-00 00-00 00-00 00-00 ... A0-F3 AF-55 55-55 00-00 00-00 00-00 00-00 00-00 00-72 61-67 00-55 00-00 00-00 00-00 00-00 00-00 C0-3B B1-55 55-55 00-00 15-00 00-00 00-00 00-00 15-00 00-00 00-00 00-00 69-64 65-00 55-55 00-00>129 >130 > 5 FAILED TESTS131 > YOU HAVE 1 DISABLED TEST132 >133 For full logs, run:134 nix log /nix/store/wdlzb0mq8kr7ixw4nkwkam6ijbkzdhb7-nix-util-tests-run.drv135error: Cannot build '/nix/store/dpbmzyi65g0hwvj6g8669f62cc96s4lr-nix-2.36.0pre20260916_1de45ba.drv'.136 Reason: 3 dependencies failed.137 Output paths:138 /nix/store/6lx769va5cfq3wixwssm1a6wmqrwvvs5-nix-2.36.0pre20260916_1de45ba-doc139 /nix/store/bzjx147cx6i840zi3ydzd4sw6yxs9srm-nix-2.36.0pre20260916_1de45ba-man140 /nix/store/nf5f2pshfbhrqk2a6svvcbhl6flblbx3-nix-2.36.0pre20260916_1de45ba-dev141 /nix/store/wylj6yb4sbigrb1bmgjrvzd762vqbyzp-nix-2.36.0pre20260916_1de45ba142error: Cannot build '/nix/store/z54bnc5j0c9x58b03dk95aybkqrl7580-nix.conf.drv'.143 Reason: 1 dependency failed.144 Output paths:145 /nix/store/2za4fipfabyf6b6vk8kksr0am7yz44sk-nix.conf146error: Cannot build '/nix/store/kc36sra7230l1gsjnnfh07g3d4hbawm6-nixos-option-26.11.drv'.147 Reason: 1 dependency failed.148 Output paths:149 /nix/store/99y57vvqvrl03pbpmkpml0qn2v5yxa8s-nixos-option-26.11150error: Cannot build '/nix/store/3fkrmlg888561wnl10bb60g9zr30w9yl-nixos-rebuild-ng-26.11.drv'.151 Reason: 1 dependency failed.152 Output paths:153 /nix/store/3bcq2ccqhjppyyq5cv4ndgz4bn3rywbv-nixos-rebuild-ng-26.11154 /nix/store/fwy4c8rqg45h9z6p7bpc89b7b1161m42-nixos-rebuild-ng-26.11-dist155error: Cannot build '/nix/store/8n9cspnyv5vwkpj0m47i80l23qpimr4c-system-generators.drv'.156 Reason: 1 dependency failed.157 Output paths:158 /nix/store/9ncr2khd7jc63sz6aaw7hshrjvnvb2dx-system-generators159error: Cannot build '/nix/store/xw107nhvhxvfaag435608db7g5r4hryj-system-shutdown.drv'.160 Reason: 1 dependency failed.161 Output paths:162 /nix/store/7kzwrg94bac3bqx2dac131060wbr2q8y-system-shutdown163error: Cannot build '/nix/store/nw3fy8m0nn5glzndcq67gkdhc07gbdgv-systemd-boot.drv'.164 Reason: 1 dependency failed.165 Output paths:166 /nix/store/x1dkx96r0syxfpq95785pppxzaya50cl-systemd-boot167error: Cannot build '/nix/store/anr3cd9r3abpph6m5yxw4fms9zdnl3my-tmpfiles.d.drv'.168 Reason: 1 dependency failed.169 Output paths:170 /nix/store/px66c38gzfivbr7s3dngs58q1rxvpc8i-tmpfiles.d171error: Cannot build '/nix/store/264q86rc8pgsddipjj9ar5jkzjghgm6n-unit-harmonia-gc.service.drv'.172 Reason: 1 dependency failed.173 Output paths:174 /nix/store/2y51fk1icxwwglv58190bdidf2zafnlq-unit-harmonia-gc.service175error: Cannot build '/nix/store/2w0vrz5yy7jd6jbhfvj88wjcg1mqmd4y-unit-nix-optimise.service.drv'.176 Reason: 1 dependency failed.177 Output paths:178 /nix/store/6h91xkqcdjhsw2gyaaqd62gyz3fymj4j-unit-nix-optimise.service179error: Cannot build '/nix/store/w0883kc1z6dljmrn6ylnbmqhma69py3y-unit-script-nix-gc-start.drv'.180 Reason: 1 dependency failed.181 Output paths:182 /nix/store/2awjd2bxj637zaxffcakz65pmy1abdl3-unit-script-nix-gc-start183error: Cannot build '/nix/store/wp7b3hisna454c79kn1l1s7a68rsscms-unit-script-update-prefetch-start.drv'.184 Reason: 1 dependency failed.185 Output paths:186 /nix/store/8x7h0g141z661y86vdqxcywg4n6zircm-unit-script-update-prefetch-start187error: Cannot build '/nix/store/6gc6rrmxhhfz4zi7mhrgawzvwxn7qmjb-user-generators.drv'.188 Reason: 1 dependency failed.189 Output paths:190 /nix/store/b3hh75r8ys7hpy9kixayqxcjzj2kr88q-user-generators191error: Cannot build '/nix/store/g5qs928a590bj9a1briszl4pi97dn701-X-Restart-Triggers-nix-daemon.drv'.192 Reason: 1 dependency failed.193 Output paths:194 /nix/store/jp5i017x9gxfwsggjgvgc45hi0l311z8-X-Restart-Triggers-nix-daemon195error: Cannot build '/nix/store/4m8sfxd0lb2mjf8603dziif66m1irlhp-X-Restart-Triggers-systemd-tmpfiles-resetup.drv'.196 Reason: 1 dependency failed.197 Output paths:198 /nix/store/kijcr6cp7v7wgj6znvsncdwwra4n6dd5-X-Restart-Triggers-systemd-tmpfiles-resetup199error: Cannot build '/nix/store/l4cb01a6apx5s8j5siyjdgz2vc01vlhh-install-systemd-boot.sh.drv'.200 Reason: 1 dependency failed.201 Output paths:202 /nix/store/svc4gpdyrjz70l0pn7di0cr3mxja55dk-install-systemd-boot.sh203error: Cannot build '/nix/store/ja7172sfrzg56d8jamil7iki079d3yih-system-path.drv'.204 Reason: 3 dependencies failed.205 Output paths:206 /nix/store/7z8i90j0i4lsyiqpri33a44dg82r8jk3-system-path207error: Cannot build '/nix/store/0c5k3547p45n0nmwzybmkqmbni0vvc7m-unit-nix-gc.service.drv'.208 Reason: 1 dependency failed.209 Output paths:210 /nix/store/mx6aakgld87kyf60afjdrpw1mjm39i27-unit-nix-gc.service211error: Cannot build '/nix/store/lh7y2vw9zq406cw9fc4blg62102sqqap-unit-update-prefetch.service.drv'.212 Reason: 1 dependency failed.213 Output paths:214 /nix/store/6cwjwy0813axyskdpkkq0sgczxmnjv8w-unit-update-prefetch.service215error: Cannot build '/nix/store/ipjncylbvjjzvgaybjf1ysqzb0z8qv8c-dbus-1.drv'.216 Reason: 1 dependency failed.217 Output paths:218 /nix/store/s6r5lg8ww0pda3c3m1gryi4vpv6djj92-dbus-1219error: Cannot build '/nix/store/h6qfxmdlq9c5vgk4vi9v6v7zy4h203aq-system-crontab.drv'.220 Reason: 1 dependency failed.221 Output paths:222 /nix/store/xmq0l1vk8vq9ajyhik2w0a6pmfn7ifzv-system-crontab223error: Cannot build '/nix/store/dzhmgqbbcjmgxxkgfw94l7hxs07wzslj-unit-nix-daemon.service.drv'.224 Reason: 2 dependencies failed.225 Output paths:226 /nix/store/aj978sf36lljxz06w61pivvv1f39d9m8-unit-nix-daemon.service227error: Cannot build '/nix/store/dwcvghspj4yg8a53a71bmvdsv7yb9vn5-unit-systemd-tmpfiles-resetup.service.drv'.228 Reason: 1 dependency failed.229 Output paths:230 /nix/store/604qk1jnz06ci5i1b731am32ndanbfzv-unit-systemd-tmpfiles-resetup.service231error: Cannot build '/nix/store/ra7ynzby8kwi2wflpb400728id3phik2-X-Restart-Triggers-dbus-broker.drv'.232 Reason: 1 dependency failed.233 Output paths:234 /nix/store/imbk1j7ab7xiv2dxb3m6ia6fyr0mv0h5-X-Restart-Triggers-dbus-broker235error: Cannot build '/nix/store/swzh93fbxws58z849wjfzk1b24272mzl-crontabs.drv'.236 Reason: 1 dependency failed.237 Output paths:238 /nix/store/kgryamvlzjqrq5ibsnkh65lfidxzs0x5-crontabs239error: Cannot build '/nix/store/6rc6n35cwy2xl536l7q6pbgh2znvsgcc-unit-dbus-broker.service.drv'.240 Reason: 1 dependency failed.241 Output paths:242 /nix/store/z6m8lspg2vi4dl1b9fr750vc0h281i22-unit-dbus-broker.service243error: Cannot build '/nix/store/q8pc4dmgirbnx37zwd5lk4fs091bv928-unit-dbus-broker.service.drv'.244 Reason: 1 dependency failed.245 Output paths:246 /nix/store/10h6in5b79rzcbxraw2531lsfj1vrkgj-unit-dbus-broker.service247error: Cannot build '/nix/store/qgzxj0lmrzb2np8cna2s6b5b55fdzr1y-system-units.drv'.248 Reason: 8 dependencies failed.249 Output paths:250 /nix/store/fgh8jmk884bmshicsi7k6nnw1n6q3zbr-system-units251error: Cannot build '/nix/store/1wanrq4krs4gi6c5n1alssipb9j2k1kn-user-units.drv'.252 Reason: 2 dependencies failed.253 Output paths:254 /nix/store/qagavcnia255xi5ck768d1vh7z9k2m07-user-units255error: Cannot build '/nix/store/rbpcnc5305yc9kzwy4xnwyk81b7s6zwr-etc.drv'.256 Reason: 10 dependencies failed.257 Output paths:258 /nix/store/245fjjz6fs1pxbvrc7y1sy1bd8l8xphw-etc259error: Cannot build '/nix/store/kh2mq01pv71j7yyjr1403b1f3yzrrm03-activate.drv'.260 Reason: 1 dependency failed.261 Output paths:262 /nix/store/v15xnp1830xqk30x3sa02c5j2ba03hsh-activate263error: Cannot build '/nix/store/jkaqzn2dnrs4j3d184ri7wvs5cwmk02k-nixos-system-matchbox-26.11.20260917.397d52b.drv'.264 Reason: 4 dependencies failed.265 Output paths:266 /nix/store/p61n02pmab0h3h2i4ic4vqbffni5dfkl-nixos-system-matchbox-26.11.20260917.397d52b