setup
checks.x86_64-linux.nixos-eva
· build #602
· raw
1these 36 derivations will be built:2 /nix/store/5mcpi4kiqmlbzxgsy06cmd4nvzdgwg6p-nix-util-tests-run-without-new-syscalls.drv3 /nix/store/6q3zb9wnm8bk94jxzyrdiy11p5lp9mar-nix-util-tests-run.drv4 /nix/store/fx3swbxbq1vd6kvs2rps48a9f6iixq4f-nix-store-tests-run.drv5 /nix/store/qmlqxiikrb6vsri0cb8mcj237m4fk3fr-nix-2.36.0pre20260916_1de45ba.drv6 /nix/store/7g4hnhvygsb9jlvxkx249ii8lwnlmnl3-user-generators.drv7 /nix/store/7rz7k0viwwpm3czwx90dp29gbmx7zww1-nix.conf.drv8 /nix/store/2r2l9v3c0g9c3mm6f6mbf1h62ymyh1l0-nixos-rebuild-ng-26.11.drv9 /nix/store/xz06k0rbbmkyv2g2qy3s9cvg43lkzh7w-nixos-option-26.11.drv10 /nix/store/xlj7rkq1nkah9dbhkpra2bbxqbxycpam-system-path.drv11 /nix/store/7wk0qs52ns84i44nkzw3ixhaf8iqamd2-dbus-1.drv12 /nix/store/65mvy3schxn3mc4nxiwmd9vjdf758dyf-unit-script-nix-gc-start.drv13 /nix/store/2ah8szbzvqv3zdz1a1bg3hvpyqr5x3n7-unit-nix-gc.service.drv14 /nix/store/aq8z1056jc724qfh6p571wimhry0bcik-unit-script-update-prefetch-start.drv15 /nix/store/6w8g2b2b1mynijhz6whn8n5d90n6rzrf-unit-update-prefetch.service.drv16 /nix/store/fbbfgn1di6ww72j5zym0pp7a913izfwi-tmpfiles.d.drv17 /nix/store/ylv83f486yhd4s8fssk40hkd6lj1zmr4-X-Restart-Triggers-systemd-tmpfiles-resetup.drv18 /nix/store/84aaawvk8lvf27fx6lasbp7pvg1gw2d0-unit-systemd-tmpfiles-resetup.service.drv19 /nix/store/mn03s40zmk6f0fmwvk5galph6p3n9rpp-X-Restart-Triggers-nix-daemon.drv20 /nix/store/bhh5p2sciyg23qgsxak1xlan52mrx1yd-unit-nix-daemon.service.drv21 /nix/store/k9hafjdywkhb3acbjajalsi7z9pjj84w-unit-harmonia-gc.service.drv22 /nix/store/mx9igk4kxyf20ncp6y1sswgjwagkswyw-unit-nix-optimise.service.drv23 /nix/store/5sbf91rnx58398p4385blajanqda8iry-X-Restart-Triggers-dbus-broker.drv24 /nix/store/nmqsh2fs934j5rrh73vb4vipl25zqq44-unit-dbus-broker.service.drv25 /nix/store/gzply7fdjb95v2wkw6vhmph2lzhcd43f-config.toml.drv26 /nix/store/wk3pw88k5rc3jpixjv548fw1jl4ar117-pre-start.drv27 /nix/store/z3gar9wqy6a64p593azb5nm383z5ir4h-unit-telegraf.service.drv28 /nix/store/89i5dzf9a23qcpd7pdhyrcansngmdm78-system-units.drv29 /nix/store/d581i8dhhg7phd9pf7gymhmw9f81krwy-system-shutdown.drv30 /nix/store/bq7v8i0yn44hfkd8l0sfpryzjfnx07w9-unit-dbus-broker.service.drv31 /nix/store/kqghs1p2s0s0f319l8j7f4ib58mswm7n-user-units.drv32 /nix/store/vcfsfbbr1qwnh249n7avwv7vgin4lgc6-system-generators.drv33 /nix/store/1iq1l5dsni80ffhwspj6nrh780jxyhx4-etc.drv34 /nix/store/95z41nwafavvhj6rrh0qz97gwc6b740q-systemd-boot.drv35 /nix/store/nf1pdd3j6f20qip5wqjd8m5vf2pwqwph-install-systemd-boot.sh.drv36 /nix/store/vghach0khhs6mnck4lab5jgfyi2pafpd-activate.drv37 /nix/store/an0ivb622hkjl71hripp0aqp6qa1ab7i-nixos-system-eva-26.11.20260917.397d52b.drv38Failed to find a machine for remote build!39derivation: fx3swbxbq1vd6kvs2rps48a9f6iixq4f-nix-store-tests-run.drv40required (system, features): (aarch64-linux, [])411 available machines:42(systems, maxjobs, supportedFeatures, mandatoryFeatures)43([aarch64-darwin, x86_64-darwin], 8, [big-parallel, recursive-nix], [])44Failed to find a machine for remote build!45derivation: 5mcpi4kiqmlbzxgsy06cmd4nvzdgwg6p-nix-util-tests-run-without-new-syscalls.drv46required (system, features): (aarch64-linux, [])471 available machines:48(systems, maxjobs, supportedFeatures, mandatoryFeatures)49([aarch64-darwin, x86_64-darwin], 8, [big-parallel, recursive-nix], [])50Failed to find a machine for remote build!51derivation: 6q3zb9wnm8bk94jxzyrdiy11p5lp9mar-nix-util-tests-run.drv52required (system, features): (aarch64-linux, [])531 available machines:54(systems, maxjobs, supportedFeatures, mandatoryFeatures)55([aarch64-darwin, x86_64-darwin], 8, [big-parallel, recursive-nix], [])56error: Cannot build '/nix/store/fx3swbxbq1vd6kvs2rps48a9f6iixq4f-nix-store-tests-run.drv'.57 Reason: builder failed with exit code 1.58 Output paths:59 /nix/store/82zir9q4m1jz6lzp3ldcsx2078azd8zw-nix-store-tests-run60 Last 25 log lines:61 > [ OK ] S3ToHttpsConversion/S3ToHttpsConversionTest.ConvertsCorrectly/dotted_bucket_with_auto_style_custom_endpoint (0 ms)62 > [----------] 13 tests from S3ToHttpsConversion/S3ToHttpsConversionTest (0 ms total)63 >64 > [----------] 5 tests from S3ToHttpsConversionErrors/S3ToHttpsConversionErrorTest65 > [ RUN ] S3ToHttpsConversionErrors/S3ToHttpsConversionErrorTest.ThrowsOnConversion/virtual_style_with_empty_host_authority66 > [ OK ] S3ToHttpsConversionErrors/S3ToHttpsConversionErrorTest.ThrowsOnConversion/virtual_style_with_empty_host_authority (0 ms)67 > [ RUN ] S3ToHttpsConversionErrors/S3ToHttpsConversionErrorTest.ThrowsOnConversion/dotted_bucket_with_explicit_virtual_style68 > [ OK ] S3ToHttpsConversionErrors/S3ToHttpsConversionErrorTest.ThrowsOnConversion/dotted_bucket_with_explicit_virtual_style (0 ms)69 > [ RUN ] S3ToHttpsConversionErrors/S3ToHttpsConversionErrorTest.ThrowsOnConversion/dotted_bucket_with_explicit_virtual_style_multi_dot70 > [ OK ] S3ToHttpsConversionErrors/S3ToHttpsConversionErrorTest.ThrowsOnConversion/dotted_bucket_with_explicit_virtual_style_multi_dot (0 ms)71 > [ RUN ] S3ToHttpsConversionErrors/S3ToHttpsConversionErrorTest.ThrowsOnConversion/dotted_bucket_with_explicit_virtual_style_custom_authority72 > [ OK ] S3ToHttpsConversionErrors/S3ToHttpsConversionErrorTest.ThrowsOnConversion/dotted_bucket_with_explicit_virtual_style_custom_authority (0 ms)73 > [ RUN ] S3ToHttpsConversionErrors/S3ToHttpsConversionErrorTest.ThrowsOnConversion/dotted_bucket_with_explicit_virtual_style_full_endpoint_url74 > [ OK ] S3ToHttpsConversionErrors/S3ToHttpsConversionErrorTest.ThrowsOnConversion/dotted_bucket_with_explicit_virtual_style_full_endpoint_url (0 ms)75 > [----------] 5 tests from S3ToHttpsConversionErrors/S3ToHttpsConversionErrorTest (0 ms total)76 >77 > [----------] Global test environment tear-down78 > [==========] 798 tests from 90 test suites ran. (1624 ms total)79 > [ PASSED ] 797 tests.80 > [ FAILED ] 1 test, listed below:81 > [ FAILED ] StoreReferenceTest.PathInfo_ssh_unbracketed_ipv6_5_from_uri82 >83 > 1 FAILED TEST84 > YOU HAVE 1 DISABLED TEST85 >86 For full logs, run:87 nix log /nix/store/fx3swbxbq1vd6kvs2rps48a9f6iixq4f-nix-store-tests-run.drv88error: Cannot build '/nix/store/5mcpi4kiqmlbzxgsy06cmd4nvzdgwg6p-nix-util-tests-run-without-new-syscalls.drv'.89 Reason: builder failed with exit code 1.90 Output paths:91 /nix/store/pxkx355bpxvr2ydf1jbww4816r4xh6w6-nix-util-tests-run-without-new-syscalls92 Last 25 log lines:93 > [ RUN ] Unix/UrlPathTest.urlToString/absolute_path94 > [ OK ] Unix/UrlPathTest.urlToString/absolute_path (0 ms)95 > [ RUN ] Unix/UrlPathTest.urlToString/root_path96 > [ OK ] Unix/UrlPathTest.urlToString/root_path (0 ms)97 > [ RUN ] Unix/UrlPathTest.stringToUrl/absolute_path98 > [ OK ] Unix/UrlPathTest.stringToUrl/absolute_path (0 ms)99 > [ RUN ] Unix/UrlPathTest.stringToUrl/root_path100 > [ OK ] Unix/UrlPathTest.stringToUrl/root_path (0 ms)101 > [----------] 8 tests from Unix/UrlPathTest (0 ms total)102 >103 > [----------] Global test environment tear-down104 > [==========] 818 tests from 156 test suites ran. (3061 ms total)105 > [ PASSED ] 812 tests.106 > [ SKIPPED ] 1 test, listed below:107 > [ SKIPPED ] CompressionDecompression/CompressionDecompressionTest.invalidDecompression/none108 > [ FAILED ] 5 tests, listed below:109 > [ FAILED ] ParseURLSuccessCases/ParseURLSuccess.parsesAsExpected/5, where GetParam() = 288-byte object <31-00 00-00 00-00 00-00 10-BE E4-AA AA-AA 00-00 00-B1 FF-AA AA-AA 00-00 04-00 00-00 00-00 00-00 68-74 74-70 00-68 74-74 70-73 00-00 00-00 00-00 02-00 00-00 00-00 00-00 10-FC FE-AA AA-AA 00-00 ... 00-00 00-00 00-00 00-00 B8-B1 FF-AA AA-AA 00-00 B8-B1 FF-AA AA-AA 00-00 00-00 00-00 00-00 00-00 F0-B1 FF-AA AA-AA 00-00 00-00 00-00 00-00 00-00 00-65 6C-6C 6F-00 00-00 E8-B1 FF-AA AA-AA 00-00>110 > [ FAILED ] ParseURLSuccessCases/ParseURLSuccess.toStringRoundTrips/5, where GetParam() = 288-byte object <31-00 00-00 00-00 00-00 10-BE E4-AA AA-AA 00-00 00-B1 FF-AA AA-AA 00-00 04-00 00-00 00-00 00-00 68-74 74-70 00-68 74-74 70-73 00-00 00-00 00-00 02-00 00-00 00-00 00-00 60-1B 00-AB AA-AA 00-00 ... 00-00 00-00 00-00 00-00 B8-B1 FF-AA AA-AA 00-00 B8-B1 FF-AA AA-AA 00-00 00-00 00-00 00-00 00-00 F0-B1 FF-AA AA-AA 00-00 00-00 00-00 00-00 00-00 00-65 6C-6C 6F-00 00-00 E8-B1 FF-AA AA-AA 00-00>111 > [ FAILED ] ParseURLSuccessCases/ParseURLSuccess.makeSureFixGitURLDoesNotModify/5, where GetParam() = 288-byte object <31-00 00-00 00-00 00-00 10-BE E4-AA AA-AA 00-00 00-B1 FF-AA AA-AA 00-00 04-00 00-00 00-00 00-00 68-74 74-70 00-68 74-74 70-73 00-00 00-00 00-00 02-00 00-00 00-00 00-00 C0-3F 00-AB AA-AA 00-00 ... 00-00 00-00 00-00 00-00 B8-B1 FF-AA AA-AA 00-00 B8-B1 FF-AA AA-AA 00-00 00-00 00-00 00-00 00-00 F0-B1 FF-AA AA-AA 00-00 00-00 00-00 00-00 00-00 00-65 6C-6C 6F-00 00-00 E8-B1 FF-AA AA-AA 00-00>112 > [ FAILED ] parseURLRelative/ParseURLRelativeTestSuite.resolve/resolvesRelativePathIpv6AddressWithZoneId, where GetParam() = 336-byte object <3F-00 00-00 00-00 00-00 D8-C9 E4-AA AA-AA 00-00 10-00 00-00 00-00 00-00 18-CA E4-AA AA-AA 00-00 E0-4D FF-AA AA-AA 00-00 04-00 00-00 00-00 00-00 68-74 74-70 00-00 00-00 01-00 00-00 00-00 00-00 ... D0-4E FF-AA AA-AA 00-00 00-00 00-00 00-00 00-00 00-4E FF-AA AA-AA 00-00 00-00 00-00 00-00 00-00 A0-5E 00-AB AA-AA 00-00 29-00 00-00 00-00 00-00 29-00 00-00 00-00 00-00 30-96 FE-AA AA-AA 00-00>113 > [ FAILED ] parseURLRelative/ParseURLRelativeTestSuite.resolve/absOverrideWithZoneId, where GetParam() = 336-byte object <21-00 00-00 00-00 00-00 18-CC E4-AA AA-AA 00-00 3C-00 00-00 00-00 00-00 80-CC E4-AA AA-AA 00-00 E0-4D FF-AA AA-AA 00-00 05-00 00-00 00-00 00-00 68-74 74-70 73-00 00-00 01-00 00-00 00-00 00-00 ... D0-4E FF-AA AA-AA 00-00 00-00 00-00 00-00 00-00 00-72 61-67 00-AA 00-00 00-00 00-00 00-00 00-00 10-2A 00-AB AA-AA 00-00 15-00 00-00 00-00 00-00 15-00 00-00 00-00 00-00 69-64 65-00 AA-AA 00-00>114 >115 > 5 FAILED TESTS116 > YOU HAVE 1 DISABLED TEST117 >118 For full logs, run:119 nix log /nix/store/5mcpi4kiqmlbzxgsy06cmd4nvzdgwg6p-nix-util-tests-run-without-new-syscalls.drv120error: Cannot build '/nix/store/6q3zb9wnm8bk94jxzyrdiy11p5lp9mar-nix-util-tests-run.drv'.121 Reason: builder failed with exit code 1.122 Output paths:123 /nix/store/5db70ilwhx6idi37gbf7q10njvwcxzx5-nix-util-tests-run124 Last 25 log lines:125 > [ RUN ] Unix/UrlPathTest.urlToString/absolute_path126 > [ OK ] Unix/UrlPathTest.urlToString/absolute_path (0 ms)127 > [ RUN ] Unix/UrlPathTest.urlToString/root_path128 > [ OK ] Unix/UrlPathTest.urlToString/root_path (0 ms)129 > [ RUN ] Unix/UrlPathTest.stringToUrl/absolute_path130 > [ OK ] Unix/UrlPathTest.stringToUrl/absolute_path (0 ms)131 > [ RUN ] Unix/UrlPathTest.stringToUrl/root_path132 > [ OK ] Unix/UrlPathTest.stringToUrl/root_path (0 ms)133 > [----------] 8 tests from Unix/UrlPathTest (0 ms total)134 >135 > [----------] Global test environment tear-down136 > [==========] 818 tests from 156 test suites ran. (3121 ms total)137 > [ PASSED ] 812 tests.138 > [ SKIPPED ] 1 test, listed below:139 > [ SKIPPED ] CompressionDecompression/CompressionDecompressionTest.invalidDecompression/none140 > [ FAILED ] 5 tests, listed below:141 > [ FAILED ] ParseURLSuccessCases/ParseURLSuccess.parsesAsExpected/5, where GetParam() = 288-byte object <31-00 00-00 00-00 00-00 10-BE E4-AA AA-AA 00-00 00-B1 FF-AA AA-AA 00-00 04-00 00-00 00-00 00-00 68-74 74-70 00-68 74-74 70-73 00-00 00-00 00-00 02-00 00-00 00-00 00-00 10-FC FE-AA AA-AA 00-00 ... 00-00 00-00 00-00 00-00 B8-B1 FF-AA AA-AA 00-00 B8-B1 FF-AA AA-AA 00-00 00-00 00-00 00-00 00-00 F0-B1 FF-AA AA-AA 00-00 00-00 00-00 00-00 00-00 00-65 6C-6C 6F-00 00-00 E8-B1 FF-AA AA-AA 00-00>142 > [ FAILED ] ParseURLSuccessCases/ParseURLSuccess.toStringRoundTrips/5, where GetParam() = 288-byte object <31-00 00-00 00-00 00-00 10-BE E4-AA AA-AA 00-00 00-B1 FF-AA AA-AA 00-00 04-00 00-00 00-00 00-00 68-74 74-70 00-68 74-74 70-73 00-00 00-00 00-00 02-00 00-00 00-00 00-00 60-1B 00-AB AA-AA 00-00 ... 00-00 00-00 00-00 00-00 B8-B1 FF-AA AA-AA 00-00 B8-B1 FF-AA AA-AA 00-00 00-00 00-00 00-00 00-00 F0-B1 FF-AA AA-AA 00-00 00-00 00-00 00-00 00-00 00-65 6C-6C 6F-00 00-00 E8-B1 FF-AA AA-AA 00-00>143 > [ FAILED ] ParseURLSuccessCases/ParseURLSuccess.makeSureFixGitURLDoesNotModify/5, where GetParam() = 288-byte object <31-00 00-00 00-00 00-00 10-BE E4-AA AA-AA 00-00 00-B1 FF-AA AA-AA 00-00 04-00 00-00 00-00 00-00 68-74 74-70 00-68 74-74 70-73 00-00 00-00 00-00 02-00 00-00 00-00 00-00 C0-3F 00-AB AA-AA 00-00 ... 00-00 00-00 00-00 00-00 B8-B1 FF-AA AA-AA 00-00 B8-B1 FF-AA AA-AA 00-00 00-00 00-00 00-00 00-00 F0-B1 FF-AA AA-AA 00-00 00-00 00-00 00-00 00-00 00-65 6C-6C 6F-00 00-00 E8-B1 FF-AA AA-AA 00-00>144 > [ FAILED ] parseURLRelative/ParseURLRelativeTestSuite.resolve/resolvesRelativePathIpv6AddressWithZoneId, where GetParam() = 336-byte object <3F-00 00-00 00-00 00-00 D8-C9 E4-AA AA-AA 00-00 10-00 00-00 00-00 00-00 18-CA E4-AA AA-AA 00-00 E0-4D FF-AA AA-AA 00-00 04-00 00-00 00-00 00-00 68-74 74-70 00-00 00-00 01-00 00-00 00-00 00-00 ... D0-4E FF-AA AA-AA 00-00 00-00 00-00 00-00 00-00 00-4E FF-AA AA-AA 00-00 00-00 00-00 00-00 00-00 A0-5E 00-AB AA-AA 00-00 29-00 00-00 00-00 00-00 29-00 00-00 00-00 00-00 30-96 FE-AA AA-AA 00-00>145 > [ FAILED ] parseURLRelative/ParseURLRelativeTestSuite.resolve/absOverrideWithZoneId, where GetParam() = 336-byte object <21-00 00-00 00-00 00-00 18-CC E4-AA AA-AA 00-00 3C-00 00-00 00-00 00-00 80-CC E4-AA AA-AA 00-00 E0-4D FF-AA AA-AA 00-00 05-00 00-00 00-00 00-00 68-74 74-70 73-00 00-00 01-00 00-00 00-00 00-00 ... D0-4E FF-AA AA-AA 00-00 00-00 00-00 00-00 00-00 00-72 61-67 00-AA 00-00 00-00 00-00 00-00 00-00 10-2A 00-AB AA-AA 00-00 15-00 00-00 00-00 00-00 15-00 00-00 00-00 00-00 69-64 65-00 AA-AA 00-00>146 >147 > 5 FAILED TESTS148 > YOU HAVE 1 DISABLED TEST149 >150 For full logs, run:151 nix log /nix/store/6q3zb9wnm8bk94jxzyrdiy11p5lp9mar-nix-util-tests-run.drv152error: Cannot build '/nix/store/qmlqxiikrb6vsri0cb8mcj237m4fk3fr-nix-2.36.0pre20260916_1de45ba.drv'.153 Reason: 3 dependencies failed.154 Output paths:155 /nix/store/8d6n4m6fdmc614hc1aycd4d7ac1w7pk5-nix-2.36.0pre20260916_1de45ba-dev156 /nix/store/b0ilbgmspv3x8ax5sw9fd65xv7mx1vmq-nix-2.36.0pre20260916_1de45ba157 /nix/store/j674wcn8mhqwlhbd244ny8q3v5rpzdl2-nix-2.36.0pre20260916_1de45ba-man158 /nix/store/kzdv25x03z5l1wikw0x8rrmsdk9j6i47-nix-2.36.0pre20260916_1de45ba-doc159error: Cannot build '/nix/store/7rz7k0viwwpm3czwx90dp29gbmx7zww1-nix.conf.drv'.160 Reason: 1 dependency failed.161 Output paths:162 /nix/store/zxx4k2k225j7nxr267zlfr83fvnkf3rv-nix.conf163error: Cannot build '/nix/store/xz06k0rbbmkyv2g2qy3s9cvg43lkzh7w-nixos-option-26.11.drv'.164 Reason: 1 dependency failed.165 Output paths:166 /nix/store/7ycvi2bv8dj9ik2fgkl2ck4zql3d4sn6-nixos-option-26.11167error: Cannot build '/nix/store/2r2l9v3c0g9c3mm6f6mbf1h62ymyh1l0-nixos-rebuild-ng-26.11.drv'.168 Reason: 1 dependency failed.169 Output paths:170 /nix/store/scqd8g8gjhzd65rrd25j9ngp6yg3m88l-nixos-rebuild-ng-26.11-dist171 /nix/store/v1lglc7364wssgjfmsn17rg2nmk1vg6c-nixos-rebuild-ng-26.11172error: Cannot build '/nix/store/vcfsfbbr1qwnh249n7avwv7vgin4lgc6-system-generators.drv'.173 Reason: 1 dependency failed.174 Output paths:175 /nix/store/lj7d2jqw4gd569nw3i7nc01bwg9h2ca2-system-generators176error: Cannot build '/nix/store/d581i8dhhg7phd9pf7gymhmw9f81krwy-system-shutdown.drv'.177 Reason: 1 dependency failed.178 Output paths:179 /nix/store/q77k43v8ivmlif07irpdww6w2qf1lc62-system-shutdown180error: Cannot build '/nix/store/95z41nwafavvhj6rrh0qz97gwc6b740q-systemd-boot.drv'.181 Reason: 1 dependency failed.182 Output paths:183 /nix/store/9nfcny8xam2sancz1xfq3aj2rlciwsla-systemd-boot184error: Cannot build '/nix/store/fbbfgn1di6ww72j5zym0pp7a913izfwi-tmpfiles.d.drv'.185 Reason: 1 dependency failed.186 Output paths:187 /nix/store/sn54vxyxxsilncwf797skf5cchl0vskd-tmpfiles.d188error: Cannot build '/nix/store/k9hafjdywkhb3acbjajalsi7z9pjj84w-unit-harmonia-gc.service.drv'.189 Reason: 1 dependency failed.190 Output paths:191 /nix/store/j3js1iw7x16hh5wghli9khy3i06gn7ii-unit-harmonia-gc.service192error: Cannot build '/nix/store/mx9igk4kxyf20ncp6y1sswgjwagkswyw-unit-nix-optimise.service.drv'.193 Reason: 1 dependency failed.194 Output paths:195 /nix/store/ypvhwn8ikx2c5k4fi4zmcxib4d7viakr-unit-nix-optimise.service196error: Cannot build '/nix/store/65mvy3schxn3mc4nxiwmd9vjdf758dyf-unit-script-nix-gc-start.drv'.197 Reason: 1 dependency failed.198 Output paths:199 /nix/store/w4ghlzjcvhixyfcs8na2j78bniccxshq-unit-script-nix-gc-start200error: Cannot build '/nix/store/aq8z1056jc724qfh6p571wimhry0bcik-unit-script-update-prefetch-start.drv'.201 Reason: 1 dependency failed.202 Output paths:203 /nix/store/41fshsx094l67x68l6lin6vjz1k961f1-unit-script-update-prefetch-start204error: Cannot build '/nix/store/7g4hnhvygsb9jlvxkx249ii8lwnlmnl3-user-generators.drv'.205 Reason: 1 dependency failed.206 Output paths:207 /nix/store/fcr7iv26s6f290rzxns5nb2lqn3xvhjm-user-generators208error: Cannot build '/nix/store/mn03s40zmk6f0fmwvk5galph6p3n9rpp-X-Restart-Triggers-nix-daemon.drv'.209 Reason: 1 dependency failed.210 Output paths:211 /nix/store/z1ai0xrzkmgnbnwjb8hxw4rrzsyb9xh1-X-Restart-Triggers-nix-daemon212error: Cannot build '/nix/store/ylv83f486yhd4s8fssk40hkd6lj1zmr4-X-Restart-Triggers-systemd-tmpfiles-resetup.drv'.213 Reason: 1 dependency failed.214 Output paths:215 /nix/store/pz4yzzqhsi56h7pxl1dnjqgdjvpd4blp-X-Restart-Triggers-systemd-tmpfiles-resetup216error: Cannot build '/nix/store/nf1pdd3j6f20qip5wqjd8m5vf2pwqwph-install-systemd-boot.sh.drv'.217 Reason: 1 dependency failed.218 Output paths:219 /nix/store/s1q1w3y38a0xaybdjziac980savx6f8q-install-systemd-boot.sh220error: Cannot build '/nix/store/xlj7rkq1nkah9dbhkpra2bbxqbxycpam-system-path.drv'.221 Reason: 3 dependencies failed.222 Output paths:223 /nix/store/vq31mg6dsacmg7kdbbfgjbmqgv84whiy-system-path224error: Cannot build '/nix/store/2ah8szbzvqv3zdz1a1bg3hvpyqr5x3n7-unit-nix-gc.service.drv'.225 Reason: 1 dependency failed.226 Output paths:227 /nix/store/qk19912va7gb426nzxdc8zcfa9nqaal3-unit-nix-gc.service228error: Cannot build '/nix/store/6w8g2b2b1mynijhz6whn8n5d90n6rzrf-unit-update-prefetch.service.drv'.229 Reason: 1 dependency failed.230 Output paths:231 /nix/store/lhms74r6z3vfd4qnmry75a0yphm3kjmm-unit-update-prefetch.service232error: Cannot build '/nix/store/7wk0qs52ns84i44nkzw3ixhaf8iqamd2-dbus-1.drv'.233 Reason: 1 dependency failed.234 Output paths:235 /nix/store/qscvk5hzcw9mb0wwqha8dcsk7gslrf88-dbus-1236error: Cannot build '/nix/store/bhh5p2sciyg23qgsxak1xlan52mrx1yd-unit-nix-daemon.service.drv'.237 Reason: 2 dependencies failed.238 Output paths:239 /nix/store/0hmnmil8hn9hci87srkvqc9dnx90c23l-unit-nix-daemon.service240error: Cannot build '/nix/store/84aaawvk8lvf27fx6lasbp7pvg1gw2d0-unit-systemd-tmpfiles-resetup.service.drv'.241 Reason: 1 dependency failed.242 Output paths:243 /nix/store/q9glcb2zpjal2p90sr9cnfwlys9i0anm-unit-systemd-tmpfiles-resetup.service244error: Cannot build '/nix/store/5sbf91rnx58398p4385blajanqda8iry-X-Restart-Triggers-dbus-broker.drv'.245 Reason: 1 dependency failed.246 Output paths:247 /nix/store/wgly2s8lx8n89hcx5s9d6bk0ib4nj4qw-X-Restart-Triggers-dbus-broker248error: Cannot build '/nix/store/bq7v8i0yn44hfkd8l0sfpryzjfnx07w9-unit-dbus-broker.service.drv'.249 Reason: 1 dependency failed.250 Output paths:251 /nix/store/gbsb6yz0q7yc36zkyklwm23zfjf8jlj8-unit-dbus-broker.service252error: Cannot build '/nix/store/nmqsh2fs934j5rrh73vb4vipl25zqq44-unit-dbus-broker.service.drv'.253 Reason: 1 dependency failed.254 Output paths:255 /nix/store/dpyw9bxks8wddzpcvwsd49dhrwlw0gcm-unit-dbus-broker.service256error: Cannot build '/nix/store/89i5dzf9a23qcpd7pdhyrcansngmdm78-system-units.drv'.257 Reason: 8 dependencies failed.258 Output paths:259 /nix/store/v2zi2anfvv6qwi5d95vgslqh5yd9q4qp-system-units260error: Cannot build '/nix/store/kqghs1p2s0s0f319l8j7f4ib58mswm7n-user-units.drv'.261 Reason: 2 dependencies failed.262 Output paths:263 /nix/store/4wxv4hi7d1mjinzv71fnfrqq73dcfj7v-user-units264error: Cannot build '/nix/store/1iq1l5dsni80ffhwspj6nrh780jxyhx4-etc.drv'.265 Reason: 9 dependencies failed.266 Output paths:267 /nix/store/ilrajl0mc7733nhqj1n4miyq3064922j-etc268error: Cannot build '/nix/store/vghach0khhs6mnck4lab5jgfyi2pafpd-activate.drv'.269 Reason: 1 dependency failed.270 Output paths:271 /nix/store/287ds8ccfw8chcgg0d75az1ywzfv9pi7-activate272error: Cannot build '/nix/store/an0ivb622hkjl71hripp0aqp6qa1ab7i-nixos-system-eva-26.11.20260917.397d52b.drv'.273 Reason: 4 dependencies failed.274 Output paths:275 /nix/store/bn7jzm3hjkxh0d1lv6q6sxb6hwcfqjim-nixos-system-eva-26.11.20260917.397d52b