setup
checks.x86_64-linux.nixos-eve
· build #603
· raw
1these 37 derivations will be built:2 /nix/store/jna1xqxfq1v5wpck4z3qn8bnj9wmd9ch-nix-util-tests-run-without-new-syscalls.drv3 /nix/store/pywn97agf1aqg32llx7x0qi7gdd9yvhq-nix-store-tests-run.drv4 /nix/store/wdlzb0mq8kr7ixw4nkwkam6ijbkzdhb7-nix-util-tests-run.drv5 /nix/store/dpbmzyi65g0hwvj6g8669f62cc96s4lr-nix-2.36.0pre20260916_1de45ba.drv6 /nix/store/w0883kc1z6dljmrn6ylnbmqhma69py3y-unit-script-nix-gc-start.drv7 /nix/store/0c5k3547p45n0nmwzybmkqmbni0vvc7m-unit-nix-gc.service.drv8 /nix/store/264q86rc8pgsddipjj9ar5jkzjghgm6n-unit-harmonia-gc.service.drv9 /nix/store/2w0vrz5yy7jd6jbhfvj88wjcg1mqmd4y-unit-nix-optimise.service.drv10 /nix/store/2ypnzpr8582n4lpnf9psdarsd8140dyn-unit-container-hermes.service.drv11 /nix/store/3fkrmlg888561wnl10bb60g9zr30w9yl-nixos-rebuild-ng-26.11.drv12 /nix/store/kc36sra7230l1gsjnnfh07g3d4hbawm6-nixos-option-26.11.drv13 /nix/store/4w1pp4373i00bbh7dls80yxgm9y3bhn8-system-path.drv14 /nix/store/ygnbx4b76pkdjgg9przp2mr9srxs5il8-config.toml.drv15 /nix/store/54ncklxyhrnhkkszsw1p0sa3hb9gn55x-unit-telegraf.service.drv16 /nix/store/f14qmgwgckrj9ng6i627wyc3m7gsav7r-nix.conf.drv17 /nix/store/i0kvp1cjaz0vz0grplac2zbv61958b04-X-Restart-Triggers-nix-daemon.drv18 /nix/store/5zc6g5mc395bx9c5vjvl6phkjny5rzcs-unit-nix-daemon.service.drv19 /nix/store/a17kllvnhhc2z2v4g1z4c864q51zv4gf-system-generators.drv20 /nix/store/a8b3nnqy081fgphfcy860mk11is14cp5-dbus-1.drv21 /nix/store/d69n8492yxjdxlgvil1r0hpks5pllgvm-user-generators.drv22 /nix/store/fr4jrkkyk7zkzqbbgcwrrc6i560qfyif-tmpfiles.d.drv23 /nix/store/djq5b16cc0k8dqai4g4nak4azk7iq20i-X-Restart-Triggers-dbus-broker.drv24 /nix/store/g1w1wz0y90dgz5g9vjz7wkzkldbyw9nf-unit-dbus-broker.service.drv25 /nix/store/izkcfdj2zlwgr6v6vf1gdxjmrdpw3gdk-unit-container-.service.drv26 /nix/store/sjjr2vkzsnypw2zd8gw6rc8ws11iw6m0-X-Restart-Triggers-systemd-tmpfiles-resetup.drv27 /nix/store/kjcn6ak6r41znc3a4n7mb9cjs35s45h6-unit-systemd-tmpfiles-resetup.service.drv28 /nix/store/kvgwrskpjlys3hs1j1xglm5sy4p9klhx-unit-script-update-prefetch-start.drv29 /nix/store/m2a2rjm0k2s72x8c2hb55ymp1lak5slp-unit-update-prefetch.service.drv30 /nix/store/gin3l16973hmcw4cnzb72qj8f171v7qc-system-units.drv31 /nix/store/jrmqy9lqwa0qbwizp17chnn1vp3gh690-system-shutdown.drv32 /nix/store/lk8j6cwzqa8g4z82msrd66b4haagcd71-unit-dbus-broker.service.drv33 /nix/store/vy8lh69hyywfyvw9gv0xfxw9wmr4mm18-user-units.drv34 /nix/store/as1bqvdg8n24123325pmbmdk1q95vjsn-etc.drv35 /nix/store/hc1zarn7i4qnr80cxfy1a3mgp08ifv0r-activate.drv36 /nix/store/nw3fy8m0nn5glzndcq67gkdhc07gbdgv-systemd-boot.drv37 /nix/store/l4cb01a6apx5s8j5siyjdgz2vc01vlhh-install-systemd-boot.sh.drv38 /nix/store/xzc6vjlkhla9fjqfkrdk20dhyy8xc3ah-nixos-system-eve-26.11.20260917.397d52b.drv39error: Cannot build '/nix/store/pywn97agf1aqg32llx7x0qi7gdd9yvhq-nix-store-tests-run.drv'.40 Reason: builder failed with exit code 1.41 Output paths:42 /nix/store/24plkfymp8qndabbhwpgwflhp0wc7qvl-nix-store-tests-run43 Last 25 log lines:44 > [ OK ] S3ToHttpsConversion/S3ToHttpsConversionTest.ConvertsCorrectly/dotted_bucket_with_auto_style_custom_endpoint (0 ms)45 > [----------] 13 tests from S3ToHttpsConversion/S3ToHttpsConversionTest (0 ms total)46 >47 > [----------] 5 tests from S3ToHttpsConversionErrors/S3ToHttpsConversionErrorTest48 > [ RUN ] S3ToHttpsConversionErrors/S3ToHttpsConversionErrorTest.ThrowsOnConversion/virtual_style_with_empty_host_authority49 > [ OK ] S3ToHttpsConversionErrors/S3ToHttpsConversionErrorTest.ThrowsOnConversion/virtual_style_with_empty_host_authority (0 ms)50 > [ RUN ] S3ToHttpsConversionErrors/S3ToHttpsConversionErrorTest.ThrowsOnConversion/dotted_bucket_with_explicit_virtual_style51 > [ OK ] S3ToHttpsConversionErrors/S3ToHttpsConversionErrorTest.ThrowsOnConversion/dotted_bucket_with_explicit_virtual_style (0 ms)52 > [ RUN ] S3ToHttpsConversionErrors/S3ToHttpsConversionErrorTest.ThrowsOnConversion/dotted_bucket_with_explicit_virtual_style_multi_dot53 > [ OK ] S3ToHttpsConversionErrors/S3ToHttpsConversionErrorTest.ThrowsOnConversion/dotted_bucket_with_explicit_virtual_style_multi_dot (0 ms)54 > [ RUN ] S3ToHttpsConversionErrors/S3ToHttpsConversionErrorTest.ThrowsOnConversion/dotted_bucket_with_explicit_virtual_style_custom_authority55 > [ OK ] S3ToHttpsConversionErrors/S3ToHttpsConversionErrorTest.ThrowsOnConversion/dotted_bucket_with_explicit_virtual_style_custom_authority (0 ms)56 > [ RUN ] S3ToHttpsConversionErrors/S3ToHttpsConversionErrorTest.ThrowsOnConversion/dotted_bucket_with_explicit_virtual_style_full_endpoint_url57 > [ OK ] S3ToHttpsConversionErrors/S3ToHttpsConversionErrorTest.ThrowsOnConversion/dotted_bucket_with_explicit_virtual_style_full_endpoint_url (0 ms)58 > [----------] 5 tests from S3ToHttpsConversionErrors/S3ToHttpsConversionErrorTest (0 ms total)59 >60 > [----------] Global test environment tear-down61 > [==========] 798 tests from 90 test suites ran. (1489 ms total)62 > [ PASSED ] 797 tests.63 > [ FAILED ] 1 test, listed below:64 > [ FAILED ] StoreReferenceTest.PathInfo_ssh_unbracketed_ipv6_5_from_uri65 >66 > 1 FAILED TEST67 > YOU HAVE 1 DISABLED TEST68 >69 For full logs, run:70 nix log /nix/store/pywn97agf1aqg32llx7x0qi7gdd9yvhq-nix-store-tests-run.drv71error: Cannot build '/nix/store/jna1xqxfq1v5wpck4z3qn8bnj9wmd9ch-nix-util-tests-run-without-new-syscalls.drv'.72 Reason: builder failed with exit code 1.73 Output paths:74 /nix/store/jlahqnixx9m0q1c9q858imlga6ri4fhg-nix-util-tests-run-without-new-syscalls75 Last 25 log lines:76 > [ RUN ] Unix/UrlPathTest.urlToString/absolute_path77 > [ OK ] Unix/UrlPathTest.urlToString/absolute_path (0 ms)78 > [ RUN ] Unix/UrlPathTest.urlToString/root_path79 > [ OK ] Unix/UrlPathTest.urlToString/root_path (0 ms)80 > [ RUN ] Unix/UrlPathTest.stringToUrl/absolute_path81 > [ OK ] Unix/UrlPathTest.stringToUrl/absolute_path (0 ms)82 > [ RUN ] Unix/UrlPathTest.stringToUrl/root_path83 > [ OK ] Unix/UrlPathTest.stringToUrl/root_path (0 ms)84 > [----------] 8 tests from Unix/UrlPathTest (0 ms total)85 >86 > [----------] Global test environment tear-down87 > [==========] 818 tests from 156 test suites ran. (2995 ms total)88 > [ PASSED ] 812 tests.89 > [ SKIPPED ] 1 test, listed below:90 > [ SKIPPED ] CompressionDecompression/CompressionDecompressionTest.invalidDecompression/none91 > [ FAILED ] 5 tests, listed below:92 > [ FAILED ] ParseURLSuccessCases/ParseURLSuccess.parsesAsExpected/5, where GetParam() = 288-byte object <31-00 00-00 00-00 00-00 A8-86 95-55 55-55 00-00 B0-C7 B0-55 55-55 00-00 04-00 00-00 00-00 00-00 68-74 74-70 00-68 74-74 70-73 00-00 00-00 00-00 02-00 00-00 00-00 00-00 00-56 B0-55 55-55 00-00 ... 00-00 00-00 00-00 00-00 68-C8 B0-55 55-55 00-00 68-C8 B0-55 55-55 00-00 00-00 00-00 00-00 00-00 A0-C8 B0-55 55-55 00-00 00-00 00-00 00-00 00-00 00-65 6C-6C 6F-00 00-00 98-C8 B0-55 55-55 00-00>93 > [ FAILED ] ParseURLSuccessCases/ParseURLSuccess.toStringRoundTrips/5, where GetParam() = 288-byte object <31-00 00-00 00-00 00-00 A8-86 95-55 55-55 00-00 B0-C7 B0-55 55-55 00-00 04-00 00-00 00-00 00-00 68-74 74-70 00-68 74-74 70-73 00-00 00-00 00-00 02-00 00-00 00-00 00-00 F0-2F B1-55 55-55 00-00 ... 00-00 00-00 00-00 00-00 68-C8 B0-55 55-55 00-00 68-C8 B0-55 55-55 00-00 00-00 00-00 00-00 00-00 A0-C8 B0-55 55-55 00-00 00-00 00-00 00-00 00-00 00-65 6C-6C 6F-00 00-00 98-C8 B0-55 55-55 00-00>94 > [ FAILED ] ParseURLSuccessCases/ParseURLSuccess.makeSureFixGitURLDoesNotModify/5, where GetParam() = 288-byte object <31-00 00-00 00-00 00-00 A8-86 95-55 55-55 00-00 B0-C7 B0-55 55-55 00-00 04-00 00-00 00-00 00-00 68-74 74-70 00-68 74-74 70-73 00-00 00-00 00-00 02-00 00-00 00-00 00-00 40-55 B1-55 55-55 00-00 ... 00-00 00-00 00-00 00-00 68-C8 B0-55 55-55 00-00 68-C8 B0-55 55-55 00-00 00-00 00-00 00-00 00-00 A0-C8 B0-55 55-55 00-00 00-00 00-00 00-00 00-00 00-65 6C-6C 6F-00 00-00 98-C8 B0-55 55-55 00-00>95 > [ FAILED ] parseURLRelative/ParseURLRelativeTestSuite.resolve/resolvesRelativePathIpv6AddressWithZoneId, where GetParam() = 336-byte object <3F-00 00-00 00-00 00-00 18-90 95-55 55-55 00-00 10-00 00-00 00-00 00-00 68-34 94-55 55-55 00-00 B0-F2 AF-55 55-55 00-00 04-00 00-00 00-00 00-00 68-74 74-70 00-00 00-00 00-00 00-00 00-00 00-00 ... A0-F3 AF-55 55-55 00-00 00-00 00-00 00-00 00-00 00-F3 AF-55 55-55 00-00 00-00 00-00 00-00 00-00 90-74 B1-55 55-55 00-00 29-00 00-00 00-00 00-00 29-00 00-00 00-00 00-00 F0-F3 AF-55 55-55 00-00>96 > [ FAILED ] parseURLRelative/ParseURLRelativeTestSuite.resolve/absOverrideWithZoneId, where GetParam() = 336-byte object <21-00 00-00 00-00 00-00 60-8E 95-55 55-55 00-00 3C-00 00-00 00-00 00-00 88-8E 95-55 55-55 00-00 B0-F2 AF-55 55-55 00-00 05-00 00-00 00-00 00-00 68-74 74-70 73-00 00-00 00-00 00-00 00-00 00-00 ... A0-F3 AF-55 55-55 00-00 00-00 00-00 00-00 00-00 00-72 61-67 00-55 00-00 00-00 00-00 00-00 00-00 C0-3B B1-55 55-55 00-00 15-00 00-00 00-00 00-00 15-00 00-00 00-00 00-00 69-64 65-00 55-55 00-00>97 >98 > 5 FAILED TESTS99 > YOU HAVE 1 DISABLED TEST100 >101 For full logs, run:102 nix log /nix/store/jna1xqxfq1v5wpck4z3qn8bnj9wmd9ch-nix-util-tests-run-without-new-syscalls.drv103error: Cannot build '/nix/store/wdlzb0mq8kr7ixw4nkwkam6ijbkzdhb7-nix-util-tests-run.drv'.104 Reason: builder failed with exit code 1.105 Output paths:106 /nix/store/wbg4wirj55rfsaifv3nwy7mwkqa2xy5h-nix-util-tests-run107 Last 25 log lines:108 > [ RUN ] Unix/UrlPathTest.urlToString/absolute_path109 > [ OK ] Unix/UrlPathTest.urlToString/absolute_path (0 ms)110 > [ RUN ] Unix/UrlPathTest.urlToString/root_path111 > [ OK ] Unix/UrlPathTest.urlToString/root_path (0 ms)112 > [ RUN ] Unix/UrlPathTest.stringToUrl/absolute_path113 > [ OK ] Unix/UrlPathTest.stringToUrl/absolute_path (0 ms)114 > [ RUN ] Unix/UrlPathTest.stringToUrl/root_path115 > [ OK ] Unix/UrlPathTest.stringToUrl/root_path (0 ms)116 > [----------] 8 tests from Unix/UrlPathTest (0 ms total)117 >118 > [----------] Global test environment tear-down119 > [==========] 818 tests from 156 test suites ran. (3028 ms total)120 > [ PASSED ] 812 tests.121 > [ SKIPPED ] 1 test, listed below:122 > [ SKIPPED ] CompressionDecompression/CompressionDecompressionTest.invalidDecompression/none123 > [ FAILED ] 5 tests, listed below:124 > [ FAILED ] ParseURLSuccessCases/ParseURLSuccess.parsesAsExpected/5, where GetParam() = 288-byte object <31-00 00-00 00-00 00-00 A8-86 95-55 55-55 00-00 B0-C7 B0-55 55-55 00-00 04-00 00-00 00-00 00-00 68-74 74-70 00-68 74-74 70-73 00-00 00-00 00-00 02-00 00-00 00-00 00-00 00-56 B0-55 55-55 00-00 ... 00-00 00-00 00-00 00-00 68-C8 B0-55 55-55 00-00 68-C8 B0-55 55-55 00-00 00-00 00-00 00-00 00-00 A0-C8 B0-55 55-55 00-00 00-00 00-00 00-00 00-00 00-65 6C-6C 6F-00 00-00 98-C8 B0-55 55-55 00-00>125 > [ FAILED ] ParseURLSuccessCases/ParseURLSuccess.toStringRoundTrips/5, where GetParam() = 288-byte object <31-00 00-00 00-00 00-00 A8-86 95-55 55-55 00-00 B0-C7 B0-55 55-55 00-00 04-00 00-00 00-00 00-00 68-74 74-70 00-68 74-74 70-73 00-00 00-00 00-00 02-00 00-00 00-00 00-00 F0-2F B1-55 55-55 00-00 ... 00-00 00-00 00-00 00-00 68-C8 B0-55 55-55 00-00 68-C8 B0-55 55-55 00-00 00-00 00-00 00-00 00-00 A0-C8 B0-55 55-55 00-00 00-00 00-00 00-00 00-00 00-65 6C-6C 6F-00 00-00 98-C8 B0-55 55-55 00-00>126 > [ FAILED ] ParseURLSuccessCases/ParseURLSuccess.makeSureFixGitURLDoesNotModify/5, where GetParam() = 288-byte object <31-00 00-00 00-00 00-00 A8-86 95-55 55-55 00-00 B0-C7 B0-55 55-55 00-00 04-00 00-00 00-00 00-00 68-74 74-70 00-68 74-74 70-73 00-00 00-00 00-00 02-00 00-00 00-00 00-00 40-55 B1-55 55-55 00-00 ... 00-00 00-00 00-00 00-00 68-C8 B0-55 55-55 00-00 68-C8 B0-55 55-55 00-00 00-00 00-00 00-00 00-00 A0-C8 B0-55 55-55 00-00 00-00 00-00 00-00 00-00 00-65 6C-6C 6F-00 00-00 98-C8 B0-55 55-55 00-00>127 > [ FAILED ] parseURLRelative/ParseURLRelativeTestSuite.resolve/resolvesRelativePathIpv6AddressWithZoneId, where GetParam() = 336-byte object <3F-00 00-00 00-00 00-00 18-90 95-55 55-55 00-00 10-00 00-00 00-00 00-00 68-34 94-55 55-55 00-00 B0-F2 AF-55 55-55 00-00 04-00 00-00 00-00 00-00 68-74 74-70 00-00 00-00 00-00 00-00 00-00 00-00 ... A0-F3 AF-55 55-55 00-00 00-00 00-00 00-00 00-00 00-F3 AF-55 55-55 00-00 00-00 00-00 00-00 00-00 90-74 B1-55 55-55 00-00 29-00 00-00 00-00 00-00 29-00 00-00 00-00 00-00 F0-F3 AF-55 55-55 00-00>128 > [ FAILED ] parseURLRelative/ParseURLRelativeTestSuite.resolve/absOverrideWithZoneId, where GetParam() = 336-byte object <21-00 00-00 00-00 00-00 60-8E 95-55 55-55 00-00 3C-00 00-00 00-00 00-00 88-8E 95-55 55-55 00-00 B0-F2 AF-55 55-55 00-00 05-00 00-00 00-00 00-00 68-74 74-70 73-00 00-00 00-00 00-00 00-00 00-00 ... A0-F3 AF-55 55-55 00-00 00-00 00-00 00-00 00-00 00-72 61-67 00-55 00-00 00-00 00-00 00-00 00-00 C0-3B B1-55 55-55 00-00 15-00 00-00 00-00 00-00 15-00 00-00 00-00 00-00 69-64 65-00 55-55 00-00>129 >130 > 5 FAILED TESTS131 > YOU HAVE 1 DISABLED TEST132 >133 For full logs, run:134 nix log /nix/store/wdlzb0mq8kr7ixw4nkwkam6ijbkzdhb7-nix-util-tests-run.drv135error: Cannot build '/nix/store/dpbmzyi65g0hwvj6g8669f62cc96s4lr-nix-2.36.0pre20260916_1de45ba.drv'.136 Reason: 3 dependencies failed.137 Output paths:138 /nix/store/6lx769va5cfq3wixwssm1a6wmqrwvvs5-nix-2.36.0pre20260916_1de45ba-doc139 /nix/store/bzjx147cx6i840zi3ydzd4sw6yxs9srm-nix-2.36.0pre20260916_1de45ba-man140 /nix/store/nf5f2pshfbhrqk2a6svvcbhl6flblbx3-nix-2.36.0pre20260916_1de45ba-dev141 /nix/store/wylj6yb4sbigrb1bmgjrvzd762vqbyzp-nix-2.36.0pre20260916_1de45ba142error: Cannot build '/nix/store/f14qmgwgckrj9ng6i627wyc3m7gsav7r-nix.conf.drv'.143 Reason: 1 dependency failed.144 Output paths:145 /nix/store/kaxggrlrvnwbhpa6f1nkr4jxw3s3sap5-nix.conf146error: Cannot build '/nix/store/kc36sra7230l1gsjnnfh07g3d4hbawm6-nixos-option-26.11.drv'.147 Reason: 1 dependency failed.148 Output paths:149 /nix/store/99y57vvqvrl03pbpmkpml0qn2v5yxa8s-nixos-option-26.11150error: Cannot build '/nix/store/3fkrmlg888561wnl10bb60g9zr30w9yl-nixos-rebuild-ng-26.11.drv'.151 Reason: 1 dependency failed.152 Output paths:153 /nix/store/3bcq2ccqhjppyyq5cv4ndgz4bn3rywbv-nixos-rebuild-ng-26.11154 /nix/store/fwy4c8rqg45h9z6p7bpc89b7b1161m42-nixos-rebuild-ng-26.11-dist155error: Cannot build '/nix/store/a17kllvnhhc2z2v4g1z4c864q51zv4gf-system-generators.drv'.156 Reason: 1 dependency failed.157 Output paths:158 /nix/store/q9sw3fi31gvvwvyiv9gik134iic5q6fv-system-generators159error: Cannot build '/nix/store/jrmqy9lqwa0qbwizp17chnn1vp3gh690-system-shutdown.drv'.160 Reason: 1 dependency failed.161 Output paths:162 /nix/store/0x0bafkk2l5x9lgrgc3nx08aw5210nrp-system-shutdown163error: Cannot build '/nix/store/nw3fy8m0nn5glzndcq67gkdhc07gbdgv-systemd-boot.drv'.164 Reason: 1 dependency failed.165 Output paths:166 /nix/store/x1dkx96r0syxfpq95785pppxzaya50cl-systemd-boot167error: Cannot build '/nix/store/fr4jrkkyk7zkzqbbgcwrrc6i560qfyif-tmpfiles.d.drv'.168 Reason: 1 dependency failed.169 Output paths:170 /nix/store/rczx65srphap3s30gpzwyl5q0ainmsw2-tmpfiles.d171error: Cannot build '/nix/store/izkcfdj2zlwgr6v6vf1gdxjmrdpw3gdk-unit-container-.service.drv'.172 Reason: 1 dependency failed.173 Output paths:174 /nix/store/r5qrfshi2m4rv1vdmf6d130mad534fiv-unit-container-.service175error: Cannot build '/nix/store/2ypnzpr8582n4lpnf9psdarsd8140dyn-unit-container-hermes.service.drv'.176 Reason: 1 dependency failed.177 Output paths:178 /nix/store/g64mr1v3mybvsi4j69nf0rw2ibhslc5w-unit-container-hermes.service179error: Cannot build '/nix/store/264q86rc8pgsddipjj9ar5jkzjghgm6n-unit-harmonia-gc.service.drv'.180 Reason: 1 dependency failed.181 Output paths:182 /nix/store/2y51fk1icxwwglv58190bdidf2zafnlq-unit-harmonia-gc.service183error: Cannot build '/nix/store/2w0vrz5yy7jd6jbhfvj88wjcg1mqmd4y-unit-nix-optimise.service.drv'.184 Reason: 1 dependency failed.185 Output paths:186 /nix/store/6h91xkqcdjhsw2gyaaqd62gyz3fymj4j-unit-nix-optimise.service187error: Cannot build '/nix/store/w0883kc1z6dljmrn6ylnbmqhma69py3y-unit-script-nix-gc-start.drv'.188 Reason: 1 dependency failed.189 Output paths:190 /nix/store/2awjd2bxj637zaxffcakz65pmy1abdl3-unit-script-nix-gc-start191error: Cannot build '/nix/store/kvgwrskpjlys3hs1j1xglm5sy4p9klhx-unit-script-update-prefetch-start.drv'.192 Reason: 1 dependency failed.193 Output paths:194 /nix/store/cm4ryg8hhi9lh6znsjjkzzm9qgn5b7hy-unit-script-update-prefetch-start195error: Cannot build '/nix/store/d69n8492yxjdxlgvil1r0hpks5pllgvm-user-generators.drv'.196 Reason: 1 dependency failed.197 Output paths:198 /nix/store/rv88yah66030qxmfan7whclmbq877s5q-user-generators199error: Cannot build '/nix/store/i0kvp1cjaz0vz0grplac2zbv61958b04-X-Restart-Triggers-nix-daemon.drv'.200 Reason: 1 dependency failed.201 Output paths:202 /nix/store/1x5764620bh0hlmxmbbi204k4gxvwava-X-Restart-Triggers-nix-daemon203error: Cannot build '/nix/store/sjjr2vkzsnypw2zd8gw6rc8ws11iw6m0-X-Restart-Triggers-systemd-tmpfiles-resetup.drv'.204 Reason: 1 dependency failed.205 Output paths:206 /nix/store/7aj99gy7ky5adlx6754bix7v976h9hl2-X-Restart-Triggers-systemd-tmpfiles-resetup207error: Cannot build '/nix/store/l4cb01a6apx5s8j5siyjdgz2vc01vlhh-install-systemd-boot.sh.drv'.208 Reason: 1 dependency failed.209 Output paths:210 /nix/store/svc4gpdyrjz70l0pn7di0cr3mxja55dk-install-systemd-boot.sh211error: Cannot build '/nix/store/4w1pp4373i00bbh7dls80yxgm9y3bhn8-system-path.drv'.212 Reason: 3 dependencies failed.213 Output paths:214 /nix/store/4wmkbav57skg5p2mxs4986f11j8imarq-system-path215error: Cannot build '/nix/store/0c5k3547p45n0nmwzybmkqmbni0vvc7m-unit-nix-gc.service.drv'.216 Reason: 1 dependency failed.217 Output paths:218 /nix/store/mx6aakgld87kyf60afjdrpw1mjm39i27-unit-nix-gc.service219error: Cannot build '/nix/store/m2a2rjm0k2s72x8c2hb55ymp1lak5slp-unit-update-prefetch.service.drv'.220 Reason: 1 dependency failed.221 Output paths:222 /nix/store/rgszz3hj5kb66y1sr4jppfiaqflxb9p9-unit-update-prefetch.service223error: Cannot build '/nix/store/a8b3nnqy081fgphfcy860mk11is14cp5-dbus-1.drv'.224 Reason: 1 dependency failed.225 Output paths:226 /nix/store/97zhl86j9placp4pv9zgicnjqzggfzjp-dbus-1227error: Cannot build '/nix/store/5zc6g5mc395bx9c5vjvl6phkjny5rzcs-unit-nix-daemon.service.drv'.228 Reason: 2 dependencies failed.229 Output paths:230 /nix/store/gwkcd7qlnyv92ms5l3g1ijvs3p9xb709-unit-nix-daemon.service231error: Cannot build '/nix/store/kjcn6ak6r41znc3a4n7mb9cjs35s45h6-unit-systemd-tmpfiles-resetup.service.drv'.232 Reason: 1 dependency failed.233 Output paths:234 /nix/store/hfchbibyw170v90d583lb11sw8rwfhsp-unit-systemd-tmpfiles-resetup.service235error: Cannot build '/nix/store/djq5b16cc0k8dqai4g4nak4azk7iq20i-X-Restart-Triggers-dbus-broker.drv'.236 Reason: 1 dependency failed.237 Output paths:238 /nix/store/5b9hnwl6jqsfrpj1bpy96hdrbp39py4d-X-Restart-Triggers-dbus-broker239error: Cannot build '/nix/store/g1w1wz0y90dgz5g9vjz7wkzkldbyw9nf-unit-dbus-broker.service.drv'.240 Reason: 1 dependency failed.241 Output paths:242 /nix/store/5316fydwif1wjd1qvzs9x9gyn5cxk46h-unit-dbus-broker.service243error: Cannot build '/nix/store/lk8j6cwzqa8g4z82msrd66b4haagcd71-unit-dbus-broker.service.drv'.244 Reason: 1 dependency failed.245 Output paths:246 /nix/store/q2i813k23c0qsg7vvs7iq16w4q5mzcmh-unit-dbus-broker.service247error: Cannot build '/nix/store/gin3l16973hmcw4cnzb72qj8f171v7qc-system-units.drv'.248 Reason: 10 dependencies failed.249 Output paths:250 /nix/store/d26x8j73x39h0fcfgm3whnv2dx4hnbyp-system-units251error: Cannot build '/nix/store/vy8lh69hyywfyvw9gv0xfxw9wmr4mm18-user-units.drv'.252 Reason: 2 dependencies failed.253 Output paths:254 /nix/store/ml24ywja5781pr5sjnldkkb19kv2viri-user-units255error: Cannot build '/nix/store/as1bqvdg8n24123325pmbmdk1q95vjsn-etc.drv'.256 Reason: 9 dependencies failed.257 Output paths:258 /nix/store/hp7yrmh4igcbw1s812vvzdcqdwj7qwwa-etc259error: Cannot build '/nix/store/hc1zarn7i4qnr80cxfy1a3mgp08ifv0r-activate.drv'.260 Reason: 1 dependency failed.261 Output paths:262 /nix/store/7q0h5bz9g9z075bsi7lazs77hw1lr1kd-activate263error: Cannot build '/nix/store/xzc6vjlkhla9fjqfkrdk20dhyy8xc3ah-nixos-system-eve-26.11.20260917.397d52b.drv'.264 Reason: 4 dependencies failed.265 Output paths:266 /nix/store/0n0809lrhi19jbk0wx8w245iqrg0iz9g-nixos-system-eve-26.11.20260917.397d52b