setup
checks.aarch64-linux.nixos-blob64
· build #604
· raw
1these 35 derivations will be built:2 /nix/store/fb8r41wfl9rwirma1ks2awzw2c5w1m5j-flake-inputs.prom.drv3 /nix/store/0161xj9lyccw9j89r768jvpwgaksirz2-config.toml.drv4 /nix/store/5mcpi4kiqmlbzxgsy06cmd4nvzdgwg6p-nix-util-tests-run-without-new-syscalls.drv5 /nix/store/6q3zb9wnm8bk94jxzyrdiy11p5lp9mar-nix-util-tests-run.drv6 /nix/store/fx3swbxbq1vd6kvs2rps48a9f6iixq4f-nix-store-tests-run.drv7 /nix/store/qmlqxiikrb6vsri0cb8mcj237m4fk3fr-nix-2.36.0pre20260916_1de45ba.drv8 /nix/store/p4xg9n5v9q8cla23zq2ax07wawkdnyar-nix.conf.drv9 /nix/store/0x7vxzkf6kb6zfwq81c4ssazgyz571ss-X-Restart-Triggers-nix-daemon.drv10 /nix/store/2r2l9v3c0g9c3mm6f6mbf1h62ymyh1l0-nixos-rebuild-ng-26.11.drv11 /nix/store/xz06k0rbbmkyv2g2qy3s9cvg43lkzh7w-nixos-option-26.11.drv12 /nix/store/0ygj624cw1dz25my4l0w1w6cxhfqwab4-system-path.drv13 /nix/store/65mvy3schxn3mc4nxiwmd9vjdf758dyf-unit-script-nix-gc-start.drv14 /nix/store/2ah8szbzvqv3zdz1a1bg3hvpyqr5x3n7-unit-nix-gc.service.drv15 /nix/store/q4f0c3nicc6rmkgrd8yrc5aqqi2kq4hc-dbus-1.drv16 /nix/store/fyc5ykjmyx57j12sdzs6f5c2hldg0qpw-X-Restart-Triggers-dbus-broker.drv17 /nix/store/2gl7ib4c6dh095g0l6r3bm816a0p4dpq-unit-dbus-broker.service.drv18 /nix/store/88yalfjhg7yiyjzd33rlwmkf0vr4lacw-unit-script-update-prefetch-start.drv19 /nix/store/2my3lfhshmz0jjpa2mm3j2qsyiqcb7pd-unit-update-prefetch.service.drv20 /nix/store/7g4hnhvygsb9jlvxkx249ii8lwnlmnl3-user-generators.drv21 /nix/store/d581i8dhhg7phd9pf7gymhmw9f81krwy-system-shutdown.drv22 /nix/store/i35xhw11f0abrc2pr4k7n0w9w48f9x01-unit-dbus-broker.service.drv23 /nix/store/gixg0cj2bxzl2x7bc7ah2bg862abrsmx-user-units.drv24 /nix/store/jznahsjds5x4478bhf9r7j7rg793pbr4-etc-nix-registry.json.drv25 /nix/store/z39w87ar8z55npczp5nd8nrarpiv1qpb-tmpfiles.d.drv26 /nix/store/731i613npk6a37zn77lm3wpyin80s9a2-X-Restart-Triggers-systemd-tmpfiles-resetup.drv27 /nix/store/ijasln8n5ck28swhhqvqaak8sg68ziz6-unit-systemd-tmpfiles-resetup.service.drv28 /nix/store/k9hafjdywkhb3acbjajalsi7z9pjj84w-unit-harmonia-gc.service.drv29 /nix/store/mx9igk4kxyf20ncp6y1sswgjwagkswyw-unit-nix-optimise.service.drv30 /nix/store/w7ivg8irvi05bw4sjd90akqq8rn4mxlz-unit-nix-daemon.service.drv31 /nix/store/yxx5lphy09fkyffldppyrgx9mk854nlz-unit-telegraf.service.drv32 /nix/store/lbnw6maxkzpy9yshsldn7k6nhm3j4yv0-system-units.drv33 /nix/store/vcfsfbbr1qwnh249n7avwv7vgin4lgc6-system-generators.drv34 /nix/store/5zh976ig8dmmvx6a7h51v6h3i55zqdia-etc.drv35 /nix/store/yil37gcganaanzfx8192s36nrbgrfc37-activate.drv36 /nix/store/gp9xmy3pn5gi421ppkws2bk8q50piv10-nixos-system-blob64-26.11.20260917.397d52b.drv37Failed to find a machine for remote build!38derivation: fx3swbxbq1vd6kvs2rps48a9f6iixq4f-nix-store-tests-run.drv39required (system, features): (aarch64-linux, [])401 available machines:41(systems, maxjobs, supportedFeatures, mandatoryFeatures)42([aarch64-darwin, x86_64-darwin], 8, [big-parallel, recursive-nix], [])43Failed to find a machine for remote build!44derivation: 5mcpi4kiqmlbzxgsy06cmd4nvzdgwg6p-nix-util-tests-run-without-new-syscalls.drv45required (system, features): (aarch64-linux, [])461 available machines:47(systems, maxjobs, supportedFeatures, mandatoryFeatures)48([aarch64-darwin, x86_64-darwin], 8, [big-parallel, recursive-nix], [])49Failed to find a machine for remote build!50derivation: 6q3zb9wnm8bk94jxzyrdiy11p5lp9mar-nix-util-tests-run.drv51required (system, features): (aarch64-linux, [])521 available machines:53(systems, maxjobs, supportedFeatures, mandatoryFeatures)54([aarch64-darwin, x86_64-darwin], 8, [big-parallel, recursive-nix], [])55error: Cannot build '/nix/store/fx3swbxbq1vd6kvs2rps48a9f6iixq4f-nix-store-tests-run.drv'.56 Reason: builder failed with exit code 1.57 Output paths:58 /nix/store/82zir9q4m1jz6lzp3ldcsx2078azd8zw-nix-store-tests-run59 Last 25 log lines:60 > [ OK ] S3ToHttpsConversion/S3ToHttpsConversionTest.ConvertsCorrectly/dotted_bucket_with_auto_style_custom_endpoint (0 ms)61 > [----------] 13 tests from S3ToHttpsConversion/S3ToHttpsConversionTest (0 ms total)62 >63 > [----------] 5 tests from S3ToHttpsConversionErrors/S3ToHttpsConversionErrorTest64 > [ RUN ] S3ToHttpsConversionErrors/S3ToHttpsConversionErrorTest.ThrowsOnConversion/virtual_style_with_empty_host_authority65 > [ OK ] S3ToHttpsConversionErrors/S3ToHttpsConversionErrorTest.ThrowsOnConversion/virtual_style_with_empty_host_authority (0 ms)66 > [ RUN ] S3ToHttpsConversionErrors/S3ToHttpsConversionErrorTest.ThrowsOnConversion/dotted_bucket_with_explicit_virtual_style67 > [ OK ] S3ToHttpsConversionErrors/S3ToHttpsConversionErrorTest.ThrowsOnConversion/dotted_bucket_with_explicit_virtual_style (0 ms)68 > [ RUN ] S3ToHttpsConversionErrors/S3ToHttpsConversionErrorTest.ThrowsOnConversion/dotted_bucket_with_explicit_virtual_style_multi_dot69 > [ OK ] S3ToHttpsConversionErrors/S3ToHttpsConversionErrorTest.ThrowsOnConversion/dotted_bucket_with_explicit_virtual_style_multi_dot (0 ms)70 > [ RUN ] S3ToHttpsConversionErrors/S3ToHttpsConversionErrorTest.ThrowsOnConversion/dotted_bucket_with_explicit_virtual_style_custom_authority71 > [ OK ] S3ToHttpsConversionErrors/S3ToHttpsConversionErrorTest.ThrowsOnConversion/dotted_bucket_with_explicit_virtual_style_custom_authority (0 ms)72 > [ RUN ] S3ToHttpsConversionErrors/S3ToHttpsConversionErrorTest.ThrowsOnConversion/dotted_bucket_with_explicit_virtual_style_full_endpoint_url73 > [ OK ] S3ToHttpsConversionErrors/S3ToHttpsConversionErrorTest.ThrowsOnConversion/dotted_bucket_with_explicit_virtual_style_full_endpoint_url (0 ms)74 > [----------] 5 tests from S3ToHttpsConversionErrors/S3ToHttpsConversionErrorTest (0 ms total)75 >76 > [----------] Global test environment tear-down77 > [==========] 798 tests from 90 test suites ran. (1681 ms total)78 > [ PASSED ] 797 tests.79 > [ FAILED ] 1 test, listed below:80 > [ FAILED ] StoreReferenceTest.PathInfo_ssh_unbracketed_ipv6_5_from_uri81 >82 > 1 FAILED TEST83 > YOU HAVE 1 DISABLED TEST84 >85 For full logs, run:86 nix log /nix/store/fx3swbxbq1vd6kvs2rps48a9f6iixq4f-nix-store-tests-run.drv87error: Cannot build '/nix/store/5mcpi4kiqmlbzxgsy06cmd4nvzdgwg6p-nix-util-tests-run-without-new-syscalls.drv'.88 Reason: builder failed with exit code 1.89 Output paths:90 /nix/store/pxkx355bpxvr2ydf1jbww4816r4xh6w6-nix-util-tests-run-without-new-syscalls91 Last 25 log lines:92 > [ RUN ] Unix/UrlPathTest.urlToString/absolute_path93 > [ OK ] Unix/UrlPathTest.urlToString/absolute_path (0 ms)94 > [ RUN ] Unix/UrlPathTest.urlToString/root_path95 > [ OK ] Unix/UrlPathTest.urlToString/root_path (0 ms)96 > [ RUN ] Unix/UrlPathTest.stringToUrl/absolute_path97 > [ OK ] Unix/UrlPathTest.stringToUrl/absolute_path (0 ms)98 > [ RUN ] Unix/UrlPathTest.stringToUrl/root_path99 > [ OK ] Unix/UrlPathTest.stringToUrl/root_path (0 ms)100 > [----------] 8 tests from Unix/UrlPathTest (0 ms total)101 >102 > [----------] Global test environment tear-down103 > [==========] 818 tests from 156 test suites ran. (2934 ms total)104 > [ PASSED ] 812 tests.105 > [ SKIPPED ] 1 test, listed below:106 > [ SKIPPED ] CompressionDecompression/CompressionDecompressionTest.invalidDecompression/none107 > [ FAILED ] 5 tests, listed below:108 > [ FAILED ] ParseURLSuccessCases/ParseURLSuccess.parsesAsExpected/5, where GetParam() = 288-byte object <31-00 00-00 00-00 00-00 10-BE E4-AA AA-AA 00-00 00-B1 FF-AA AA-AA 00-00 04-00 00-00 00-00 00-00 68-74 74-70 00-68 74-74 70-73 00-00 00-00 00-00 02-00 00-00 00-00 00-00 10-FC FE-AA AA-AA 00-00 ... 00-00 00-00 00-00 00-00 B8-B1 FF-AA AA-AA 00-00 B8-B1 FF-AA AA-AA 00-00 00-00 00-00 00-00 00-00 F0-B1 FF-AA AA-AA 00-00 00-00 00-00 00-00 00-00 00-65 6C-6C 6F-00 00-00 E8-B1 FF-AA AA-AA 00-00>109 > [ FAILED ] ParseURLSuccessCases/ParseURLSuccess.toStringRoundTrips/5, where GetParam() = 288-byte object <31-00 00-00 00-00 00-00 10-BE E4-AA AA-AA 00-00 00-B1 FF-AA AA-AA 00-00 04-00 00-00 00-00 00-00 68-74 74-70 00-68 74-74 70-73 00-00 00-00 00-00 02-00 00-00 00-00 00-00 60-1B 00-AB AA-AA 00-00 ... 00-00 00-00 00-00 00-00 B8-B1 FF-AA AA-AA 00-00 B8-B1 FF-AA AA-AA 00-00 00-00 00-00 00-00 00-00 F0-B1 FF-AA AA-AA 00-00 00-00 00-00 00-00 00-00 00-65 6C-6C 6F-00 00-00 E8-B1 FF-AA AA-AA 00-00>110 > [ FAILED ] ParseURLSuccessCases/ParseURLSuccess.makeSureFixGitURLDoesNotModify/5, where GetParam() = 288-byte object <31-00 00-00 00-00 00-00 10-BE E4-AA AA-AA 00-00 00-B1 FF-AA AA-AA 00-00 04-00 00-00 00-00 00-00 68-74 74-70 00-68 74-74 70-73 00-00 00-00 00-00 02-00 00-00 00-00 00-00 C0-3F 00-AB AA-AA 00-00 ... 00-00 00-00 00-00 00-00 B8-B1 FF-AA AA-AA 00-00 B8-B1 FF-AA AA-AA 00-00 00-00 00-00 00-00 00-00 F0-B1 FF-AA AA-AA 00-00 00-00 00-00 00-00 00-00 00-65 6C-6C 6F-00 00-00 E8-B1 FF-AA AA-AA 00-00>111 > [ FAILED ] parseURLRelative/ParseURLRelativeTestSuite.resolve/resolvesRelativePathIpv6AddressWithZoneId, where GetParam() = 336-byte object <3F-00 00-00 00-00 00-00 D8-C9 E4-AA AA-AA 00-00 10-00 00-00 00-00 00-00 18-CA E4-AA AA-AA 00-00 E0-4D FF-AA AA-AA 00-00 04-00 00-00 00-00 00-00 68-74 74-70 00-00 00-00 01-00 00-00 00-00 00-00 ... D0-4E FF-AA AA-AA 00-00 00-00 00-00 00-00 00-00 00-4E FF-AA AA-AA 00-00 00-00 00-00 00-00 00-00 A0-5E 00-AB AA-AA 00-00 29-00 00-00 00-00 00-00 29-00 00-00 00-00 00-00 30-96 FE-AA AA-AA 00-00>112 > [ FAILED ] parseURLRelative/ParseURLRelativeTestSuite.resolve/absOverrideWithZoneId, where GetParam() = 336-byte object <21-00 00-00 00-00 00-00 18-CC E4-AA AA-AA 00-00 3C-00 00-00 00-00 00-00 80-CC E4-AA AA-AA 00-00 E0-4D FF-AA AA-AA 00-00 05-00 00-00 00-00 00-00 68-74 74-70 73-00 00-00 01-00 00-00 00-00 00-00 ... D0-4E FF-AA AA-AA 00-00 00-00 00-00 00-00 00-00 00-72 61-67 00-AA 00-00 00-00 00-00 00-00 00-00 10-2A 00-AB AA-AA 00-00 15-00 00-00 00-00 00-00 15-00 00-00 00-00 00-00 69-64 65-00 AA-AA 00-00>113 >114 > 5 FAILED TESTS115 > YOU HAVE 1 DISABLED TEST116 >117 For full logs, run:118 nix log /nix/store/5mcpi4kiqmlbzxgsy06cmd4nvzdgwg6p-nix-util-tests-run-without-new-syscalls.drv119error: Cannot build '/nix/store/6q3zb9wnm8bk94jxzyrdiy11p5lp9mar-nix-util-tests-run.drv'.120 Reason: builder failed with exit code 1.121 Output paths:122 /nix/store/5db70ilwhx6idi37gbf7q10njvwcxzx5-nix-util-tests-run123 Last 25 log lines:124 > [ RUN ] Unix/UrlPathTest.urlToString/absolute_path125 > [ OK ] Unix/UrlPathTest.urlToString/absolute_path (0 ms)126 > [ RUN ] Unix/UrlPathTest.urlToString/root_path127 > [ OK ] Unix/UrlPathTest.urlToString/root_path (0 ms)128 > [ RUN ] Unix/UrlPathTest.stringToUrl/absolute_path129 > [ OK ] Unix/UrlPathTest.stringToUrl/absolute_path (0 ms)130 > [ RUN ] Unix/UrlPathTest.stringToUrl/root_path131 > [ OK ] Unix/UrlPathTest.stringToUrl/root_path (0 ms)132 > [----------] 8 tests from Unix/UrlPathTest (0 ms total)133 >134 > [----------] Global test environment tear-down135 > [==========] 818 tests from 156 test suites ran. (2975 ms total)136 > [ PASSED ] 812 tests.137 > [ SKIPPED ] 1 test, listed below:138 > [ SKIPPED ] CompressionDecompression/CompressionDecompressionTest.invalidDecompression/none139 > [ FAILED ] 5 tests, listed below:140 > [ FAILED ] ParseURLSuccessCases/ParseURLSuccess.parsesAsExpected/5, where GetParam() = 288-byte object <31-00 00-00 00-00 00-00 10-BE E4-AA AA-AA 00-00 00-B1 FF-AA AA-AA 00-00 04-00 00-00 00-00 00-00 68-74 74-70 00-68 74-74 70-73 00-00 00-00 00-00 02-00 00-00 00-00 00-00 10-FC FE-AA AA-AA 00-00 ... 00-00 00-00 00-00 00-00 B8-B1 FF-AA AA-AA 00-00 B8-B1 FF-AA AA-AA 00-00 00-00 00-00 00-00 00-00 F0-B1 FF-AA AA-AA 00-00 00-00 00-00 00-00 00-00 00-65 6C-6C 6F-00 00-00 E8-B1 FF-AA AA-AA 00-00>141 > [ FAILED ] ParseURLSuccessCases/ParseURLSuccess.toStringRoundTrips/5, where GetParam() = 288-byte object <31-00 00-00 00-00 00-00 10-BE E4-AA AA-AA 00-00 00-B1 FF-AA AA-AA 00-00 04-00 00-00 00-00 00-00 68-74 74-70 00-68 74-74 70-73 00-00 00-00 00-00 02-00 00-00 00-00 00-00 60-1B 00-AB AA-AA 00-00 ... 00-00 00-00 00-00 00-00 B8-B1 FF-AA AA-AA 00-00 B8-B1 FF-AA AA-AA 00-00 00-00 00-00 00-00 00-00 F0-B1 FF-AA AA-AA 00-00 00-00 00-00 00-00 00-00 00-65 6C-6C 6F-00 00-00 E8-B1 FF-AA AA-AA 00-00>142 > [ FAILED ] ParseURLSuccessCases/ParseURLSuccess.makeSureFixGitURLDoesNotModify/5, where GetParam() = 288-byte object <31-00 00-00 00-00 00-00 10-BE E4-AA AA-AA 00-00 00-B1 FF-AA AA-AA 00-00 04-00 00-00 00-00 00-00 68-74 74-70 00-68 74-74 70-73 00-00 00-00 00-00 02-00 00-00 00-00 00-00 C0-3F 00-AB AA-AA 00-00 ... 00-00 00-00 00-00 00-00 B8-B1 FF-AA AA-AA 00-00 B8-B1 FF-AA AA-AA 00-00 00-00 00-00 00-00 00-00 F0-B1 FF-AA AA-AA 00-00 00-00 00-00 00-00 00-00 00-65 6C-6C 6F-00 00-00 E8-B1 FF-AA AA-AA 00-00>143 > [ FAILED ] parseURLRelative/ParseURLRelativeTestSuite.resolve/resolvesRelativePathIpv6AddressWithZoneId, where GetParam() = 336-byte object <3F-00 00-00 00-00 00-00 D8-C9 E4-AA AA-AA 00-00 10-00 00-00 00-00 00-00 18-CA E4-AA AA-AA 00-00 E0-4D FF-AA AA-AA 00-00 04-00 00-00 00-00 00-00 68-74 74-70 00-00 00-00 01-00 00-00 00-00 00-00 ... D0-4E FF-AA AA-AA 00-00 00-00 00-00 00-00 00-00 00-4E FF-AA AA-AA 00-00 00-00 00-00 00-00 00-00 A0-5E 00-AB AA-AA 00-00 29-00 00-00 00-00 00-00 29-00 00-00 00-00 00-00 30-96 FE-AA AA-AA 00-00>144 > [ FAILED ] parseURLRelative/ParseURLRelativeTestSuite.resolve/absOverrideWithZoneId, where GetParam() = 336-byte object <21-00 00-00 00-00 00-00 18-CC E4-AA AA-AA 00-00 3C-00 00-00 00-00 00-00 80-CC E4-AA AA-AA 00-00 E0-4D FF-AA AA-AA 00-00 05-00 00-00 00-00 00-00 68-74 74-70 73-00 00-00 01-00 00-00 00-00 00-00 ... D0-4E FF-AA AA-AA 00-00 00-00 00-00 00-00 00-00 00-72 61-67 00-AA 00-00 00-00 00-00 00-00 00-00 10-2A 00-AB AA-AA 00-00 15-00 00-00 00-00 00-00 15-00 00-00 00-00 00-00 69-64 65-00 AA-AA 00-00>145 >146 > 5 FAILED TESTS147 > YOU HAVE 1 DISABLED TEST148 >149 For full logs, run:150 nix log /nix/store/6q3zb9wnm8bk94jxzyrdiy11p5lp9mar-nix-util-tests-run.drv151error: Cannot build '/nix/store/qmlqxiikrb6vsri0cb8mcj237m4fk3fr-nix-2.36.0pre20260916_1de45ba.drv'.152 Reason: 3 dependencies failed.153 Output paths:154 /nix/store/8d6n4m6fdmc614hc1aycd4d7ac1w7pk5-nix-2.36.0pre20260916_1de45ba-dev155 /nix/store/b0ilbgmspv3x8ax5sw9fd65xv7mx1vmq-nix-2.36.0pre20260916_1de45ba156 /nix/store/j674wcn8mhqwlhbd244ny8q3v5rpzdl2-nix-2.36.0pre20260916_1de45ba-man157 /nix/store/kzdv25x03z5l1wikw0x8rrmsdk9j6i47-nix-2.36.0pre20260916_1de45ba-doc158error: Cannot build '/nix/store/p4xg9n5v9q8cla23zq2ax07wawkdnyar-nix.conf.drv'.159 Reason: 1 dependency failed.160 Output paths:161 /nix/store/76nnd4b28zzn03981xzhpbwa2zsz1sm2-nix.conf162error: Cannot build '/nix/store/xz06k0rbbmkyv2g2qy3s9cvg43lkzh7w-nixos-option-26.11.drv'.163 Reason: 1 dependency failed.164 Output paths:165 /nix/store/7ycvi2bv8dj9ik2fgkl2ck4zql3d4sn6-nixos-option-26.11166error: Cannot build '/nix/store/2r2l9v3c0g9c3mm6f6mbf1h62ymyh1l0-nixos-rebuild-ng-26.11.drv'.167 Reason: 1 dependency failed.168 Output paths:169 /nix/store/scqd8g8gjhzd65rrd25j9ngp6yg3m88l-nixos-rebuild-ng-26.11-dist170 /nix/store/v1lglc7364wssgjfmsn17rg2nmk1vg6c-nixos-rebuild-ng-26.11171error: Cannot build '/nix/store/vcfsfbbr1qwnh249n7avwv7vgin4lgc6-system-generators.drv'.172 Reason: 1 dependency failed.173 Output paths:174 /nix/store/lj7d2jqw4gd569nw3i7nc01bwg9h2ca2-system-generators175error: Cannot build '/nix/store/d581i8dhhg7phd9pf7gymhmw9f81krwy-system-shutdown.drv'.176 Reason: 1 dependency failed.177 Output paths:178 /nix/store/q77k43v8ivmlif07irpdww6w2qf1lc62-system-shutdown179error: Cannot build '/nix/store/z39w87ar8z55npczp5nd8nrarpiv1qpb-tmpfiles.d.drv'.180 Reason: 1 dependency failed.181 Output paths:182 /nix/store/rwvxpw1ipi2zv0bnv12b06fzrkf89s92-tmpfiles.d183error: Cannot build '/nix/store/k9hafjdywkhb3acbjajalsi7z9pjj84w-unit-harmonia-gc.service.drv'.184 Reason: 1 dependency failed.185 Output paths:186 /nix/store/j3js1iw7x16hh5wghli9khy3i06gn7ii-unit-harmonia-gc.service187error: Cannot build '/nix/store/mx9igk4kxyf20ncp6y1sswgjwagkswyw-unit-nix-optimise.service.drv'.188 Reason: 1 dependency failed.189 Output paths:190 /nix/store/ypvhwn8ikx2c5k4fi4zmcxib4d7viakr-unit-nix-optimise.service191error: Cannot build '/nix/store/65mvy3schxn3mc4nxiwmd9vjdf758dyf-unit-script-nix-gc-start.drv'.192 Reason: 1 dependency failed.193 Output paths:194 /nix/store/w4ghlzjcvhixyfcs8na2j78bniccxshq-unit-script-nix-gc-start195error: Cannot build '/nix/store/88yalfjhg7yiyjzd33rlwmkf0vr4lacw-unit-script-update-prefetch-start.drv'.196 Reason: 1 dependency failed.197 Output paths:198 /nix/store/qcpbl42sin0q05wr2q2r5rz0m7fgqbl4-unit-script-update-prefetch-start199error: Cannot build '/nix/store/7g4hnhvygsb9jlvxkx249ii8lwnlmnl3-user-generators.drv'.200 Reason: 1 dependency failed.201 Output paths:202 /nix/store/fcr7iv26s6f290rzxns5nb2lqn3xvhjm-user-generators203error: Cannot build '/nix/store/0x7vxzkf6kb6zfwq81c4ssazgyz571ss-X-Restart-Triggers-nix-daemon.drv'.204 Reason: 1 dependency failed.205 Output paths:206 /nix/store/b67m4c76hhwq89c3x1k6h3n9w5rd0gq1-X-Restart-Triggers-nix-daemon207error: Cannot build '/nix/store/731i613npk6a37zn77lm3wpyin80s9a2-X-Restart-Triggers-systemd-tmpfiles-resetup.drv'.208 Reason: 1 dependency failed.209 Output paths:210 /nix/store/yjhpyf4hs5r00qpr6641hn8v5gxp4p8p-X-Restart-Triggers-systemd-tmpfiles-resetup211error: Cannot build '/nix/store/0ygj624cw1dz25my4l0w1w6cxhfqwab4-system-path.drv'.212 Reason: 3 dependencies failed.213 Output paths:214 /nix/store/f5nwjjz2013xv0vg1941fa0iamc3p53w-system-path215error: Cannot build '/nix/store/2ah8szbzvqv3zdz1a1bg3hvpyqr5x3n7-unit-nix-gc.service.drv'.216 Reason: 1 dependency failed.217 Output paths:218 /nix/store/qk19912va7gb426nzxdc8zcfa9nqaal3-unit-nix-gc.service219error: Cannot build '/nix/store/2my3lfhshmz0jjpa2mm3j2qsyiqcb7pd-unit-update-prefetch.service.drv'.220 Reason: 1 dependency failed.221 Output paths:222 /nix/store/qh5kmp3bmq5x1gz40qm0wprqgd9wipl8-unit-update-prefetch.service223error: Cannot build '/nix/store/q4f0c3nicc6rmkgrd8yrc5aqqi2kq4hc-dbus-1.drv'.224 Reason: 1 dependency failed.225 Output paths:226 /nix/store/rhnvy749c99vy1khvylzw9agjnbp8ix2-dbus-1227error: Cannot build '/nix/store/w7ivg8irvi05bw4sjd90akqq8rn4mxlz-unit-nix-daemon.service.drv'.228 Reason: 2 dependencies failed.229 Output paths:230 /nix/store/hiizyrbv3la66awiwa5wvlf69wj05llx-unit-nix-daemon.service231error: Cannot build '/nix/store/ijasln8n5ck28swhhqvqaak8sg68ziz6-unit-systemd-tmpfiles-resetup.service.drv'.232 Reason: 1 dependency failed.233 Output paths:234 /nix/store/5iim6msbnnyq26240n0w3a60x0g9sx6c-unit-systemd-tmpfiles-resetup.service235error: Cannot build '/nix/store/fyc5ykjmyx57j12sdzs6f5c2hldg0qpw-X-Restart-Triggers-dbus-broker.drv'.236 Reason: 1 dependency failed.237 Output paths:238 /nix/store/7cd6ai82j865lhcph42r36mzb88vfyqg-X-Restart-Triggers-dbus-broker239error: Cannot build '/nix/store/2gl7ib4c6dh095g0l6r3bm816a0p4dpq-unit-dbus-broker.service.drv'.240 Reason: 1 dependency failed.241 Output paths:242 /nix/store/ga9mns35ij3rvcgbjrhq5zvxvly5c8c2-unit-dbus-broker.service243error: Cannot build '/nix/store/i35xhw11f0abrc2pr4k7n0w9w48f9x01-unit-dbus-broker.service.drv'.244 Reason: 1 dependency failed.245 Output paths:246 /nix/store/m5qvmy4vbdkgyygvl2jqv4l9cbf40z0s-unit-dbus-broker.service247error: Cannot build '/nix/store/lbnw6maxkzpy9yshsldn7k6nhm3j4yv0-system-units.drv'.248 Reason: 8 dependencies failed.249 Output paths:250 /nix/store/h58crqvdn4d0fn8kbc1s6x4y42nl84m7-system-units251error: Cannot build '/nix/store/gixg0cj2bxzl2x7bc7ah2bg862abrsmx-user-units.drv'.252 Reason: 2 dependencies failed.253 Output paths:254 /nix/store/sw7vmnbqygz0pss8af2l4gz8gniljj08-user-units255error: Cannot build '/nix/store/5zh976ig8dmmvx6a7h51v6h3i55zqdia-etc.drv'.256 Reason: 9 dependencies failed.257 Output paths:258 /nix/store/3s2922w9rflsjcz6hfcdbpncivw1j9sx-etc259error: Cannot build '/nix/store/yil37gcganaanzfx8192s36nrbgrfc37-activate.drv'.260 Reason: 1 dependency failed.261 Output paths:262 /nix/store/zrcgbqwj97mki3fkwi1322yh1cxasfhq-activate263error: Cannot build '/nix/store/gp9xmy3pn5gi421ppkws2bk8q50piv10-nixos-system-blob64-26.11.20260917.397d52b.drv'.264 Reason: 3 dependencies failed.265 Output paths:266 /nix/store/hkq4afadgnfy0paq94q9n38wpvgvpzlk-nixos-system-blob64-26.11.20260917.397d52b