setup
checks.x86_64-linux.nixos-bernie
· build #604
· raw
1these 39 derivations will be built:2 /nix/store/jna1xqxfq1v5wpck4z3qn8bnj9wmd9ch-nix-util-tests-run-without-new-syscalls.drv3 /nix/store/pywn97agf1aqg32llx7x0qi7gdd9yvhq-nix-store-tests-run.drv4 /nix/store/wdlzb0mq8kr7ixw4nkwkam6ijbkzdhb7-nix-util-tests-run.drv5 /nix/store/dpbmzyi65g0hwvj6g8669f62cc96s4lr-nix-2.36.0pre20260916_1de45ba.drv6 /nix/store/029x4rx1ph75gardrbvf281rc4miw50p-unit-script-update-prefetch-start.drv7 /nix/store/3fkrmlg888561wnl10bb60g9zr30w9yl-nixos-rebuild-ng-26.11.drv8 /nix/store/kc36sra7230l1gsjnnfh07g3d4hbawm6-nixos-option-26.11.drv9 /nix/store/0a45rkf7zqfjkj97vkirkghiw9hcamkg-system-path.drv10 /nix/store/w0883kc1z6dljmrn6ylnbmqhma69py3y-unit-script-nix-gc-start.drv11 /nix/store/0c5k3547p45n0nmwzybmkqmbni0vvc7m-unit-nix-gc.service.drv12 /nix/store/0rv6qadk3qh6k2n4j5aplbj3sa0v9n0z-etc-nix-registry.json.drv13 /nix/store/1z87q0nj95w3jci11x2hm9s1nsxj7ggi-system-shutdown.drv14 /nix/store/226lkmv8nz6yrqicb4qs2zapyx5m18pc-systemd-boot.drv15 /nix/store/264q86rc8pgsddipjj9ar5jkzjghgm6n-unit-harmonia-gc.service.drv16 /nix/store/2vgs0b2zynj58h348pcpjrbi9cllly6i-dbus-1.drv17 /nix/store/2w0vrz5yy7jd6jbhfvj88wjcg1mqmd4y-unit-nix-optimise.service.drv18 /nix/store/6qd86hcnhgwcgwgdplmqlx43sbj5hl4q-nix.conf.drv19 /nix/store/gaa7q4g5hl1za9q17w89qvc3ysncrjgc-system-generators.drv20 /nix/store/i6l7s59dg4wydrm2j8dj4akvj0iqskyv-user-generators.drv21 /nix/store/r4c6815wr456c4plfhgiisqnan7m582i-X-Restart-Triggers-polkit.drv22 /nix/store/415r5slig62jjfq9yxzcgzqnsszx2d43-unit-polkit.service.drv23 /nix/store/h43sajik2wps09c6ch0q17hz0m7izd6f-config.toml.drv24 /nix/store/4pk6pff5b5whhgmplwkagmmyjhhnfxkk-unit-telegraf.service.drv25 /nix/store/v8lwirl6zgp3rcnhifqbgkapd9n7k7dm-X-Restart-Triggers-nix-daemon.drv26 /nix/store/ckmh93h3pwlm9l3i6mdpk4k86jn9m1iq-unit-nix-daemon.service.drv27 /nix/store/syl4xqiwkynndw1r52hhcqbsir5n312p-X-Restart-Triggers-dbus-broker.drv28 /nix/store/dz8wsrnj4dy404y2ylbyclkm4xdr5anb-unit-dbus-broker.service.drv29 /nix/store/glyj2zazm2i766fdily836virgg1p99v-unit-accounts-daemon.service.drv30 /nix/store/vjyifc82z3s76w58n2fsfjaysky2sgc9-tmpfiles.d.drv31 /nix/store/jyjg6w23s3mz5rkxzg5r4sv661prs69y-X-Restart-Triggers-systemd-tmpfiles-resetup.drv32 /nix/store/va5qyv9xy99qag98zcx0kik122nbhxzj-unit-systemd-tmpfiles-resetup.service.drv33 /nix/store/x4dv2v1l2iy6wp2zk5chwybm62vz55dl-unit-update-prefetch.service.drv34 /nix/store/srw73czffizm0i2568f8p49z26qmwgn8-system-units.drv35 /nix/store/yfrz9zwq9a8ii3bmnc6psaqiliv7v038-unit-dbus-broker.service.drv36 /nix/store/xggbcvz7bg1axwkfbmy3c2apqqz3i8kg-user-units.drv37 /nix/store/729rbw70rhl7sp2fscimaiq2ngyy9p3r-etc.drv38 /nix/store/qaknmnqjfnhbkp9kpsx3nh21yxl1rfpp-activate.drv39 /nix/store/r2b7a186i7jyqhszp4vxk4qvp1hnh176-install-systemd-boot.sh.drv40 /nix/store/3v2shpwc951ad9j6v5aqdxm3gjncnl54-nixos-system-bernie-26.11.20260917.397d52b.drv41error: Cannot build '/nix/store/jna1xqxfq1v5wpck4z3qn8bnj9wmd9ch-nix-util-tests-run-without-new-syscalls.drv'.42 Reason: builder failed with exit code 1.43 Output paths:44 /nix/store/jlahqnixx9m0q1c9q858imlga6ri4fhg-nix-util-tests-run-without-new-syscalls45 Last 25 log lines:46 > [ RUN ] Unix/UrlPathTest.urlToString/absolute_path47 > [ OK ] Unix/UrlPathTest.urlToString/absolute_path (0 ms)48 > [ RUN ] Unix/UrlPathTest.urlToString/root_path49 > [ OK ] Unix/UrlPathTest.urlToString/root_path (0 ms)50 > [ RUN ] Unix/UrlPathTest.stringToUrl/absolute_path51 > [ OK ] Unix/UrlPathTest.stringToUrl/absolute_path (0 ms)52 > [ RUN ] Unix/UrlPathTest.stringToUrl/root_path53 > [ OK ] Unix/UrlPathTest.stringToUrl/root_path (0 ms)54 > [----------] 8 tests from Unix/UrlPathTest (0 ms total)55 >56 > [----------] Global test environment tear-down57 > [==========] 818 tests from 156 test suites ran. (2915 ms total)58 > [ PASSED ] 812 tests.59 > [ SKIPPED ] 1 test, listed below:60 > [ SKIPPED ] CompressionDecompression/CompressionDecompressionTest.invalidDecompression/none61 > [ FAILED ] 5 tests, listed below:62 > [ FAILED ] ParseURLSuccessCases/ParseURLSuccess.parsesAsExpected/5, where GetParam() = 288-byte object <31-00 00-00 00-00 00-00 A8-86 95-55 55-55 00-00 B0-C7 B0-55 55-55 00-00 04-00 00-00 00-00 00-00 68-74 74-70 00-68 74-74 70-73 00-00 00-00 00-00 02-00 00-00 00-00 00-00 00-56 B0-55 55-55 00-00 ... 00-00 00-00 00-00 00-00 68-C8 B0-55 55-55 00-00 68-C8 B0-55 55-55 00-00 00-00 00-00 00-00 00-00 A0-C8 B0-55 55-55 00-00 00-00 00-00 00-00 00-00 00-65 6C-6C 6F-00 00-00 98-C8 B0-55 55-55 00-00>63 > [ FAILED ] ParseURLSuccessCases/ParseURLSuccess.toStringRoundTrips/5, where GetParam() = 288-byte object <31-00 00-00 00-00 00-00 A8-86 95-55 55-55 00-00 B0-C7 B0-55 55-55 00-00 04-00 00-00 00-00 00-00 68-74 74-70 00-68 74-74 70-73 00-00 00-00 00-00 02-00 00-00 00-00 00-00 F0-2F B1-55 55-55 00-00 ... 00-00 00-00 00-00 00-00 68-C8 B0-55 55-55 00-00 68-C8 B0-55 55-55 00-00 00-00 00-00 00-00 00-00 A0-C8 B0-55 55-55 00-00 00-00 00-00 00-00 00-00 00-65 6C-6C 6F-00 00-00 98-C8 B0-55 55-55 00-00>64 > [ FAILED ] ParseURLSuccessCases/ParseURLSuccess.makeSureFixGitURLDoesNotModify/5, where GetParam() = 288-byte object <31-00 00-00 00-00 00-00 A8-86 95-55 55-55 00-00 B0-C7 B0-55 55-55 00-00 04-00 00-00 00-00 00-00 68-74 74-70 00-68 74-74 70-73 00-00 00-00 00-00 02-00 00-00 00-00 00-00 40-55 B1-55 55-55 00-00 ... 00-00 00-00 00-00 00-00 68-C8 B0-55 55-55 00-00 68-C8 B0-55 55-55 00-00 00-00 00-00 00-00 00-00 A0-C8 B0-55 55-55 00-00 00-00 00-00 00-00 00-00 00-65 6C-6C 6F-00 00-00 98-C8 B0-55 55-55 00-00>65 > [ FAILED ] parseURLRelative/ParseURLRelativeTestSuite.resolve/resolvesRelativePathIpv6AddressWithZoneId, where GetParam() = 336-byte object <3F-00 00-00 00-00 00-00 18-90 95-55 55-55 00-00 10-00 00-00 00-00 00-00 68-34 94-55 55-55 00-00 B0-F2 AF-55 55-55 00-00 04-00 00-00 00-00 00-00 68-74 74-70 00-00 00-00 00-00 00-00 00-00 00-00 ... A0-F3 AF-55 55-55 00-00 00-00 00-00 00-00 00-00 00-F3 AF-55 55-55 00-00 00-00 00-00 00-00 00-00 90-74 B1-55 55-55 00-00 29-00 00-00 00-00 00-00 29-00 00-00 00-00 00-00 F0-F3 AF-55 55-55 00-00>66 > [ FAILED ] parseURLRelative/ParseURLRelativeTestSuite.resolve/absOverrideWithZoneId, where GetParam() = 336-byte object <21-00 00-00 00-00 00-00 60-8E 95-55 55-55 00-00 3C-00 00-00 00-00 00-00 88-8E 95-55 55-55 00-00 B0-F2 AF-55 55-55 00-00 05-00 00-00 00-00 00-00 68-74 74-70 73-00 00-00 00-00 00-00 00-00 00-00 ... A0-F3 AF-55 55-55 00-00 00-00 00-00 00-00 00-00 00-72 61-67 00-55 00-00 00-00 00-00 00-00 00-00 C0-3B B1-55 55-55 00-00 15-00 00-00 00-00 00-00 15-00 00-00 00-00 00-00 69-64 65-00 55-55 00-00>67 >68 > 5 FAILED TESTS69 > YOU HAVE 1 DISABLED TEST70 >71 For full logs, run:72 nix log /nix/store/jna1xqxfq1v5wpck4z3qn8bnj9wmd9ch-nix-util-tests-run-without-new-syscalls.drv73error: Cannot build '/nix/store/pywn97agf1aqg32llx7x0qi7gdd9yvhq-nix-store-tests-run.drv'.74 Reason: builder failed with exit code 1.75 Output paths:76 /nix/store/24plkfymp8qndabbhwpgwflhp0wc7qvl-nix-store-tests-run77 Last 25 log lines:78 > [ OK ] S3ToHttpsConversion/S3ToHttpsConversionTest.ConvertsCorrectly/dotted_bucket_with_auto_style_custom_endpoint (0 ms)79 > [----------] 13 tests from S3ToHttpsConversion/S3ToHttpsConversionTest (0 ms total)80 >81 > [----------] 5 tests from S3ToHttpsConversionErrors/S3ToHttpsConversionErrorTest82 > [ RUN ] S3ToHttpsConversionErrors/S3ToHttpsConversionErrorTest.ThrowsOnConversion/virtual_style_with_empty_host_authority83 > [ OK ] S3ToHttpsConversionErrors/S3ToHttpsConversionErrorTest.ThrowsOnConversion/virtual_style_with_empty_host_authority (0 ms)84 > [ RUN ] S3ToHttpsConversionErrors/S3ToHttpsConversionErrorTest.ThrowsOnConversion/dotted_bucket_with_explicit_virtual_style85 > [ OK ] S3ToHttpsConversionErrors/S3ToHttpsConversionErrorTest.ThrowsOnConversion/dotted_bucket_with_explicit_virtual_style (0 ms)86 > [ RUN ] S3ToHttpsConversionErrors/S3ToHttpsConversionErrorTest.ThrowsOnConversion/dotted_bucket_with_explicit_virtual_style_multi_dot87 > [ OK ] S3ToHttpsConversionErrors/S3ToHttpsConversionErrorTest.ThrowsOnConversion/dotted_bucket_with_explicit_virtual_style_multi_dot (0 ms)88 > [ RUN ] S3ToHttpsConversionErrors/S3ToHttpsConversionErrorTest.ThrowsOnConversion/dotted_bucket_with_explicit_virtual_style_custom_authority89 > [ OK ] S3ToHttpsConversionErrors/S3ToHttpsConversionErrorTest.ThrowsOnConversion/dotted_bucket_with_explicit_virtual_style_custom_authority (0 ms)90 > [ RUN ] S3ToHttpsConversionErrors/S3ToHttpsConversionErrorTest.ThrowsOnConversion/dotted_bucket_with_explicit_virtual_style_full_endpoint_url91 > [ OK ] S3ToHttpsConversionErrors/S3ToHttpsConversionErrorTest.ThrowsOnConversion/dotted_bucket_with_explicit_virtual_style_full_endpoint_url (0 ms)92 > [----------] 5 tests from S3ToHttpsConversionErrors/S3ToHttpsConversionErrorTest (0 ms total)93 >94 > [----------] Global test environment tear-down95 > [==========] 798 tests from 90 test suites ran. (1437 ms total)96 > [ PASSED ] 797 tests.97 > [ FAILED ] 1 test, listed below:98 > [ FAILED ] StoreReferenceTest.PathInfo_ssh_unbracketed_ipv6_5_from_uri99 >100 > 1 FAILED TEST101 > YOU HAVE 1 DISABLED TEST102 >103 For full logs, run:104 nix log /nix/store/pywn97agf1aqg32llx7x0qi7gdd9yvhq-nix-store-tests-run.drv105error: Cannot build '/nix/store/wdlzb0mq8kr7ixw4nkwkam6ijbkzdhb7-nix-util-tests-run.drv'.106 Reason: builder failed with exit code 1.107 Output paths:108 /nix/store/wbg4wirj55rfsaifv3nwy7mwkqa2xy5h-nix-util-tests-run109 Last 25 log lines:110 > [ RUN ] Unix/UrlPathTest.urlToString/absolute_path111 > [ OK ] Unix/UrlPathTest.urlToString/absolute_path (0 ms)112 > [ RUN ] Unix/UrlPathTest.urlToString/root_path113 > [ OK ] Unix/UrlPathTest.urlToString/root_path (0 ms)114 > [ RUN ] Unix/UrlPathTest.stringToUrl/absolute_path115 > [ OK ] Unix/UrlPathTest.stringToUrl/absolute_path (0 ms)116 > [ RUN ] Unix/UrlPathTest.stringToUrl/root_path117 > [ OK ] Unix/UrlPathTest.stringToUrl/root_path (0 ms)118 > [----------] 8 tests from Unix/UrlPathTest (0 ms total)119 >120 > [----------] Global test environment tear-down121 > [==========] 818 tests from 156 test suites ran. (3075 ms total)122 > [ PASSED ] 812 tests.123 > [ SKIPPED ] 1 test, listed below:124 > [ SKIPPED ] CompressionDecompression/CompressionDecompressionTest.invalidDecompression/none125 > [ FAILED ] 5 tests, listed below:126 > [ FAILED ] ParseURLSuccessCases/ParseURLSuccess.parsesAsExpected/5, where GetParam() = 288-byte object <31-00 00-00 00-00 00-00 A8-86 95-55 55-55 00-00 B0-C7 B0-55 55-55 00-00 04-00 00-00 00-00 00-00 68-74 74-70 00-68 74-74 70-73 00-00 00-00 00-00 02-00 00-00 00-00 00-00 00-56 B0-55 55-55 00-00 ... 00-00 00-00 00-00 00-00 68-C8 B0-55 55-55 00-00 68-C8 B0-55 55-55 00-00 00-00 00-00 00-00 00-00 A0-C8 B0-55 55-55 00-00 00-00 00-00 00-00 00-00 00-65 6C-6C 6F-00 00-00 98-C8 B0-55 55-55 00-00>127 > [ FAILED ] ParseURLSuccessCases/ParseURLSuccess.toStringRoundTrips/5, where GetParam() = 288-byte object <31-00 00-00 00-00 00-00 A8-86 95-55 55-55 00-00 B0-C7 B0-55 55-55 00-00 04-00 00-00 00-00 00-00 68-74 74-70 00-68 74-74 70-73 00-00 00-00 00-00 02-00 00-00 00-00 00-00 F0-2F B1-55 55-55 00-00 ... 00-00 00-00 00-00 00-00 68-C8 B0-55 55-55 00-00 68-C8 B0-55 55-55 00-00 00-00 00-00 00-00 00-00 A0-C8 B0-55 55-55 00-00 00-00 00-00 00-00 00-00 00-65 6C-6C 6F-00 00-00 98-C8 B0-55 55-55 00-00>128 > [ FAILED ] ParseURLSuccessCases/ParseURLSuccess.makeSureFixGitURLDoesNotModify/5, where GetParam() = 288-byte object <31-00 00-00 00-00 00-00 A8-86 95-55 55-55 00-00 B0-C7 B0-55 55-55 00-00 04-00 00-00 00-00 00-00 68-74 74-70 00-68 74-74 70-73 00-00 00-00 00-00 02-00 00-00 00-00 00-00 40-55 B1-55 55-55 00-00 ... 00-00 00-00 00-00 00-00 68-C8 B0-55 55-55 00-00 68-C8 B0-55 55-55 00-00 00-00 00-00 00-00 00-00 A0-C8 B0-55 55-55 00-00 00-00 00-00 00-00 00-00 00-65 6C-6C 6F-00 00-00 98-C8 B0-55 55-55 00-00>129 > [ FAILED ] parseURLRelative/ParseURLRelativeTestSuite.resolve/resolvesRelativePathIpv6AddressWithZoneId, where GetParam() = 336-byte object <3F-00 00-00 00-00 00-00 18-90 95-55 55-55 00-00 10-00 00-00 00-00 00-00 68-34 94-55 55-55 00-00 B0-F2 AF-55 55-55 00-00 04-00 00-00 00-00 00-00 68-74 74-70 00-00 00-00 00-00 00-00 00-00 00-00 ... A0-F3 AF-55 55-55 00-00 00-00 00-00 00-00 00-00 00-F3 AF-55 55-55 00-00 00-00 00-00 00-00 00-00 90-74 B1-55 55-55 00-00 29-00 00-00 00-00 00-00 29-00 00-00 00-00 00-00 F0-F3 AF-55 55-55 00-00>130 > [ FAILED ] parseURLRelative/ParseURLRelativeTestSuite.resolve/absOverrideWithZoneId, where GetParam() = 336-byte object <21-00 00-00 00-00 00-00 60-8E 95-55 55-55 00-00 3C-00 00-00 00-00 00-00 88-8E 95-55 55-55 00-00 B0-F2 AF-55 55-55 00-00 05-00 00-00 00-00 00-00 68-74 74-70 73-00 00-00 00-00 00-00 00-00 00-00 ... A0-F3 AF-55 55-55 00-00 00-00 00-00 00-00 00-00 00-72 61-67 00-55 00-00 00-00 00-00 00-00 00-00 C0-3B B1-55 55-55 00-00 15-00 00-00 00-00 00-00 15-00 00-00 00-00 00-00 69-64 65-00 55-55 00-00>131 >132 > 5 FAILED TESTS133 > YOU HAVE 1 DISABLED TEST134 >135 For full logs, run:136 nix log /nix/store/wdlzb0mq8kr7ixw4nkwkam6ijbkzdhb7-nix-util-tests-run.drv137error: Cannot build '/nix/store/dpbmzyi65g0hwvj6g8669f62cc96s4lr-nix-2.36.0pre20260916_1de45ba.drv'.138 Reason: 3 dependencies failed.139 Output paths:140 /nix/store/6lx769va5cfq3wixwssm1a6wmqrwvvs5-nix-2.36.0pre20260916_1de45ba-doc141 /nix/store/bzjx147cx6i840zi3ydzd4sw6yxs9srm-nix-2.36.0pre20260916_1de45ba-man142 /nix/store/nf5f2pshfbhrqk2a6svvcbhl6flblbx3-nix-2.36.0pre20260916_1de45ba-dev143 /nix/store/wylj6yb4sbigrb1bmgjrvzd762vqbyzp-nix-2.36.0pre20260916_1de45ba144error: Cannot build '/nix/store/6qd86hcnhgwcgwgdplmqlx43sbj5hl4q-nix.conf.drv'.145 Reason: 1 dependency failed.146 Output paths:147 /nix/store/rfj7zdxi4xyg7i94ikry7p1rlpavj3ji-nix.conf148error: Cannot build '/nix/store/kc36sra7230l1gsjnnfh07g3d4hbawm6-nixos-option-26.11.drv'.149 Reason: 1 dependency failed.150 Output paths:151 /nix/store/99y57vvqvrl03pbpmkpml0qn2v5yxa8s-nixos-option-26.11152error: Cannot build '/nix/store/3fkrmlg888561wnl10bb60g9zr30w9yl-nixos-rebuild-ng-26.11.drv'.153 Reason: 1 dependency failed.154 Output paths:155 /nix/store/3bcq2ccqhjppyyq5cv4ndgz4bn3rywbv-nixos-rebuild-ng-26.11156 /nix/store/fwy4c8rqg45h9z6p7bpc89b7b1161m42-nixos-rebuild-ng-26.11-dist157error: Cannot build '/nix/store/gaa7q4g5hl1za9q17w89qvc3ysncrjgc-system-generators.drv'.158 Reason: 1 dependency failed.159 Output paths:160 /nix/store/rbmwmykwcp6283vsyvc91yp2v2qv46mz-system-generators161error: Cannot build '/nix/store/1z87q0nj95w3jci11x2hm9s1nsxj7ggi-system-shutdown.drv'.162 Reason: 1 dependency failed.163 Output paths:164 /nix/store/qa2v1svs4njv2rmaam30ngl6qs5dph5f-system-shutdown165error: Cannot build '/nix/store/226lkmv8nz6yrqicb4qs2zapyx5m18pc-systemd-boot.drv'.166 Reason: 1 dependency failed.167 Output paths:168 /nix/store/6bbx88pk1c8llf7qh1brf4rshgpm7z22-systemd-boot169error: Cannot build '/nix/store/vjyifc82z3s76w58n2fsfjaysky2sgc9-tmpfiles.d.drv'.170 Reason: 1 dependency failed.171 Output paths:172 /nix/store/cy72i4gcwrq1z9g8pcym78y66fl2c2zl-tmpfiles.d173error: Cannot build '/nix/store/264q86rc8pgsddipjj9ar5jkzjghgm6n-unit-harmonia-gc.service.drv'.174 Reason: 1 dependency failed.175 Output paths:176 /nix/store/2y51fk1icxwwglv58190bdidf2zafnlq-unit-harmonia-gc.service177error: Cannot build '/nix/store/2w0vrz5yy7jd6jbhfvj88wjcg1mqmd4y-unit-nix-optimise.service.drv'.178 Reason: 1 dependency failed.179 Output paths:180 /nix/store/6h91xkqcdjhsw2gyaaqd62gyz3fymj4j-unit-nix-optimise.service181error: Cannot build '/nix/store/w0883kc1z6dljmrn6ylnbmqhma69py3y-unit-script-nix-gc-start.drv'.182 Reason: 1 dependency failed.183 Output paths:184 /nix/store/2awjd2bxj637zaxffcakz65pmy1abdl3-unit-script-nix-gc-start185error: Cannot build '/nix/store/029x4rx1ph75gardrbvf281rc4miw50p-unit-script-update-prefetch-start.drv'.186 Reason: 1 dependency failed.187 Output paths:188 /nix/store/3gl8lw73s03ynd0n300allwf6fz4zp59-unit-script-update-prefetch-start189error: Cannot build '/nix/store/i6l7s59dg4wydrm2j8dj4akvj0iqskyv-user-generators.drv'.190 Reason: 1 dependency failed.191 Output paths:192 /nix/store/kndjyb1p91f6byzznbfqi6jlv739zq30-user-generators193error: Cannot build '/nix/store/v8lwirl6zgp3rcnhifqbgkapd9n7k7dm-X-Restart-Triggers-nix-daemon.drv'.194 Reason: 1 dependency failed.195 Output paths:196 /nix/store/c38w30bz644g9rdm04bm13ngv2wz6v70-X-Restart-Triggers-nix-daemon197error: Cannot build '/nix/store/jyjg6w23s3mz5rkxzg5r4sv661prs69y-X-Restart-Triggers-systemd-tmpfiles-resetup.drv'.198 Reason: 1 dependency failed.199 Output paths:200 /nix/store/s1q81riid55mimc1ma53mfbhaca5iy4c-X-Restart-Triggers-systemd-tmpfiles-resetup201error: Cannot build '/nix/store/r2b7a186i7jyqhszp4vxk4qvp1hnh176-install-systemd-boot.sh.drv'.202 Reason: 1 dependency failed.203 Output paths:204 /nix/store/zbfm313sfwn5l9ajin6w02bxyy4qgibj-install-systemd-boot.sh205error: Cannot build '/nix/store/0a45rkf7zqfjkj97vkirkghiw9hcamkg-system-path.drv'.206 Reason: 3 dependencies failed.207 Output paths:208 /nix/store/jqp5m81a9w84id9596j7x0yi7a9mylwf-system-path209error: Cannot build '/nix/store/0c5k3547p45n0nmwzybmkqmbni0vvc7m-unit-nix-gc.service.drv'.210 Reason: 1 dependency failed.211 Output paths:212 /nix/store/mx6aakgld87kyf60afjdrpw1mjm39i27-unit-nix-gc.service213error: Cannot build '/nix/store/x4dv2v1l2iy6wp2zk5chwybm62vz55dl-unit-update-prefetch.service.drv'.214 Reason: 1 dependency failed.215 Output paths:216 /nix/store/wi6zabha1j1a4gr3hmk1ym39shgbxh9m-unit-update-prefetch.service217error: Cannot build '/nix/store/r4c6815wr456c4plfhgiisqnan7m582i-X-Restart-Triggers-polkit.drv'.218 Reason: 1 dependency failed.219 Output paths:220 /nix/store/88hr3ww7qzrhv7s5fpkl59sfa8r092ir-X-Restart-Triggers-polkit221error: Cannot build '/nix/store/2vgs0b2zynj58h348pcpjrbi9cllly6i-dbus-1.drv'.222 Reason: 1 dependency failed.223 Output paths:224 /nix/store/fnvlljnizyhslqxi8g0ism9ahaxa3c6d-dbus-1225error: Cannot build '/nix/store/glyj2zazm2i766fdily836virgg1p99v-unit-accounts-daemon.service.drv'.226 Reason: 1 dependency failed.227 Output paths:228 /nix/store/pc0djxiiffv5pi6v1gk0xkwvpx24lh9h-unit-accounts-daemon.service229error: Cannot build '/nix/store/ckmh93h3pwlm9l3i6mdpk4k86jn9m1iq-unit-nix-daemon.service.drv'.230 Reason: 2 dependencies failed.231 Output paths:232 /nix/store/3j03a18zv9r2vcb3grmd6066xi528ywg-unit-nix-daemon.service233error: Cannot build '/nix/store/va5qyv9xy99qag98zcx0kik122nbhxzj-unit-systemd-tmpfiles-resetup.service.drv'.234 Reason: 1 dependency failed.235 Output paths:236 /nix/store/3bnjd9spg1rmk0cys7dms2abbnf0nqxj-unit-systemd-tmpfiles-resetup.service237error: Cannot build '/nix/store/syl4xqiwkynndw1r52hhcqbsir5n312p-X-Restart-Triggers-dbus-broker.drv'.238 Reason: 1 dependency failed.239 Output paths:240 /nix/store/1aha0lnp7wcm6b4hk69zylvh7zxlrv7r-X-Restart-Triggers-dbus-broker241error: Cannot build '/nix/store/415r5slig62jjfq9yxzcgzqnsszx2d43-unit-polkit.service.drv'.242 Reason: 1 dependency failed.243 Output paths:244 /nix/store/f815wpqzi9mmllxj96j95wiqblyhdml3-unit-polkit.service245error: Cannot build '/nix/store/dz8wsrnj4dy404y2ylbyclkm4xdr5anb-unit-dbus-broker.service.drv'.246 Reason: 1 dependency failed.247 Output paths:248 /nix/store/i3afc9vhaj45nhp4wmfhriwjzc9n193h-unit-dbus-broker.service249error: Cannot build '/nix/store/yfrz9zwq9a8ii3bmnc6psaqiliv7v038-unit-dbus-broker.service.drv'.250 Reason: 1 dependency failed.251 Output paths:252 /nix/store/0sbsa0fh1jpdr9vy1yq31ri6qpy3r97j-unit-dbus-broker.service253error: Cannot build '/nix/store/srw73czffizm0i2568f8p49z26qmwgn8-system-units.drv'.254 Reason: 10 dependencies failed.255 Output paths:256 /nix/store/wy196hzgsjh7rpjpzy4zgdskj8glxi9d-system-units257error: Cannot build '/nix/store/xggbcvz7bg1axwkfbmy3c2apqqz3i8kg-user-units.drv'.258 Reason: 2 dependencies failed.259 Output paths:260 /nix/store/469qwna3ifxlifgpci74facq3ddjp7kh-user-units261error: Cannot build '/nix/store/729rbw70rhl7sp2fscimaiq2ngyy9p3r-etc.drv'.262 Reason: 9 dependencies failed.263 Output paths:264 /nix/store/y09k102sw55586dlrwyaf0dxgva9pbdv-etc265error: Cannot build '/nix/store/qaknmnqjfnhbkp9kpsx3nh21yxl1rfpp-activate.drv'.266 Reason: 1 dependency failed.267 Output paths:268 /nix/store/x4i2cnyv6dgjmcihkxkcj73720xjyklw-activate269error: Cannot build '/nix/store/3v2shpwc951ad9j6v5aqdxm3gjncnl54-nixos-system-bernie-26.11.20260917.397d52b.drv'.270 Reason: 4 dependencies failed.271 Output paths:272 /nix/store/larflwj2nyaa8aq0rb0qppdbh1y4dc2g-nixos-system-bernie-26.11.20260917.397d52b