setup
checks.x86_64-linux.nixos-bernie
· build #605
· raw
1these 41 derivations will be built:2 /nix/store/jna1xqxfq1v5wpck4z3qn8bnj9wmd9ch-nix-util-tests-run-without-new-syscalls.drv3 /nix/store/pywn97agf1aqg32llx7x0qi7gdd9yvhq-nix-store-tests-run.drv4 /nix/store/wdlzb0mq8kr7ixw4nkwkam6ijbkzdhb7-nix-util-tests-run.drv5 /nix/store/dpbmzyi65g0hwvj6g8669f62cc96s4lr-nix-2.36.0pre20260916_1de45ba.drv6 /nix/store/029x4rx1ph75gardrbvf281rc4miw50p-unit-script-update-prefetch-start.drv7 /nix/store/w0883kc1z6dljmrn6ylnbmqhma69py3y-unit-script-nix-gc-start.drv8 /nix/store/0c5k3547p45n0nmwzybmkqmbni0vvc7m-unit-nix-gc.service.drv9 /nix/store/jl4xa0hfwj0jbf7jjl1xk5xz3z5y4xvs-flake-inputs.prom.drv10 /nix/store/0pjznvwz91ax3dwg70bsi9xdxivcn18h-config.toml.drv11 /nix/store/1z87q0nj95w3jci11x2hm9s1nsxj7ggi-system-shutdown.drv12 /nix/store/226lkmv8nz6yrqicb4qs2zapyx5m18pc-systemd-boot.drv13 /nix/store/3fkrmlg888561wnl10bb60g9zr30w9yl-nixos-rebuild-ng-26.11.drv14 /nix/store/5l5l9xx4kr7xjqvh5mj1l4fjv118pwlq-nix-grpc-cert.drv15 /nix/store/kc36sra7230l1gsjnnfh07g3d4hbawm6-nixos-option-26.11.drv16 /nix/store/9pqxgmxcr8y93dhrxd7g0xxc4i8bfyz8-system-path.drv17 /nix/store/d6a02dqi5d0ls0cz9s52lbwjwiidvc8y-dbus-1.drv18 /nix/store/dzrjnl9z2wpn2wdq8wxxgjslyl6942gs-X-Restart-Triggers-dbus-broker.drv19 /nix/store/24lf3l57fb4q129mx4nyprz6ilci4wmx-unit-dbus-broker.service.drv20 /nix/store/264q86rc8pgsddipjj9ar5jkzjghgm6n-unit-harmonia-gc.service.drv21 /nix/store/2w0vrz5yy7jd6jbhfvj88wjcg1mqmd4y-unit-nix-optimise.service.drv22 /nix/store/6qd86hcnhgwcgwgdplmqlx43sbj5hl4q-nix.conf.drv23 /nix/store/9gwc28ybgsfi5ljc3hvsgd6rdfyp5x6r-etc-nix-registry.json.drv24 /nix/store/gaa7q4g5hl1za9q17w89qvc3ysncrjgc-system-generators.drv25 /nix/store/m7c3i5mkfjm0968k9xhsrjdjfyc2f8hf-unit-dbus-broker.service.drv26 /nix/store/gp2ra238fh2mw9ryjg1zw8ls54c7g73k-user-units.drv27 /nix/store/i6l7s59dg4wydrm2j8dj4akvj0iqskyv-user-generators.drv28 /nix/store/v8lwirl6zgp3rcnhifqbgkapd9n7k7dm-X-Restart-Triggers-nix-daemon.drv29 /nix/store/ckmh93h3pwlm9l3i6mdpk4k86jn9m1iq-unit-nix-daemon.service.drv30 /nix/store/ihrna8a1zw316gi5h5kdgchxsmfacx8k-unit-accounts-daemon.service.drv31 /nix/store/l9gzn3d4xgsx48bpfswh461bs8d2zbfy-X-Restart-Triggers-polkit.drv32 /nix/store/jw5drrxm4q54av46f23cd3dsf6d8an6p-unit-polkit.service.drv33 /nix/store/vjyifc82z3s76w58n2fsfjaysky2sgc9-tmpfiles.d.drv34 /nix/store/jyjg6w23s3mz5rkxzg5r4sv661prs69y-X-Restart-Triggers-systemd-tmpfiles-resetup.drv35 /nix/store/va5qyv9xy99qag98zcx0kik122nbhxzj-unit-systemd-tmpfiles-resetup.service.drv36 /nix/store/wx8qjgk1fqhxyan72by4cdl0vk2kl2qw-unit-telegraf.service.drv37 /nix/store/x4dv2v1l2iy6wp2zk5chwybm62vz55dl-unit-update-prefetch.service.drv38 /nix/store/jlcj2dfjwg5mahpwkzfqa50mnb4gxxss-system-units.drv39 /nix/store/dmliil6d8v2yfiadqkk8ix6nbz5ai3d7-etc.drv40 /nix/store/r2b7a186i7jyqhszp4vxk4qvp1hnh176-install-systemd-boot.sh.drv41 /nix/store/svpkvil9mvm0azidm13nn6y80gffv4lv-activate.drv42 /nix/store/b7sc22fsfa8phc52cfhl8khjijskiz55-nixos-system-bernie-26.11.20260917.397d52b.drv43error: Cannot build '/nix/store/pywn97agf1aqg32llx7x0qi7gdd9yvhq-nix-store-tests-run.drv'.44 Reason: builder failed with exit code 1.45 Output paths:46 /nix/store/24plkfymp8qndabbhwpgwflhp0wc7qvl-nix-store-tests-run47 Last 25 log lines:48 > [ OK ] S3ToHttpsConversion/S3ToHttpsConversionTest.ConvertsCorrectly/dotted_bucket_with_auto_style_custom_endpoint (0 ms)49 > [----------] 13 tests from S3ToHttpsConversion/S3ToHttpsConversionTest (0 ms total)50 >51 > [----------] 5 tests from S3ToHttpsConversionErrors/S3ToHttpsConversionErrorTest52 > [ RUN ] S3ToHttpsConversionErrors/S3ToHttpsConversionErrorTest.ThrowsOnConversion/virtual_style_with_empty_host_authority53 > [ OK ] S3ToHttpsConversionErrors/S3ToHttpsConversionErrorTest.ThrowsOnConversion/virtual_style_with_empty_host_authority (0 ms)54 > [ RUN ] S3ToHttpsConversionErrors/S3ToHttpsConversionErrorTest.ThrowsOnConversion/dotted_bucket_with_explicit_virtual_style55 > [ OK ] S3ToHttpsConversionErrors/S3ToHttpsConversionErrorTest.ThrowsOnConversion/dotted_bucket_with_explicit_virtual_style (0 ms)56 > [ RUN ] S3ToHttpsConversionErrors/S3ToHttpsConversionErrorTest.ThrowsOnConversion/dotted_bucket_with_explicit_virtual_style_multi_dot57 > [ OK ] S3ToHttpsConversionErrors/S3ToHttpsConversionErrorTest.ThrowsOnConversion/dotted_bucket_with_explicit_virtual_style_multi_dot (0 ms)58 > [ RUN ] S3ToHttpsConversionErrors/S3ToHttpsConversionErrorTest.ThrowsOnConversion/dotted_bucket_with_explicit_virtual_style_custom_authority59 > [ OK ] S3ToHttpsConversionErrors/S3ToHttpsConversionErrorTest.ThrowsOnConversion/dotted_bucket_with_explicit_virtual_style_custom_authority (0 ms)60 > [ RUN ] S3ToHttpsConversionErrors/S3ToHttpsConversionErrorTest.ThrowsOnConversion/dotted_bucket_with_explicit_virtual_style_full_endpoint_url61 > [ OK ] S3ToHttpsConversionErrors/S3ToHttpsConversionErrorTest.ThrowsOnConversion/dotted_bucket_with_explicit_virtual_style_full_endpoint_url (0 ms)62 > [----------] 5 tests from S3ToHttpsConversionErrors/S3ToHttpsConversionErrorTest (0 ms total)63 >64 > [----------] Global test environment tear-down65 > [==========] 798 tests from 90 test suites ran. (1626 ms total)66 > [ PASSED ] 797 tests.67 > [ FAILED ] 1 test, listed below:68 > [ FAILED ] StoreReferenceTest.PathInfo_ssh_unbracketed_ipv6_5_from_uri69 >70 > 1 FAILED TEST71 > YOU HAVE 1 DISABLED TEST72 >73 For full logs, run:74 nix log /nix/store/pywn97agf1aqg32llx7x0qi7gdd9yvhq-nix-store-tests-run.drv75error: Cannot build '/nix/store/jna1xqxfq1v5wpck4z3qn8bnj9wmd9ch-nix-util-tests-run-without-new-syscalls.drv'.76 Reason: builder failed with exit code 1.77 Output paths:78 /nix/store/jlahqnixx9m0q1c9q858imlga6ri4fhg-nix-util-tests-run-without-new-syscalls79 Last 25 log lines:80 > [ RUN ] Unix/UrlPathTest.urlToString/absolute_path81 > [ OK ] Unix/UrlPathTest.urlToString/absolute_path (0 ms)82 > [ RUN ] Unix/UrlPathTest.urlToString/root_path83 > [ OK ] Unix/UrlPathTest.urlToString/root_path (0 ms)84 > [ RUN ] Unix/UrlPathTest.stringToUrl/absolute_path85 > [ OK ] Unix/UrlPathTest.stringToUrl/absolute_path (0 ms)86 > [ RUN ] Unix/UrlPathTest.stringToUrl/root_path87 > [ OK ] Unix/UrlPathTest.stringToUrl/root_path (0 ms)88 > [----------] 8 tests from Unix/UrlPathTest (0 ms total)89 >90 > [----------] Global test environment tear-down91 > [==========] 818 tests from 156 test suites ran. (3065 ms total)92 > [ PASSED ] 812 tests.93 > [ SKIPPED ] 1 test, listed below:94 > [ SKIPPED ] CompressionDecompression/CompressionDecompressionTest.invalidDecompression/none95 > [ FAILED ] 5 tests, listed below:96 > [ FAILED ] ParseURLSuccessCases/ParseURLSuccess.parsesAsExpected/5, where GetParam() = 288-byte object <31-00 00-00 00-00 00-00 A8-86 95-55 55-55 00-00 B0-C7 B0-55 55-55 00-00 04-00 00-00 00-00 00-00 68-74 74-70 00-68 74-74 70-73 00-00 00-00 00-00 02-00 00-00 00-00 00-00 00-56 B0-55 55-55 00-00 ... 00-00 00-00 00-00 00-00 68-C8 B0-55 55-55 00-00 68-C8 B0-55 55-55 00-00 00-00 00-00 00-00 00-00 A0-C8 B0-55 55-55 00-00 00-00 00-00 00-00 00-00 00-65 6C-6C 6F-00 00-00 98-C8 B0-55 55-55 00-00>97 > [ FAILED ] ParseURLSuccessCases/ParseURLSuccess.toStringRoundTrips/5, where GetParam() = 288-byte object <31-00 00-00 00-00 00-00 A8-86 95-55 55-55 00-00 B0-C7 B0-55 55-55 00-00 04-00 00-00 00-00 00-00 68-74 74-70 00-68 74-74 70-73 00-00 00-00 00-00 02-00 00-00 00-00 00-00 F0-2F B1-55 55-55 00-00 ... 00-00 00-00 00-00 00-00 68-C8 B0-55 55-55 00-00 68-C8 B0-55 55-55 00-00 00-00 00-00 00-00 00-00 A0-C8 B0-55 55-55 00-00 00-00 00-00 00-00 00-00 00-65 6C-6C 6F-00 00-00 98-C8 B0-55 55-55 00-00>98 > [ FAILED ] ParseURLSuccessCases/ParseURLSuccess.makeSureFixGitURLDoesNotModify/5, where GetParam() = 288-byte object <31-00 00-00 00-00 00-00 A8-86 95-55 55-55 00-00 B0-C7 B0-55 55-55 00-00 04-00 00-00 00-00 00-00 68-74 74-70 00-68 74-74 70-73 00-00 00-00 00-00 02-00 00-00 00-00 00-00 40-55 B1-55 55-55 00-00 ... 00-00 00-00 00-00 00-00 68-C8 B0-55 55-55 00-00 68-C8 B0-55 55-55 00-00 00-00 00-00 00-00 00-00 A0-C8 B0-55 55-55 00-00 00-00 00-00 00-00 00-00 00-65 6C-6C 6F-00 00-00 98-C8 B0-55 55-55 00-00>99 > [ FAILED ] parseURLRelative/ParseURLRelativeTestSuite.resolve/resolvesRelativePathIpv6AddressWithZoneId, where GetParam() = 336-byte object <3F-00 00-00 00-00 00-00 18-90 95-55 55-55 00-00 10-00 00-00 00-00 00-00 68-34 94-55 55-55 00-00 B0-F2 AF-55 55-55 00-00 04-00 00-00 00-00 00-00 68-74 74-70 00-00 00-00 00-00 00-00 00-00 00-00 ... A0-F3 AF-55 55-55 00-00 00-00 00-00 00-00 00-00 00-F3 AF-55 55-55 00-00 00-00 00-00 00-00 00-00 90-74 B1-55 55-55 00-00 29-00 00-00 00-00 00-00 29-00 00-00 00-00 00-00 F0-F3 AF-55 55-55 00-00>100 > [ FAILED ] parseURLRelative/ParseURLRelativeTestSuite.resolve/absOverrideWithZoneId, where GetParam() = 336-byte object <21-00 00-00 00-00 00-00 60-8E 95-55 55-55 00-00 3C-00 00-00 00-00 00-00 88-8E 95-55 55-55 00-00 B0-F2 AF-55 55-55 00-00 05-00 00-00 00-00 00-00 68-74 74-70 73-00 00-00 00-00 00-00 00-00 00-00 ... A0-F3 AF-55 55-55 00-00 00-00 00-00 00-00 00-00 00-72 61-67 00-55 00-00 00-00 00-00 00-00 00-00 C0-3B B1-55 55-55 00-00 15-00 00-00 00-00 00-00 15-00 00-00 00-00 00-00 69-64 65-00 55-55 00-00>101 >102 > 5 FAILED TESTS103 > YOU HAVE 1 DISABLED TEST104 >105 For full logs, run:106 nix log /nix/store/jna1xqxfq1v5wpck4z3qn8bnj9wmd9ch-nix-util-tests-run-without-new-syscalls.drv107error: Cannot build '/nix/store/wdlzb0mq8kr7ixw4nkwkam6ijbkzdhb7-nix-util-tests-run.drv'.108 Reason: builder failed with exit code 1.109 Output paths:110 /nix/store/wbg4wirj55rfsaifv3nwy7mwkqa2xy5h-nix-util-tests-run111 Last 25 log lines:112 > [ RUN ] Unix/UrlPathTest.urlToString/absolute_path113 > [ OK ] Unix/UrlPathTest.urlToString/absolute_path (0 ms)114 > [ RUN ] Unix/UrlPathTest.urlToString/root_path115 > [ OK ] Unix/UrlPathTest.urlToString/root_path (0 ms)116 > [ RUN ] Unix/UrlPathTest.stringToUrl/absolute_path117 > [ OK ] Unix/UrlPathTest.stringToUrl/absolute_path (0 ms)118 > [ RUN ] Unix/UrlPathTest.stringToUrl/root_path119 > [ OK ] Unix/UrlPathTest.stringToUrl/root_path (0 ms)120 > [----------] 8 tests from Unix/UrlPathTest (0 ms total)121 >122 > [----------] Global test environment tear-down123 > [==========] 818 tests from 156 test suites ran. (3137 ms total)124 > [ PASSED ] 812 tests.125 > [ SKIPPED ] 1 test, listed below:126 > [ SKIPPED ] CompressionDecompression/CompressionDecompressionTest.invalidDecompression/none127 > [ FAILED ] 5 tests, listed below:128 > [ FAILED ] ParseURLSuccessCases/ParseURLSuccess.parsesAsExpected/5, where GetParam() = 288-byte object <31-00 00-00 00-00 00-00 A8-86 95-55 55-55 00-00 B0-C7 B0-55 55-55 00-00 04-00 00-00 00-00 00-00 68-74 74-70 00-68 74-74 70-73 00-00 00-00 00-00 02-00 00-00 00-00 00-00 00-56 B0-55 55-55 00-00 ... 00-00 00-00 00-00 00-00 68-C8 B0-55 55-55 00-00 68-C8 B0-55 55-55 00-00 00-00 00-00 00-00 00-00 A0-C8 B0-55 55-55 00-00 00-00 00-00 00-00 00-00 00-65 6C-6C 6F-00 00-00 98-C8 B0-55 55-55 00-00>129 > [ FAILED ] ParseURLSuccessCases/ParseURLSuccess.toStringRoundTrips/5, where GetParam() = 288-byte object <31-00 00-00 00-00 00-00 A8-86 95-55 55-55 00-00 B0-C7 B0-55 55-55 00-00 04-00 00-00 00-00 00-00 68-74 74-70 00-68 74-74 70-73 00-00 00-00 00-00 02-00 00-00 00-00 00-00 F0-2F B1-55 55-55 00-00 ... 00-00 00-00 00-00 00-00 68-C8 B0-55 55-55 00-00 68-C8 B0-55 55-55 00-00 00-00 00-00 00-00 00-00 A0-C8 B0-55 55-55 00-00 00-00 00-00 00-00 00-00 00-65 6C-6C 6F-00 00-00 98-C8 B0-55 55-55 00-00>130 > [ FAILED ] ParseURLSuccessCases/ParseURLSuccess.makeSureFixGitURLDoesNotModify/5, where GetParam() = 288-byte object <31-00 00-00 00-00 00-00 A8-86 95-55 55-55 00-00 B0-C7 B0-55 55-55 00-00 04-00 00-00 00-00 00-00 68-74 74-70 00-68 74-74 70-73 00-00 00-00 00-00 02-00 00-00 00-00 00-00 40-55 B1-55 55-55 00-00 ... 00-00 00-00 00-00 00-00 68-C8 B0-55 55-55 00-00 68-C8 B0-55 55-55 00-00 00-00 00-00 00-00 00-00 A0-C8 B0-55 55-55 00-00 00-00 00-00 00-00 00-00 00-65 6C-6C 6F-00 00-00 98-C8 B0-55 55-55 00-00>131 > [ FAILED ] parseURLRelative/ParseURLRelativeTestSuite.resolve/resolvesRelativePathIpv6AddressWithZoneId, where GetParam() = 336-byte object <3F-00 00-00 00-00 00-00 18-90 95-55 55-55 00-00 10-00 00-00 00-00 00-00 68-34 94-55 55-55 00-00 B0-F2 AF-55 55-55 00-00 04-00 00-00 00-00 00-00 68-74 74-70 00-00 00-00 00-00 00-00 00-00 00-00 ... A0-F3 AF-55 55-55 00-00 00-00 00-00 00-00 00-00 00-F3 AF-55 55-55 00-00 00-00 00-00 00-00 00-00 90-74 B1-55 55-55 00-00 29-00 00-00 00-00 00-00 29-00 00-00 00-00 00-00 F0-F3 AF-55 55-55 00-00>132 > [ FAILED ] parseURLRelative/ParseURLRelativeTestSuite.resolve/absOverrideWithZoneId, where GetParam() = 336-byte object <21-00 00-00 00-00 00-00 60-8E 95-55 55-55 00-00 3C-00 00-00 00-00 00-00 88-8E 95-55 55-55 00-00 B0-F2 AF-55 55-55 00-00 05-00 00-00 00-00 00-00 68-74 74-70 73-00 00-00 00-00 00-00 00-00 00-00 ... A0-F3 AF-55 55-55 00-00 00-00 00-00 00-00 00-00 00-72 61-67 00-55 00-00 00-00 00-00 00-00 00-00 C0-3B B1-55 55-55 00-00 15-00 00-00 00-00 00-00 15-00 00-00 00-00 00-00 69-64 65-00 55-55 00-00>133 >134 > 5 FAILED TESTS135 > YOU HAVE 1 DISABLED TEST136 >137 For full logs, run:138 nix log /nix/store/wdlzb0mq8kr7ixw4nkwkam6ijbkzdhb7-nix-util-tests-run.drv139error: Cannot build '/nix/store/dpbmzyi65g0hwvj6g8669f62cc96s4lr-nix-2.36.0pre20260916_1de45ba.drv'.140 Reason: 3 dependencies failed.141 Output paths:142 /nix/store/6lx769va5cfq3wixwssm1a6wmqrwvvs5-nix-2.36.0pre20260916_1de45ba-doc143 /nix/store/bzjx147cx6i840zi3ydzd4sw6yxs9srm-nix-2.36.0pre20260916_1de45ba-man144 /nix/store/nf5f2pshfbhrqk2a6svvcbhl6flblbx3-nix-2.36.0pre20260916_1de45ba-dev145 /nix/store/wylj6yb4sbigrb1bmgjrvzd762vqbyzp-nix-2.36.0pre20260916_1de45ba146error: Cannot build '/nix/store/6qd86hcnhgwcgwgdplmqlx43sbj5hl4q-nix.conf.drv'.147 Reason: 1 dependency failed.148 Output paths:149 /nix/store/rfj7zdxi4xyg7i94ikry7p1rlpavj3ji-nix.conf150error: Cannot build '/nix/store/kc36sra7230l1gsjnnfh07g3d4hbawm6-nixos-option-26.11.drv'.151 Reason: 1 dependency failed.152 Output paths:153 /nix/store/99y57vvqvrl03pbpmkpml0qn2v5yxa8s-nixos-option-26.11154error: Cannot build '/nix/store/3fkrmlg888561wnl10bb60g9zr30w9yl-nixos-rebuild-ng-26.11.drv'.155 Reason: 1 dependency failed.156 Output paths:157 /nix/store/3bcq2ccqhjppyyq5cv4ndgz4bn3rywbv-nixos-rebuild-ng-26.11158 /nix/store/fwy4c8rqg45h9z6p7bpc89b7b1161m42-nixos-rebuild-ng-26.11-dist159error: Cannot build '/nix/store/gaa7q4g5hl1za9q17w89qvc3ysncrjgc-system-generators.drv'.160 Reason: 1 dependency failed.161 Output paths:162 /nix/store/rbmwmykwcp6283vsyvc91yp2v2qv46mz-system-generators163error: Cannot build '/nix/store/1z87q0nj95w3jci11x2hm9s1nsxj7ggi-system-shutdown.drv'.164 Reason: 1 dependency failed.165 Output paths:166 /nix/store/qa2v1svs4njv2rmaam30ngl6qs5dph5f-system-shutdown167error: Cannot build '/nix/store/226lkmv8nz6yrqicb4qs2zapyx5m18pc-systemd-boot.drv'.168 Reason: 1 dependency failed.169 Output paths:170 /nix/store/6bbx88pk1c8llf7qh1brf4rshgpm7z22-systemd-boot171error: Cannot build '/nix/store/vjyifc82z3s76w58n2fsfjaysky2sgc9-tmpfiles.d.drv'.172 Reason: 1 dependency failed.173 Output paths:174 /nix/store/cy72i4gcwrq1z9g8pcym78y66fl2c2zl-tmpfiles.d175error: Cannot build '/nix/store/264q86rc8pgsddipjj9ar5jkzjghgm6n-unit-harmonia-gc.service.drv'.176 Reason: 1 dependency failed.177 Output paths:178 /nix/store/2y51fk1icxwwglv58190bdidf2zafnlq-unit-harmonia-gc.service179error: Cannot build '/nix/store/2w0vrz5yy7jd6jbhfvj88wjcg1mqmd4y-unit-nix-optimise.service.drv'.180 Reason: 1 dependency failed.181 Output paths:182 /nix/store/6h91xkqcdjhsw2gyaaqd62gyz3fymj4j-unit-nix-optimise.service183error: Cannot build '/nix/store/w0883kc1z6dljmrn6ylnbmqhma69py3y-unit-script-nix-gc-start.drv'.184 Reason: 1 dependency failed.185 Output paths:186 /nix/store/2awjd2bxj637zaxffcakz65pmy1abdl3-unit-script-nix-gc-start187error: Cannot build '/nix/store/029x4rx1ph75gardrbvf281rc4miw50p-unit-script-update-prefetch-start.drv'.188 Reason: 1 dependency failed.189 Output paths:190 /nix/store/3gl8lw73s03ynd0n300allwf6fz4zp59-unit-script-update-prefetch-start191error: Cannot build '/nix/store/i6l7s59dg4wydrm2j8dj4akvj0iqskyv-user-generators.drv'.192 Reason: 1 dependency failed.193 Output paths:194 /nix/store/kndjyb1p91f6byzznbfqi6jlv739zq30-user-generators195error: Cannot build '/nix/store/v8lwirl6zgp3rcnhifqbgkapd9n7k7dm-X-Restart-Triggers-nix-daemon.drv'.196 Reason: 1 dependency failed.197 Output paths:198 /nix/store/c38w30bz644g9rdm04bm13ngv2wz6v70-X-Restart-Triggers-nix-daemon199error: Cannot build '/nix/store/jyjg6w23s3mz5rkxzg5r4sv661prs69y-X-Restart-Triggers-systemd-tmpfiles-resetup.drv'.200 Reason: 1 dependency failed.201 Output paths:202 /nix/store/s1q81riid55mimc1ma53mfbhaca5iy4c-X-Restart-Triggers-systemd-tmpfiles-resetup203error: Cannot build '/nix/store/r2b7a186i7jyqhszp4vxk4qvp1hnh176-install-systemd-boot.sh.drv'.204 Reason: 1 dependency failed.205 Output paths:206 /nix/store/zbfm313sfwn5l9ajin6w02bxyy4qgibj-install-systemd-boot.sh207error: Cannot build '/nix/store/9pqxgmxcr8y93dhrxd7g0xxc4i8bfyz8-system-path.drv'.208 Reason: 3 dependencies failed.209 Output paths:210 /nix/store/zbm5palhhwjwfrb9dwmiiflac49b8ggy-system-path211error: Cannot build '/nix/store/0c5k3547p45n0nmwzybmkqmbni0vvc7m-unit-nix-gc.service.drv'.212 Reason: 1 dependency failed.213 Output paths:214 /nix/store/mx6aakgld87kyf60afjdrpw1mjm39i27-unit-nix-gc.service215error: Cannot build '/nix/store/x4dv2v1l2iy6wp2zk5chwybm62vz55dl-unit-update-prefetch.service.drv'.216 Reason: 1 dependency failed.217 Output paths:218 /nix/store/wi6zabha1j1a4gr3hmk1ym39shgbxh9m-unit-update-prefetch.service219error: Cannot build '/nix/store/l9gzn3d4xgsx48bpfswh461bs8d2zbfy-X-Restart-Triggers-polkit.drv'.220 Reason: 1 dependency failed.221 Output paths:222 /nix/store/k7yjg91vii8wap2x4vgapzfy06dcsk4f-X-Restart-Triggers-polkit223error: Cannot build '/nix/store/d6a02dqi5d0ls0cz9s52lbwjwiidvc8y-dbus-1.drv'.224 Reason: 1 dependency failed.225 Output paths:226 /nix/store/ny324vzfkzn8jv5y0ycay3p0bc3w8nxf-dbus-1227error: Cannot build '/nix/store/ihrna8a1zw316gi5h5kdgchxsmfacx8k-unit-accounts-daemon.service.drv'.228 Reason: 1 dependency failed.229 Output paths:230 /nix/store/201ibhhcl9qndx2c2j6vhj8lh38457lz-unit-accounts-daemon.service231error: Cannot build '/nix/store/ckmh93h3pwlm9l3i6mdpk4k86jn9m1iq-unit-nix-daemon.service.drv'.232 Reason: 2 dependencies failed.233 Output paths:234 /nix/store/3j03a18zv9r2vcb3grmd6066xi528ywg-unit-nix-daemon.service235error: Cannot build '/nix/store/va5qyv9xy99qag98zcx0kik122nbhxzj-unit-systemd-tmpfiles-resetup.service.drv'.236 Reason: 1 dependency failed.237 Output paths:238 /nix/store/3bnjd9spg1rmk0cys7dms2abbnf0nqxj-unit-systemd-tmpfiles-resetup.service239error: Cannot build '/nix/store/dzrjnl9z2wpn2wdq8wxxgjslyl6942gs-X-Restart-Triggers-dbus-broker.drv'.240 Reason: 1 dependency failed.241 Output paths:242 /nix/store/8zsq2hmg5yzr8347z5m0mxy9d7pf7icm-X-Restart-Triggers-dbus-broker243error: Cannot build '/nix/store/jw5drrxm4q54av46f23cd3dsf6d8an6p-unit-polkit.service.drv'.244 Reason: 1 dependency failed.245 Output paths:246 /nix/store/33f20jbmslys4a96j6b13hsmma9kszy2-unit-polkit.service247error: Cannot build '/nix/store/24lf3l57fb4q129mx4nyprz6ilci4wmx-unit-dbus-broker.service.drv'.248 Reason: 1 dependency failed.249 Output paths:250 /nix/store/ydbgbg43xk6d5m6fpc31zjsdi4yn1a5a-unit-dbus-broker.service251error: Cannot build '/nix/store/m7c3i5mkfjm0968k9xhsrjdjfyc2f8hf-unit-dbus-broker.service.drv'.252 Reason: 1 dependency failed.253 Output paths:254 /nix/store/y7ai2m5jdhzfqkmb9vrd5yck7b8zv3p9-unit-dbus-broker.service255error: Cannot build '/nix/store/gp2ra238fh2mw9ryjg1zw8ls54c7g73k-user-units.drv'.256 Reason: 2 dependencies failed.257 Output paths:258 /nix/store/s099cvx7q1ab5bzf967kgmy1xmgpwb4q-user-units259error: Cannot build '/nix/store/jlcj2dfjwg5mahpwkzfqa50mnb4gxxss-system-units.drv'.260 Reason: 10 dependencies failed.261 Output paths:262 /nix/store/hkn11y40iffp5nfj19iipjm4b3ccfanh-system-units263error: Cannot build '/nix/store/dmliil6d8v2yfiadqkk8ix6nbz5ai3d7-etc.drv'.264 Reason: 9 dependencies failed.265 Output paths:266 /nix/store/hh0ppmyqc2b1ayram0n2xf7hhwcd24qm-etc267error: Cannot build '/nix/store/svpkvil9mvm0azidm13nn6y80gffv4lv-activate.drv'.268 Reason: 1 dependency failed.269 Output paths:270 /nix/store/hwamywkj3m2pq482vjddmmi7w682c21s-activate271error: Cannot build '/nix/store/b7sc22fsfa8phc52cfhl8khjijskiz55-nixos-system-bernie-26.11.20260917.397d52b.drv'.272 Reason: 4 dependencies failed.273 Output paths:274 /nix/store/gvaplrff9281bgbjqvwmgg500pn4dnad-nixos-system-bernie-26.11.20260917.397d52b