nixbot

builds

Mic92/dotfiles build #607 failed

branch main · PR #5909 · commit 4c7cc4fcbb · · took 6m 47s · eval 1m 15s

eval warnings 3 kinds · 6 occurrences
  • error ×4
  • warn 'system' has been renamed to/replaced by 'stdenv.hostPlatform.system' ×1
  • warn stdenv.isDarwin is deprecated, use stdenv.hostPlatform.isDarwin instead ×1

24 failed ⚠ 1
failed attributes
status attribute duration
failed checks.x86_64-linux.nixos-eve
  • 'system' has been renamed to/replaced by 'stdenv.hostPlatform.system'
  • stdenv.isDarwin is deprecated, use stdenv.hostPlatform.isDarwin instead
5m 32s
nix-store-tests-run: [----------] 5 tests from S3ToHttpsConversionErrors/S3ToHttpsConversionErrorTest (0 ms total) [----------] Global test environment tear-dow …
nix-store-tests-run:
[----------] 5 tests from S3ToHttpsConversionErrors/S3ToHttpsConversionErrorTest (0 ms total)
[----------] Global test environment tear-down
[==========] 798 tests from 90 test suites ran. (1528 ms total)
[  PASSED  ] 797 tests.
[  FAILED  ] 1 test, listed below:
[  FAILED  ] StoreReferenceTest.PathInfo_ssh_unbracketed_ipv6_5_from_uri
 1 FAILED TEST
  YOU HAVE 1 DISABLED TEST

nix-util-tests-run-without-new-syscalls:
[  FAILED  ] 5 tests, listed below:
[  FAILED  ] ParseURLSuccessCases/ParseURLSuccess.parsesAsExpected/5, where GetParam() = 288-byte object <31-00 00-00 00-00 00-00 A8-86 95-55 55-55 00-00 B0-C7 B0-55 55-55 00-00 04-00 00-00 00-00 00-00 68-74 74-70 00-68 74-74 70-73 00-00 00-00 00-00 02-00 00-00 00-00 00-00 00-56 B0-55 55-55 00-00 ... 00-00 00-00 00-00 00-00 68-C8 B0-55 55-55 00-00 68-C8 B0-55 55-55 00-00 00-00 00-00 00-00 00-00 A0-C8 B0-55 55-55 00-00 00-00 00-00 00-00 00-00 00-65 6C-6C 6F-00 00-00 98-C8 B0-55 55-55 00-00>
[  FAILED  ] ParseURLSuccessCases/ParseURLSuccess.toStringRoundTrips/5, where GetParam() = 288-byte object <31-00 00-00 00-00 00-00 A8-86 95-55 55-55 00-00 B0-C7 B0-55 55-55 00-00 04-00 00-00 00-00 00-00 68-74 74-70 00-68 74-74 70-73 00-00 00-00 00-00 02-00 00-00 00-00 00-00 F0-2F B1-55 55-55 00-00 ... 00-00 00-00 00-00 00-00 68-C8 B0-55 55-55 00-00 68-C8 B0-55 55-55 00-00 00-00 00-00 00-00 00-00 A0-C8 B0-55 55-55 00-00 00-00 00-00 00-00 00-00 00-65 6C-6C 6F-00 00-00 98-C8 B0-55 55-55 00-00>
[  FAILED  ] ParseURLSuccessCases/ParseURLSuccess.makeSureFixGitURLDoesNotModify/5, where GetParam() = 288-byte object <31-00 00-00 00-00 00-00 A8-86 95-55 55-55 00-00 B0-C7 B0-55 55-55 00-00 04-00 00-00 00-00 00-00 68-74 74-70 00-68 74-74 70-73 00-00 00-00 00-00 02-00 00-00 00-00 00-00 40-55 B1-55 55-55 00-00 ... 00-00 00-00 00-00 00-00 68-C8 B0-55 55-55 00-00 68-C8 B0-55 55-55 00-00 00-00 00-00 00-00 00-00 A0-C8 B0-55 55-55 00-00 00-00 00-00 00-00 00-00 00-65 6C-6C 6F-00 00-00 98-C8 B0-55 55-55 00-00>
[  FAILED  ] parseURLRelative/ParseURLRelativeTestSuite.resolve/resolvesRelativePathIpv6AddressWithZoneId, where GetParam() = 336-byte object <3F-00 00-00 00-00 00-00 18-90 95-55 55-55 00-00 10-00 00-00 00-00 00-00 68-34 94-55 55-55 00-00 B0-F2 AF-55 55-55 00-00 04-00 00-00 00-00 00-00 68-74 74-70 00-00 00-00 00-00 00-00 00-00 00-00 ... A0-F3 AF-55 55-55 00-00 00-00 00-00 00-00 00-00 00-F3 AF-55 55-55 00-00 00-00 00-00 00-00 00-00 90-74 B1-55 55-55 00-00 29-00 00-00 00-00 00-00 29-00 00-00 00-00 00-00 F0-F3 AF-55 55-55 00-00>
[  FAILED  ] parseURLRelative/ParseURLRelativeTestSuite.resolve/absOverrideWithZoneId, where GetParam() = 336-byte object <21-00 00-00 00-00 00-00 60-8E 95-55 55-55 00-00 3C-00 00-00 00-00 00-00 88-8E 95-55 55-55 00-00 B0-F2 AF-55 55-55 00-00 05-00 00-00 00-00 00-00 68-74 74-70 73-00 00-00 00-00 00-00 00-00 00-00 ... A0-F3 AF-55 55-55 00-00 00-00 00-00 00-00 00-00 00-72 61-67 00-55 00-00 00-00 00-00 00-00 00-00 C0-3B B1-55 55-55 00-00 15-00 00-00 00-00 00-00 15-00 00-00 00-00 00-00 69-64 65-00 55-55 00-00>
 5 FAILED TESTS
  YOU HAVE 1 DISABLED TEST

nix-util-tests-run:
[  FAILED  ] 5 tests, listed below:
[  FAILED  ] ParseURLSuccessCases/ParseURLSuccess.parsesAsExpected/5, where GetParam() = 288-byte object <31-00 00-00 00-00 00-00 A8-86 95-55 55-55 00-00 B0-C7 B0-55 55-55 00-00 04-00 00-00 00-00 00-00 68-74 74-70 00-68 74-74 70-73 00-00 00-00 00-00 02-00 00-00 00-00 00-00 00-56 B0-55 55-55 00-00 ... 00-00 00-00 00-00 00-00 68-C8 B0-55 55-55 00-00 68-C8 B0-55 55-55 00-00 00-00 00-00 00-00 00-00 A0-C8 B0-55 55-55 00-00 00-00 00-00 00-00 00-00 00-65 6C-6C 6F-00 00-00 98-C8 B0-55 55-55 00-00>
[  FAILED  ] ParseURLSuccessCases/ParseURLSuccess.toStringRoundTrips/5, where GetParam() = 288-byte object <31-00 00-00 00-00 00-00 A8-86 95-55 55-55 00-00 B0-C7 B0-55 55-55 00-00 04-00 00-00 00-00 00-00 68-74 74-70 00-68 74-74 70-73 00-00 00-00 00-00 02-00 00-00 00-00 00-00 F0-2F B1-55 55-55 00-00 ... 00-00 00-00 00-00 00-00 68-C8 B0-55 55-55 00-00 68-C8 B0-55 55-55 00-00 00-00 00-00 00-00 00-00 A0-C8 B0-55 55-55 00-00 00-00 00-00 00-00 00-00 00-65 6C-6C 6F-00 00-00 98-C8 B0-55 55-55 00-00>
[  FAILED  ] ParseURLSuccessCases/ParseURLSuccess.makeSureFixGitURLDoesNotModify/5, where GetParam() = 288-byte object <31-00 00-00 00-00 00-00 A8-86 95-55 55-55 00-00 B0-C7 B0-55 55-55 00-00 04-00 00-00 00-00 00-00 68-74 74-70 00-68 74-74 70-73 00-00 00-00 00-00 02-00 00-00 00-00 00-00 40-55 B1-55 55-55 00-00 ... 00-00 00-00 00-00 00-00 68-C8 B0-55 55-55 00-00 68-C8 B0-55 55-55 00-00 00-00 00-00 00-00 00-00 A0-C8 B0-55 55-55 00-00 00-00 00-00 00-00 00-00 00-65 6C-6C 6F-00 00-00 98-C8 B0-55 55-55 00-00>
[  FAILED  ] parseURLRelative/ParseURLRelativeTestSuite.resolve/resolvesRelativePathIpv6AddressWithZoneId, where GetParam() = 336-byte object <3F-00 00-00 00-00 00-00 18-90 95-55 55-55 00-00 10-00 00-00 00-00 00-00 68-34 94-55 55-55 00-00 B0-F2 AF-55 55-55 00-00 04-00 00-00 00-00 00-00 68-74 74-70 00-00 00-00 00-00 00-00 00-00 00-00 ... A0-F3 AF-55 55-55 00-00 00-00 00-00 00-00 00-00 00-F3 AF-55 55-55 00-00 00-00 00-00 00-00 00-00 90-74 B1-55 55-55 00-00 29-00 00-00 00-00 00-00 29-00 00-00 00-00 00-00 F0-F3 AF-55 55-55 00-00>
[  FAILED  ] parseURLRelative/ParseURLRelativeTestSuite.resolve/absOverrideWithZoneId, where GetParam() = 336-byte object <21-00 00-00 00-00 00-00 60-8E 95-55 55-55 00-00 3C-00 00-00 00-00 00-00 88-8E 95-55 55-55 00-00 B0-F2 AF-55 55-55 00-00 05-00 00-00 00-00 00-00 68-74 74-70 73-00 00-00 00-00 00-00 00-00 00-00 ... A0-F3 AF-55 55-55 00-00 00-00 00-00 00-00 00-00 00-72 61-67 00-55 00-00 00-00 00-00 00-00 00-00 C0-3B B1-55 55-55 00-00 15-00 00-00 00-00 00-00 15-00 00-00 00-00 00-00 69-64 65-00 55-55 00-00>
 5 FAILED TESTS
  YOU HAVE 1 DISABLED TEST
dependency failed checks.aarch64-darwin.darwin-evo
failed checks.aarch64-darwin.home-manager-common 13s
nix-store-tests-run: [ SKIPPED ] HttpsBinaryCacheStoreMtlsTest.rejectsWithoutClientCert [ SKIPPED ] HttpsBinaryCacheStoreMtlsTest.rejectsWrongClientCert [ SK …
nix-store-tests-run:
[  SKIPPED ] HttpsBinaryCacheStoreMtlsTest.rejectsWithoutClientCert
[  SKIPPED ] HttpsBinaryCacheStoreMtlsTest.rejectsWrongClientCert
[  SKIPPED ] HttpsBinaryCacheStoreMtlsTest.doesNotSendCertOnRedirectToDifferentAuthority
[  FAILED  ] 1 test, listed below:
[  FAILED  ] StoreReferenceTest.PathInfo_ssh_unbracketed_ipv6_5_from_uri
 1 FAILED TEST
  YOU HAVE 1 DISABLED TEST


nix-util-tests-run:
[  FAILED  ] ParseURLSuccessCases/ParseURLSuccess.parsesAsExpected/5, where GetParam() = 224-byte object <66-E9 A2-00 01-00 00-00 31-00 00-00 00-00 00-00 68-74 74-70 00-00 00-00 F0-AE 33-02 01-00 00-00 26-00 00-00 00-00 00-04 02-00 00-00 00-00 00-00 E0-65 01-35 0B-00 00-00 21-00 00-00 00-00 00-00 ... D8-C9 C3-34 0B-00 00-00 D8-C9 C3-34 0B-00 00-00 98-CF 04-35 0B-00 00-00 00-00 00-00 00-00 00-00 00-00 00-00 00-00 00-00 00-42 C3-34 0B-00 00-00 90-00 C4-34 0B-00 00-00 90-00 C4-34 0B-00 00-00>
[  FAILED  ] ParseURLSuccessCases/ParseURLSuccess.toStringRoundTrips/5, where GetParam() = 224-byte object <66-E9 A2-00 01-00 00-00 31-00 00-00 00-00 00-00 68-74 74-70 00-00 00-00 00-00 00-00 00-00 00-00 00-00 00-00 00-00 00-04 02-00 00-00 00-00 00-00 70-66 01-35 0B-00 00-00 21-00 00-00 00-00 00-00 ... D8-C9 C3-34 0B-00 00-00 D8-C9 C3-34 0B-00 00-00 98-CF 04-35 0B-00 00-00 00-00 00-00 00-00 00-00 00-00 00-00 00-00 00-00 00-00 00-00 00-00 00-00 00-00 00-00 00-00 00-00 00-00 00-00 00-00 00-00>
[  FAILED  ] ParseURLSuccessCases/ParseURLSuccess.makeSureFixGitURLDoesNotModify/5, where GetParam() = 224-byte object <66-E9 A2-00 01-00 00-00 31-00 00-00 00-00 00-00 68-74 74-70 00-00 00-00 00-00 00-00 00-00 00-00 00-00 00-00 00-00 00-04 02-00 00-00 00-00 00-00 00-67 01-35 0B-00 00-00 21-00 00-00 00-00 00-00 ... D8-C9 C3-34 0B-00 00-00 D8-C9 C3-34 0B-00 00-00 98-CF 04-35 0B-00 00-00 00-00 00-00 00-00 00-00 00-00 00-00 00-00 00-00 00-00 00-00 00-00 00-00 00-00 00-00 00-00 00-00 00-00 00-00 00-00 00-00>
[  FAILED  ] parseURLRelative/ParseURLRelativeTestSuite.resolve/resolvesRelativePathIpv6AddressWithZoneId, where GetParam() = 264-byte object <F8-EA A2-00 01-00 00-00 3F-00 00-00 00-00 00-00 38-EB A2-00 01-00 00-00 10-00 00-00 00-00 00-00 68-74 74-70 00-00 00-00 00-00 00-00 00-00 00-00 00-00 00-00 00-00 00-04 02-00 00-00 00-00 00-00 ... 00-00 00-00 00-00 00-00 00-00 00-00 00-00 00-00 00-00 00-00 00-00 00-00 00-00 00-00 00-00 00-00 00-00 00-00 00-00 00-00 40-75 01-35 0B-00 00-00 29-00 00-00 00-00 00-00 30-00 00-00 00-00 00-80>
[  FAILED  ] parseURLRelative/ParseURLRelativeTestSuite.resolve/absOverrideWithZoneId, where GetParam() = 264-byte object <FB-EC A2-00 01-00 00-00 21-00 00-00 00-00 00-00 54-ED A2-00 01-00 00-00 3C-00 00-00 00-00 00-00 68-74 74-70 73-00 00-00 00-ED 6F-6F 01-00 00-00 00-00 00-00 00-00 00-05 02-00 00-00 00-00 00-00 ... 40-01 09-35 0B-00 00-00 01-00 00-00 00-00 00-00 00-00 00-00 00-00 00-00 00-00 00-00 00-00 00-00 00-00 00-00 00-00 00-00 61-62 73-4F 76-65 72-72 69-64 65-57 69-74 68-5A 6F-6E 65-49 64-00 00-15>
 5 FAILED TESTS
  YOU HAVE 1 DISABLED TEST
failed checks.aarch64-darwin.home-manager-macos 13s
nix-util-tests-run: [ FAILED ] ParseURLSuccessCases/ParseURLSuccess.parsesAsExpected/5, where GetParam() = 224-byte object <66-E9 01-01 01-00 00-00 31-00 00-0 …
nix-util-tests-run:
[  FAILED  ] ParseURLSuccessCases/ParseURLSuccess.parsesAsExpected/5, where GetParam() = 224-byte object <66-E9 01-01 01-00 00-00 31-00 00-00 00-00 00-00 68-74 74-70 00-00 00-00 B0-22 C1-02 08-00 00-00 26-00 00-00 00-00 00-04 02-00 00-00 00-00 00-00 00-21 C1-02 08-00 00-00 21-00 00-00 00-00 00-00 ... 78-5D C3-02 08-00 00-00 78-5D C3-02 08-00 00-00 B8-80 C2-02 08-00 00-00 00-00 00-00 00-00 00-00 00-00 00-00 00-00 00-00 00-06 C0-02 08-00 00-00 70-C2 C4-02 08-00 00-00 70-C2 C4-02 08-00 00-00>
[  FAILED  ] ParseURLSuccessCases/ParseURLSuccess.toStringRoundTrips/5, where GetParam() = 224-byte object <66-E9 01-01 01-00 00-00 31-00 00-00 00-00 00-00 68-74 74-70 00-00 00-00 00-00 00-00 00-00 00-00 00-00 00-00 00-00 00-04 02-00 00-00 00-00 00-00 E0-22 C1-02 08-00 00-00 21-00 00-00 00-00 00-00 ... 18-65 C3-02 08-00 00-00 18-65 C3-02 08-00 00-00 B8-80 C2-02 08-00 00-00 00-00 00-00 00-00 00-00 00-00 00-00 00-00 00-00 00-00 00-00 00-00 00-00 00-00 00-00 00-00 00-00 00-00 00-00 00-00 00-00>
[  FAILED  ] ParseURLSuccessCases/ParseURLSuccess.makeSureFixGitURLDoesNotModify/5, where GetParam() = 224-byte object <66-E9 01-01 01-00 00-00 31-00 00-00 00-00 00-00 68-74 74-70 00-00 00-00 00-00 00-00 00-00 00-00 00-00 00-00 00-00 00-04 02-00 00-00 00-00 00-00 10-23 C1-02 08-00 00-00 21-00 00-00 00-00 00-00 ... D8-6C C3-02 08-00 00-00 D8-6C C3-02 08-00 00-00 B8-80 C2-02 08-00 00-00 00-00 00-00 00-00 00-00 00-00 00-00 00-00 00-00 00-00 00-00 00-00 00-00 00-00 00-00 00-00 00-00 00-00 00-00 00-00 00-00>
[  FAILED  ] parseURLRelative/ParseURLRelativeTestSuite.resolve/resolvesRelativePathIpv6AddressWithZoneId, where GetParam() = 264-byte object <F8-EA 01-01 01-00 00-00 3F-00 00-00 00-00 00-00 38-EB 01-01 01-00 00-00 10-00 00-00 00-00 00-00 68-74 74-70 00-00 00-00 00-00 00-00 00-00 00-00 00-00 00-00 00-00 00-04 02-00 00-00 00-00 00-00 ... 00-00 00-00 00-00 00-00 00-00 00-00 00-00 00-00 00-00 00-00 00-00 00-00 00-00 00-00 00-00 00-00 00-00 00-00 00-00 00-00 E0-31 C1-02 08-00 00-00 29-00 00-00 00-00 00-00 30-00 00-00 00-00 00-80>
[  FAILED  ] parseURLRelative/ParseURLRelativeTestSuite.resolve/absOverrideWithZoneId, where GetParam() = 264-byte object <FB-EC 01-01 01-00 00-00 21-00 00-00 00-00 00-00 54-ED 01-01 01-00 00-00 3C-00 00-00 00-00 00-00 68-74 74-70 73-00 00-00 00-ED 10-6F 01-00 00-00 00-00 00-00 00-00 00-05 02-00 00-00 00-00 00-00 ... 20-03 0B-03 08-00 00-00 01-00 00-00 00-00 00-00 00-00 00-00 00-00 00-00 00-00 00-00 00-00 00-00 00-00 00-00 00-00 00-00 61-62 73-4F 76-65 72-72 69-64 65-57 69-74 68-5A 6F-6E 65-49 64-00 00-15>
 5 FAILED TESTS
  YOU HAVE 1 DISABLED TEST


nix-store-tests-run:
[  SKIPPED ] HttpsBinaryCacheStoreMtlsTest.rejectsWithoutClientCert
[  SKIPPED ] HttpsBinaryCacheStoreMtlsTest.rejectsWrongClientCert
[  SKIPPED ] HttpsBinaryCacheStoreMtlsTest.doesNotSendCertOnRedirectToDifferentAuthority
[  FAILED  ] 1 test, listed below:
[  FAILED  ] StoreReferenceTest.PathInfo_ssh_unbracketed_ipv6_5_from_uri
 1 FAILED TEST
  YOU HAVE 1 DISABLED TEST
failed checks.aarch64-darwin.home-manager-utm-vm 8s
nix-store-tests-run: [ SKIPPED ] HttpsBinaryCacheStoreMtlsTest.rejectsWithoutClientCert [ SKIPPED ] HttpsBinaryCacheStoreMtlsTest.rejectsWrongClientCert [ SK …
nix-store-tests-run:
[  SKIPPED ] HttpsBinaryCacheStoreMtlsTest.rejectsWithoutClientCert
[  SKIPPED ] HttpsBinaryCacheStoreMtlsTest.rejectsWrongClientCert
[  SKIPPED ] HttpsBinaryCacheStoreMtlsTest.doesNotSendCertOnRedirectToDifferentAuthority
[  FAILED  ] 1 test, listed below:
[  FAILED  ] StoreReferenceTest.PathInfo_ssh_unbracketed_ipv6_5_from_uri
 1 FAILED TEST
  YOU HAVE 1 DISABLED TEST


nix-util-tests-run:
[  FAILED  ] ParseURLSuccessCases/ParseURLSuccess.parsesAsExpected/5, where GetParam() = 224-byte object <66-69 9C-02 01-00 00-00 31-00 00-00 00-00 00-00 68-74 74-70 00-00 00-00 E0-84 C1-64 0B-00 00-00 26-00 00-00 00-00 00-04 02-00 00-00 00-00 00-00 C0-5E C1-64 0B-00 00-00 21-00 00-00 00-00 00-00 ... B8-1D C2-64 0B-00 00-00 B8-1D C2-64 0B-00 00-00 B8-C0 C3-64 0B-00 00-00 00-00 00-00 00-00 00-00 00-00 00-00 00-00 00-00 00-04 03-65 0B-00 00-00 50-5F C1-64 0B-00 00-00 50-5F C1-64 0B-00 00-00>
[  FAILED  ] ParseURLSuccessCases/ParseURLSuccess.toStringRoundTrips/5, where GetParam() = 224-byte object <66-69 9C-02 01-00 00-00 31-00 00-00 00-00 00-00 68-74 74-70 00-00 00-00 00-00 00-00 00-00 00-00 00-00 00-00 00-00 00-04 02-00 00-00 00-00 00-00 C0-64 C1-64 0B-00 00-00 21-00 00-00 00-00 00-00 ... B8-1E C2-64 0B-00 00-00 B8-1E C2-64 0B-00 00-00 B8-C0 C3-64 0B-00 00-00 00-00 00-00 00-00 00-00 00-00 00-00 00-00 00-00 00-00 00-00 00-00 00-00 00-00 00-00 00-00 00-00 00-00 00-00 00-00 00-00>
[  FAILED  ] ParseURLSuccessCases/ParseURLSuccess.makeSureFixGitURLDoesNotModify/5, where GetParam() = 224-byte object <66-69 9C-02 01-00 00-00 31-00 00-00 00-00 00-00 68-74 74-70 00-00 00-00 00-00 00-00 00-00 00-00 00-00 00-00 00-00 00-04 02-00 00-00 00-00 00-00 70-66 C1-64 0B-00 00-00 21-00 00-00 00-00 00-00 ... D8-1F C2-64 0B-00 00-00 D8-1F C2-64 0B-00 00-00 B8-C0 C3-64 0B-00 00-00 00-00 00-00 00-00 00-00 00-00 00-00 00-00 00-00 00-00 00-00 00-00 00-00 00-00 00-00 00-00 00-00 00-00 00-00 00-00 00-00>
[  FAILED  ] parseURLRelative/ParseURLRelativeTestSuite.resolve/resolvesRelativePathIpv6AddressWithZoneId, where GetParam() = 264-byte object <F8-6A 9C-02 01-00 00-00 3F-00 00-00 00-00 00-00 38-6B 9C-02 01-00 00-00 10-00 00-00 00-00 00-00 68-74 74-70 00-00 00-00 00-00 00-00 00-00 00-00 00-00 00-00 00-00 00-04 02-00 00-00 00-00 00-00 ... 00-00 00-00 00-00 00-00 00-00 00-00 00-00 00-00 00-00 00-00 00-00 00-00 00-00 00-00 00-00 00-00 00-00 00-00 00-00 00-00 10-69 C1-64 0B-00 00-00 29-00 00-00 00-00 00-00 30-00 00-00 00-00 00-80>
[  FAILED  ] parseURLRelative/ParseURLRelativeTestSuite.resolve/absOverrideWithZoneId, where GetParam() = 264-byte object <FB-6C 9C-02 01-00 00-00 21-00 00-00 00-00 00-00 54-6D 9C-02 01-00 00-00 3C-00 00-00 00-00 00-00 68-74 74-70 73-00 00-00 00-6D 76-6D 01-00 00-00 00-00 00-00 00-00 00-05 02-00 00-00 00-00 00-00 ... E0-01 C7-64 0B-00 00-00 01-00 00-00 00-00 00-00 00-00 00-00 00-00 00-00 00-00 00-00 00-00 00-00 00-00 00-00 00-00 00-00 61-62 73-4F 76-65 72-72 69-64 65-57 69-74 68-5A 6F-6E 65-49 64-00 00-15>
 5 FAILED TESTS
  YOU HAVE 1 DISABLED TEST
failed checks.aarch64-darwin.package-app-windows-extension 1s
app-windows-1.16: no configure script, doing nothing jsconfig.json:8:15 - error TS6046: Argument for '--module' option must be: 'commonjs', 'es6', 'es2015', 'es …
app-windows-1.16:
no configure script, doing nothing
jsconfig.json:8:15 - error TS6046: Argument for '--module' option must be: 'commonjs', 'es6', 'es2015', 'es2020', 'es2022', 'esnext', 'node16', 'node18', 'node20', 'nodenext', 'preserve'.
8     "module": "none",
                ~~~~~~
Found 1 error in jsconfig.json:8
failed checks.aarch64-linux.home-manager-common 3s
nix-store-tests-run: [----------] 5 tests from S3ToHttpsConversionErrors/S3ToHttpsConversionErrorTest (0 ms total) [----------] Global test environment tear-dow …
nix-store-tests-run:
[----------] 5 tests from S3ToHttpsConversionErrors/S3ToHttpsConversionErrorTest (0 ms total)
[----------] Global test environment tear-down
[==========] 798 tests from 90 test suites ran. (1628 ms total)
[  PASSED  ] 797 tests.
[  FAILED  ] 1 test, listed below:
[  FAILED  ] StoreReferenceTest.PathInfo_ssh_unbracketed_ipv6_5_from_uri
 1 FAILED TEST
  YOU HAVE 1 DISABLED TEST

nix-util-tests-run-without-new-syscalls:
[  FAILED  ] 5 tests, listed below:
[  FAILED  ] ParseURLSuccessCases/ParseURLSuccess.parsesAsExpected/5, where GetParam() = 288-byte object <31-00 00-00 00-00 00-00 10-BE E4-AA AA-AA 00-00 00-B1 FF-AA AA-AA 00-00 04-00 00-00 00-00 00-00 68-74 74-70 00-68 74-74 70-73 00-00 00-00 00-00 02-00 00-00 00-00 00-00 10-FC FE-AA AA-AA 00-00 ... 00-00 00-00 00-00 00-00 B8-B1 FF-AA AA-AA 00-00 B8-B1 FF-AA AA-AA 00-00 00-00 00-00 00-00 00-00 F0-B1 FF-AA AA-AA 00-00 00-00 00-00 00-00 00-00 00-65 6C-6C 6F-00 00-00 E8-B1 FF-AA AA-AA 00-00>
[  FAILED  ] ParseURLSuccessCases/ParseURLSuccess.toStringRoundTrips/5, where GetParam() = 288-byte object <31-00 00-00 00-00 00-00 10-BE E4-AA AA-AA 00-00 00-B1 FF-AA AA-AA 00-00 04-00 00-00 00-00 00-00 68-74 74-70 00-68 74-74 70-73 00-00 00-00 00-00 02-00 00-00 00-00 00-00 60-1B 00-AB AA-AA 00-00 ... 00-00 00-00 00-00 00-00 B8-B1 FF-AA AA-AA 00-00 B8-B1 FF-AA AA-AA 00-00 00-00 00-00 00-00 00-00 F0-B1 FF-AA AA-AA 00-00 00-00 00-00 00-00 00-00 00-65 6C-6C 6F-00 00-00 E8-B1 FF-AA AA-AA 00-00>
[  FAILED  ] ParseURLSuccessCases/ParseURLSuccess.makeSureFixGitURLDoesNotModify/5, where GetParam() = 288-byte object <31-00 00-00 00-00 00-00 10-BE E4-AA AA-AA 00-00 00-B1 FF-AA AA-AA 00-00 04-00 00-00 00-00 00-00 68-74 74-70 00-68 74-74 70-73 00-00 00-00 00-00 02-00 00-00 00-00 00-00 C0-3F 00-AB AA-AA 00-00 ... 00-00 00-00 00-00 00-00 B8-B1 FF-AA AA-AA 00-00 B8-B1 FF-AA AA-AA 00-00 00-00 00-00 00-00 00-00 F0-B1 FF-AA AA-AA 00-00 00-00 00-00 00-00 00-00 00-65 6C-6C 6F-00 00-00 E8-B1 FF-AA AA-AA 00-00>
[  FAILED  ] parseURLRelative/ParseURLRelativeTestSuite.resolve/resolvesRelativePathIpv6AddressWithZoneId, where GetParam() = 336-byte object <3F-00 00-00 00-00 00-00 D8-C9 E4-AA AA-AA 00-00 10-00 00-00 00-00 00-00 18-CA E4-AA AA-AA 00-00 E0-4D FF-AA AA-AA 00-00 04-00 00-00 00-00 00-00 68-74 74-70 00-00 00-00 01-00 00-00 00-00 00-00 ... D0-4E FF-AA AA-AA 00-00 00-00 00-00 00-00 00-00 00-4E FF-AA AA-AA 00-00 00-00 00-00 00-00 00-00 A0-5E 00-AB AA-AA 00-00 29-00 00-00 00-00 00-00 29-00 00-00 00-00 00-00 30-96 FE-AA AA-AA 00-00>
[  FAILED  ] parseURLRelative/ParseURLRelativeTestSuite.resolve/absOverrideWithZoneId, where GetParam() = 336-byte object <21-00 00-00 00-00 00-00 18-CC E4-AA AA-AA 00-00 3C-00 00-00 00-00 00-00 80-CC E4-AA AA-AA 00-00 E0-4D FF-AA AA-AA 00-00 05-00 00-00 00-00 00-00 68-74 74-70 73-00 00-00 01-00 00-00 00-00 00-00 ... D0-4E FF-AA AA-AA 00-00 00-00 00-00 00-00 00-00 00-72 61-67 00-AA 00-00 00-00 00-00 00-00 00-00 10-2A 00-AB AA-AA 00-00 15-00 00-00 00-00 00-00 15-00 00-00 00-00 00-00 69-64 65-00 AA-AA 00-00>
 5 FAILED TESTS
  YOU HAVE 1 DISABLED TEST

nix-util-tests-run:
[  FAILED  ] 5 tests, listed below:
[  FAILED  ] ParseURLSuccessCases/ParseURLSuccess.parsesAsExpected/5, where GetParam() = 288-byte object <31-00 00-00 00-00 00-00 10-BE E4-AA AA-AA 00-00 00-B1 FF-AA AA-AA 00-00 04-00 00-00 00-00 00-00 68-74 74-70 00-68 74-74 70-73 00-00 00-00 00-00 02-00 00-00 00-00 00-00 10-FC FE-AA AA-AA 00-00 ... 00-00 00-00 00-00 00-00 B8-B1 FF-AA AA-AA 00-00 B8-B1 FF-AA AA-AA 00-00 00-00 00-00 00-00 00-00 F0-B1 FF-AA AA-AA 00-00 00-00 00-00 00-00 00-00 00-65 6C-6C 6F-00 00-00 E8-B1 FF-AA AA-AA 00-00>
[  FAILED  ] ParseURLSuccessCases/ParseURLSuccess.toStringRoundTrips/5, where GetParam() = 288-byte object <31-00 00-00 00-00 00-00 10-BE E4-AA AA-AA 00-00 00-B1 FF-AA AA-AA 00-00 04-00 00-00 00-00 00-00 68-74 74-70 00-68 74-74 70-73 00-00 00-00 00-00 02-00 00-00 00-00 00-00 60-1B 00-AB AA-AA 00-00 ... 00-00 00-00 00-00 00-00 B8-B1 FF-AA AA-AA 00-00 B8-B1 FF-AA AA-AA 00-00 00-00 00-00 00-00 00-00 F0-B1 FF-AA AA-AA 00-00 00-00 00-00 00-00 00-00 00-65 6C-6C 6F-00 00-00 E8-B1 FF-AA AA-AA 00-00>
[  FAILED  ] ParseURLSuccessCases/ParseURLSuccess.makeSureFixGitURLDoesNotModify/5, where GetParam() = 288-byte object <31-00 00-00 00-00 00-00 10-BE E4-AA AA-AA 00-00 00-B1 FF-AA AA-AA 00-00 04-00 00-00 00-00 00-00 68-74 74-70 00-68 74-74 70-73 00-00 00-00 00-00 02-00 00-00 00-00 00-00 C0-3F 00-AB AA-AA 00-00 ... 00-00 00-00 00-00 00-00 B8-B1 FF-AA AA-AA 00-00 B8-B1 FF-AA AA-AA 00-00 00-00 00-00 00-00 00-00 F0-B1 FF-AA AA-AA 00-00 00-00 00-00 00-00 00-00 00-65 6C-6C 6F-00 00-00 E8-B1 FF-AA AA-AA 00-00>
[  FAILED  ] parseURLRelative/ParseURLRelativeTestSuite.resolve/resolvesRelativePathIpv6AddressWithZoneId, where GetParam() = 336-byte object <3F-00 00-00 00-00 00-00 D8-C9 E4-AA AA-AA 00-00 10-00 00-00 00-00 00-00 18-CA E4-AA AA-AA 00-00 E0-4D FF-AA AA-AA 00-00 04-00 00-00 00-00 00-00 68-74 74-70 00-00 00-00 01-00 00-00 00-00 00-00 ... D0-4E FF-AA AA-AA 00-00 00-00 00-00 00-00 00-00 00-4E FF-AA AA-AA 00-00 00-00 00-00 00-00 00-00 A0-5E 00-AB AA-AA 00-00 29-00 00-00 00-00 00-00 29-00 00-00 00-00 00-00 30-96 FE-AA AA-AA 00-00>
[  FAILED  ] parseURLRelative/ParseURLRelativeTestSuite.resolve/absOverrideWithZoneId, where GetParam() = 336-byte object <21-00 00-00 00-00 00-00 18-CC E4-AA AA-AA 00-00 3C-00 00-00 00-00 00-00 80-CC E4-AA AA-AA 00-00 E0-4D FF-AA AA-AA 00-00 05-00 00-00 00-00 00-00 68-74 74-70 73-00 00-00 01-00 00-00 00-00 00-00 ... D0-4E FF-AA AA-AA 00-00 00-00 00-00 00-00 00-00 00-72 61-67 00-AA 00-00 00-00 00-00 00-00 00-00 10-2A 00-AB AA-AA 00-00 15-00 00-00 00-00 00-00 15-00 00-00 00-00 00-00 69-64 65-00 AA-AA 00-00>
 5 FAILED TESTS
  YOU HAVE 1 DISABLED TEST
dependency failed checks.aarch64-linux.home-manager-utm-vm
failed checks.aarch64-linux.nixos-blob64 4s
nix-store-tests-run: [----------] 5 tests from S3ToHttpsConversionErrors/S3ToHttpsConversionErrorTest (0 ms total) [----------] Global test environment tear-dow …
nix-store-tests-run:
[----------] 5 tests from S3ToHttpsConversionErrors/S3ToHttpsConversionErrorTest (0 ms total)
[----------] Global test environment tear-down
[==========] 798 tests from 90 test suites ran. (1716 ms total)
[  PASSED  ] 797 tests.
[  FAILED  ] 1 test, listed below:
[  FAILED  ] StoreReferenceTest.PathInfo_ssh_unbracketed_ipv6_5_from_uri
 1 FAILED TEST
  YOU HAVE 1 DISABLED TEST

nix-util-tests-run-without-new-syscalls:
[  FAILED  ] 5 tests, listed below:
[  FAILED  ] ParseURLSuccessCases/ParseURLSuccess.parsesAsExpected/5, where GetParam() = 288-byte object <31-00 00-00 00-00 00-00 10-BE E4-AA AA-AA 00-00 00-B1 FF-AA AA-AA 00-00 04-00 00-00 00-00 00-00 68-74 74-70 00-68 74-74 70-73 00-00 00-00 00-00 02-00 00-00 00-00 00-00 10-FC FE-AA AA-AA 00-00 ... 00-00 00-00 00-00 00-00 B8-B1 FF-AA AA-AA 00-00 B8-B1 FF-AA AA-AA 00-00 00-00 00-00 00-00 00-00 F0-B1 FF-AA AA-AA 00-00 00-00 00-00 00-00 00-00 00-65 6C-6C 6F-00 00-00 E8-B1 FF-AA AA-AA 00-00>
[  FAILED  ] ParseURLSuccessCases/ParseURLSuccess.toStringRoundTrips/5, where GetParam() = 288-byte object <31-00 00-00 00-00 00-00 10-BE E4-AA AA-AA 00-00 00-B1 FF-AA AA-AA 00-00 04-00 00-00 00-00 00-00 68-74 74-70 00-68 74-74 70-73 00-00 00-00 00-00 02-00 00-00 00-00 00-00 60-1B 00-AB AA-AA 00-00 ... 00-00 00-00 00-00 00-00 B8-B1 FF-AA AA-AA 00-00 B8-B1 FF-AA AA-AA 00-00 00-00 00-00 00-00 00-00 F0-B1 FF-AA AA-AA 00-00 00-00 00-00 00-00 00-00 00-65 6C-6C 6F-00 00-00 E8-B1 FF-AA AA-AA 00-00>
[  FAILED  ] ParseURLSuccessCases/ParseURLSuccess.makeSureFixGitURLDoesNotModify/5, where GetParam() = 288-byte object <31-00 00-00 00-00 00-00 10-BE E4-AA AA-AA 00-00 00-B1 FF-AA AA-AA 00-00 04-00 00-00 00-00 00-00 68-74 74-70 00-68 74-74 70-73 00-00 00-00 00-00 02-00 00-00 00-00 00-00 C0-3F 00-AB AA-AA 00-00 ... 00-00 00-00 00-00 00-00 B8-B1 FF-AA AA-AA 00-00 B8-B1 FF-AA AA-AA 00-00 00-00 00-00 00-00 00-00 F0-B1 FF-AA AA-AA 00-00 00-00 00-00 00-00 00-00 00-65 6C-6C 6F-00 00-00 E8-B1 FF-AA AA-AA 00-00>
[  FAILED  ] parseURLRelative/ParseURLRelativeTestSuite.resolve/resolvesRelativePathIpv6AddressWithZoneId, where GetParam() = 336-byte object <3F-00 00-00 00-00 00-00 D8-C9 E4-AA AA-AA 00-00 10-00 00-00 00-00 00-00 18-CA E4-AA AA-AA 00-00 E0-4D FF-AA AA-AA 00-00 04-00 00-00 00-00 00-00 68-74 74-70 00-00 00-00 01-00 00-00 00-00 00-00 ... D0-4E FF-AA AA-AA 00-00 00-00 00-00 00-00 00-00 00-4E FF-AA AA-AA 00-00 00-00 00-00 00-00 00-00 A0-5E 00-AB AA-AA 00-00 29-00 00-00 00-00 00-00 29-00 00-00 00-00 00-00 30-96 FE-AA AA-AA 00-00>
[  FAILED  ] parseURLRelative/ParseURLRelativeTestSuite.resolve/absOverrideWithZoneId, where GetParam() = 336-byte object <21-00 00-00 00-00 00-00 18-CC E4-AA AA-AA 00-00 3C-00 00-00 00-00 00-00 80-CC E4-AA AA-AA 00-00 E0-4D FF-AA AA-AA 00-00 05-00 00-00 00-00 00-00 68-74 74-70 73-00 00-00 01-00 00-00 00-00 00-00 ... D0-4E FF-AA AA-AA 00-00 00-00 00-00 00-00 00-00 00-72 61-67 00-AA 00-00 00-00 00-00 00-00 00-00 10-2A 00-AB AA-AA 00-00 15-00 00-00 00-00 00-00 15-00 00-00 00-00 00-00 69-64 65-00 AA-AA 00-00>
 5 FAILED TESTS
  YOU HAVE 1 DISABLED TEST

nix-util-tests-run:
[  FAILED  ] 5 tests, listed below:
[  FAILED  ] ParseURLSuccessCases/ParseURLSuccess.parsesAsExpected/5, where GetParam() = 288-byte object <31-00 00-00 00-00 00-00 10-BE E4-AA AA-AA 00-00 00-B1 FF-AA AA-AA 00-00 04-00 00-00 00-00 00-00 68-74 74-70 00-68 74-74 70-73 00-00 00-00 00-00 02-00 00-00 00-00 00-00 10-FC FE-AA AA-AA 00-00 ... 00-00 00-00 00-00 00-00 B8-B1 FF-AA AA-AA 00-00 B8-B1 FF-AA AA-AA 00-00 00-00 00-00 00-00 00-00 F0-B1 FF-AA AA-AA 00-00 00-00 00-00 00-00 00-00 00-65 6C-6C 6F-00 00-00 E8-B1 FF-AA AA-AA 00-00>
[  FAILED  ] ParseURLSuccessCases/ParseURLSuccess.toStringRoundTrips/5, where GetParam() = 288-byte object <31-00 00-00 00-00 00-00 10-BE E4-AA AA-AA 00-00 00-B1 FF-AA AA-AA 00-00 04-00 00-00 00-00 00-00 68-74 74-70 00-68 74-74 70-73 00-00 00-00 00-00 02-00 00-00 00-00 00-00 60-1B 00-AB AA-AA 00-00 ... 00-00 00-00 00-00 00-00 B8-B1 FF-AA AA-AA 00-00 B8-B1 FF-AA AA-AA 00-00 00-00 00-00 00-00 00-00 F0-B1 FF-AA AA-AA 00-00 00-00 00-00 00-00 00-00 00-65 6C-6C 6F-00 00-00 E8-B1 FF-AA AA-AA 00-00>
[  FAILED  ] ParseURLSuccessCases/ParseURLSuccess.makeSureFixGitURLDoesNotModify/5, where GetParam() = 288-byte object <31-00 00-00 00-00 00-00 10-BE E4-AA AA-AA 00-00 00-B1 FF-AA AA-AA 00-00 04-00 00-00 00-00 00-00 68-74 74-70 00-68 74-74 70-73 00-00 00-00 00-00 02-00 00-00 00-00 00-00 C0-3F 00-AB AA-AA 00-00 ... 00-00 00-00 00-00 00-00 B8-B1 FF-AA AA-AA 00-00 B8-B1 FF-AA AA-AA 00-00 00-00 00-00 00-00 00-00 F0-B1 FF-AA AA-AA 00-00 00-00 00-00 00-00 00-00 00-65 6C-6C 6F-00 00-00 E8-B1 FF-AA AA-AA 00-00>
[  FAILED  ] parseURLRelative/ParseURLRelativeTestSuite.resolve/resolvesRelativePathIpv6AddressWithZoneId, where GetParam() = 336-byte object <3F-00 00-00 00-00 00-00 D8-C9 E4-AA AA-AA 00-00 10-00 00-00 00-00 00-00 18-CA E4-AA AA-AA 00-00 E0-4D FF-AA AA-AA 00-00 04-00 00-00 00-00 00-00 68-74 74-70 00-00 00-00 01-00 00-00 00-00 00-00 ... D0-4E FF-AA AA-AA 00-00 00-00 00-00 00-00 00-00 00-4E FF-AA AA-AA 00-00 00-00 00-00 00-00 00-00 A0-5E 00-AB AA-AA 00-00 29-00 00-00 00-00 00-00 29-00 00-00 00-00 00-00 30-96 FE-AA AA-AA 00-00>
[  FAILED  ] parseURLRelative/ParseURLRelativeTestSuite.resolve/absOverrideWithZoneId, where GetParam() = 336-byte object <21-00 00-00 00-00 00-00 18-CC E4-AA AA-AA 00-00 3C-00 00-00 00-00 00-00 80-CC E4-AA AA-AA 00-00 E0-4D FF-AA AA-AA 00-00 05-00 00-00 00-00 00-00 68-74 74-70 73-00 00-00 01-00 00-00 00-00 00-00 ... D0-4E FF-AA AA-AA 00-00 00-00 00-00 00-00 00-00 00-72 61-67 00-AA 00-00 00-00 00-00 00-00 00-00 10-2A 00-AB AA-AA 00-00 15-00 00-00 00-00 00-00 15-00 00-00 00-00 00-00 69-64 65-00 AA-AA 00-00>
 5 FAILED TESTS
  YOU HAVE 1 DISABLED TEST
failed checks.aarch64-linux.package-app-windows-extension 1s
app-windows-1.16: tribuchet: building on eliza no configure script, doing nothing jsconfig.json(8,15): error TS6046: Argument for '--module' option must be: 'co …
app-windows-1.16:
tribuchet: building on eliza
no configure script, doing nothing
jsconfig.json(8,15): error TS6046: Argument for '--module' option must be: 'commonjs', 'es6', 'es2015', 'es2020', 'es2022', 'esnext', 'node16', 'node18', 'node20', 'nodenext', 'preserve'.
failed checks.x86_64-linux.home-manager-bernie 20s
nix-util-tests-run: [ FAILED ] 5 tests, listed below: [ FAILED ] ParseURLSuccessCases/ParseURLSuccess.parsesAsExpected/5, where GetParam() = 288-byte object …
nix-util-tests-run:
[  FAILED  ] 5 tests, listed below:
[  FAILED  ] ParseURLSuccessCases/ParseURLSuccess.parsesAsExpected/5, where GetParam() = 288-byte object <31-00 00-00 00-00 00-00 A8-86 95-55 55-55 00-00 B0-C7 B0-55 55-55 00-00 04-00 00-00 00-00 00-00 68-74 74-70 00-68 74-74 70-73 00-00 00-00 00-00 02-00 00-00 00-00 00-00 00-56 B0-55 55-55 00-00 ... 00-00 00-00 00-00 00-00 68-C8 B0-55 55-55 00-00 68-C8 B0-55 55-55 00-00 00-00 00-00 00-00 00-00 A0-C8 B0-55 55-55 00-00 00-00 00-00 00-00 00-00 00-65 6C-6C 6F-00 00-00 98-C8 B0-55 55-55 00-00>
[  FAILED  ] ParseURLSuccessCases/ParseURLSuccess.toStringRoundTrips/5, where GetParam() = 288-byte object <31-00 00-00 00-00 00-00 A8-86 95-55 55-55 00-00 B0-C7 B0-55 55-55 00-00 04-00 00-00 00-00 00-00 68-74 74-70 00-68 74-74 70-73 00-00 00-00 00-00 02-00 00-00 00-00 00-00 F0-2F B1-55 55-55 00-00 ... 00-00 00-00 00-00 00-00 68-C8 B0-55 55-55 00-00 68-C8 B0-55 55-55 00-00 00-00 00-00 00-00 00-00 A0-C8 B0-55 55-55 00-00 00-00 00-00 00-00 00-00 00-65 6C-6C 6F-00 00-00 98-C8 B0-55 55-55 00-00>
[  FAILED  ] ParseURLSuccessCases/ParseURLSuccess.makeSureFixGitURLDoesNotModify/5, where GetParam() = 288-byte object <31-00 00-00 00-00 00-00 A8-86 95-55 55-55 00-00 B0-C7 B0-55 55-55 00-00 04-00 00-00 00-00 00-00 68-74 74-70 00-68 74-74 70-73 00-00 00-00 00-00 02-00 00-00 00-00 00-00 40-55 B1-55 55-55 00-00 ... 00-00 00-00 00-00 00-00 68-C8 B0-55 55-55 00-00 68-C8 B0-55 55-55 00-00 00-00 00-00 00-00 00-00 A0-C8 B0-55 55-55 00-00 00-00 00-00 00-00 00-00 00-65 6C-6C 6F-00 00-00 98-C8 B0-55 55-55 00-00>
[  FAILED  ] parseURLRelative/ParseURLRelativeTestSuite.resolve/resolvesRelativePathIpv6AddressWithZoneId, where GetParam() = 336-byte object <3F-00 00-00 00-00 00-00 18-90 95-55 55-55 00-00 10-00 00-00 00-00 00-00 68-34 94-55 55-55 00-00 B0-F2 AF-55 55-55 00-00 04-00 00-00 00-00 00-00 68-74 74-70 00-00 00-00 00-00 00-00 00-00 00-00 ... A0-F3 AF-55 55-55 00-00 00-00 00-00 00-00 00-00 00-F3 AF-55 55-55 00-00 00-00 00-00 00-00 00-00 90-74 B1-55 55-55 00-00 29-00 00-00 00-00 00-00 29-00 00-00 00-00 00-00 F0-F3 AF-55 55-55 00-00>
[  FAILED  ] parseURLRelative/ParseURLRelativeTestSuite.resolve/absOverrideWithZoneId, where GetParam() = 336-byte object <21-00 00-00 00-00 00-00 60-8E 95-55 55-55 00-00 3C-00 00-00 00-00 00-00 88-8E 95-55 55-55 00-00 B0-F2 AF-55 55-55 00-00 05-00 00-00 00-00 00-00 68-74 74-70 73-00 00-00 00-00 00-00 00-00 00-00 ... A0-F3 AF-55 55-55 00-00 00-00 00-00 00-00 00-00 00-72 61-67 00-55 00-00 00-00 00-00 00-00 00-00 C0-3B B1-55 55-55 00-00 15-00 00-00 00-00 00-00 15-00 00-00 00-00 00-00 69-64 65-00 55-55 00-00>
 5 FAILED TESTS
  YOU HAVE 1 DISABLED TEST

nix-store-tests-run:
[----------] 5 tests from S3ToHttpsConversionErrors/S3ToHttpsConversionErrorTest (0 ms total)
[----------] Global test environment tear-down
[==========] 798 tests from 90 test suites ran. (1441 ms total)
[  PASSED  ] 797 tests.
[  FAILED  ] 1 test, listed below:
[  FAILED  ] StoreReferenceTest.PathInfo_ssh_unbracketed_ipv6_5_from_uri
 1 FAILED TEST
  YOU HAVE 1 DISABLED TEST

nix-util-tests-run-without-new-syscalls:
[  FAILED  ] 5 tests, listed below:
[  FAILED  ] ParseURLSuccessCases/ParseURLSuccess.parsesAsExpected/5, where GetParam() = 288-byte object <31-00 00-00 00-00 00-00 A8-86 95-55 55-55 00-00 B0-C7 B0-55 55-55 00-00 04-00 00-00 00-00 00-00 68-74 74-70 00-68 74-74 70-73 00-00 00-00 00-00 02-00 00-00 00-00 00-00 00-56 B0-55 55-55 00-00 ... 00-00 00-00 00-00 00-00 68-C8 B0-55 55-55 00-00 68-C8 B0-55 55-55 00-00 00-00 00-00 00-00 00-00 A0-C8 B0-55 55-55 00-00 00-00 00-00 00-00 00-00 00-65 6C-6C 6F-00 00-00 98-C8 B0-55 55-55 00-00>
[  FAILED  ] ParseURLSuccessCases/ParseURLSuccess.toStringRoundTrips/5, where GetParam() = 288-byte object <31-00 00-00 00-00 00-00 A8-86 95-55 55-55 00-00 B0-C7 B0-55 55-55 00-00 04-00 00-00 00-00 00-00 68-74 74-70 00-68 74-74 70-73 00-00 00-00 00-00 02-00 00-00 00-00 00-00 F0-2F B1-55 55-55 00-00 ... 00-00 00-00 00-00 00-00 68-C8 B0-55 55-55 00-00 68-C8 B0-55 55-55 00-00 00-00 00-00 00-00 00-00 A0-C8 B0-55 55-55 00-00 00-00 00-00 00-00 00-00 00-65 6C-6C 6F-00 00-00 98-C8 B0-55 55-55 00-00>
[  FAILED  ] ParseURLSuccessCases/ParseURLSuccess.makeSureFixGitURLDoesNotModify/5, where GetParam() = 288-byte object <31-00 00-00 00-00 00-00 A8-86 95-55 55-55 00-00 B0-C7 B0-55 55-55 00-00 04-00 00-00 00-00 00-00 68-74 74-70 00-68 74-74 70-73 00-00 00-00 00-00 02-00 00-00 00-00 00-00 40-55 B1-55 55-55 00-00 ... 00-00 00-00 00-00 00-00 68-C8 B0-55 55-55 00-00 68-C8 B0-55 55-55 00-00 00-00 00-00 00-00 00-00 A0-C8 B0-55 55-55 00-00 00-00 00-00 00-00 00-00 00-65 6C-6C 6F-00 00-00 98-C8 B0-55 55-55 00-00>
[  FAILED  ] parseURLRelative/ParseURLRelativeTestSuite.resolve/resolvesRelativePathIpv6AddressWithZoneId, where GetParam() = 336-byte object <3F-00 00-00 00-00 00-00 18-90 95-55 55-55 00-00 10-00 00-00 00-00 00-00 68-34 94-55 55-55 00-00 B0-F2 AF-55 55-55 00-00 04-00 00-00 00-00 00-00 68-74 74-70 00-00 00-00 00-00 00-00 00-00 00-00 ... A0-F3 AF-55 55-55 00-00 00-00 00-00 00-00 00-00 00-F3 AF-55 55-55 00-00 00-00 00-00 00-00 00-00 90-74 B1-55 55-55 00-00 29-00 00-00 00-00 00-00 29-00 00-00 00-00 00-00 F0-F3 AF-55 55-55 00-00>
[  FAILED  ] parseURLRelative/ParseURLRelativeTestSuite.resolve/absOverrideWithZoneId, where GetParam() = 336-byte object <21-00 00-00 00-00 00-00 60-8E 95-55 55-55 00-00 3C-00 00-00 00-00 00-00 88-8E 95-55 55-55 00-00 B0-F2 AF-55 55-55 00-00 05-00 00-00 00-00 00-00 68-74 74-70 73-00 00-00 00-00 00-00 00-00 00-00 ... A0-F3 AF-55 55-55 00-00 00-00 00-00 00-00 00-00 00-72 61-67 00-55 00-00 00-00 00-00 00-00 00-00 C0-3B B1-55 55-55 00-00 15-00 00-00 00-00 00-00 15-00 00-00 00-00 00-00 69-64 65-00 55-55 00-00>
 5 FAILED TESTS
  YOU HAVE 1 DISABLED TEST
failed checks.x86_64-linux.home-manager-coder 2m 40s
nix-store-tests-run: [----------] 5 tests from S3ToHttpsConversionErrors/S3ToHttpsConversionErrorTest (0 ms total) [----------] Global test environment tear-dow …
nix-store-tests-run:
[----------] 5 tests from S3ToHttpsConversionErrors/S3ToHttpsConversionErrorTest (0 ms total)
[----------] Global test environment tear-down
[==========] 798 tests from 90 test suites ran. (1495 ms total)
[  PASSED  ] 797 tests.
[  FAILED  ] 1 test, listed below:
[  FAILED  ] StoreReferenceTest.PathInfo_ssh_unbracketed_ipv6_5_from_uri
 1 FAILED TEST
  YOU HAVE 1 DISABLED TEST

nix-util-tests-run-without-new-syscalls:
[  FAILED  ] 5 tests, listed below:
[  FAILED  ] ParseURLSuccessCases/ParseURLSuccess.parsesAsExpected/5, where GetParam() = 288-byte object <31-00 00-00 00-00 00-00 A8-86 95-55 55-55 00-00 B0-C7 B0-55 55-55 00-00 04-00 00-00 00-00 00-00 68-74 74-70 00-68 74-74 70-73 00-00 00-00 00-00 02-00 00-00 00-00 00-00 00-56 B0-55 55-55 00-00 ... 00-00 00-00 00-00 00-00 68-C8 B0-55 55-55 00-00 68-C8 B0-55 55-55 00-00 00-00 00-00 00-00 00-00 A0-C8 B0-55 55-55 00-00 00-00 00-00 00-00 00-00 00-65 6C-6C 6F-00 00-00 98-C8 B0-55 55-55 00-00>
[  FAILED  ] ParseURLSuccessCases/ParseURLSuccess.toStringRoundTrips/5, where GetParam() = 288-byte object <31-00 00-00 00-00 00-00 A8-86 95-55 55-55 00-00 B0-C7 B0-55 55-55 00-00 04-00 00-00 00-00 00-00 68-74 74-70 00-68 74-74 70-73 00-00 00-00 00-00 02-00 00-00 00-00 00-00 F0-2F B1-55 55-55 00-00 ... 00-00 00-00 00-00 00-00 68-C8 B0-55 55-55 00-00 68-C8 B0-55 55-55 00-00 00-00 00-00 00-00 00-00 A0-C8 B0-55 55-55 00-00 00-00 00-00 00-00 00-00 00-65 6C-6C 6F-00 00-00 98-C8 B0-55 55-55 00-00>
[  FAILED  ] ParseURLSuccessCases/ParseURLSuccess.makeSureFixGitURLDoesNotModify/5, where GetParam() = 288-byte object <31-00 00-00 00-00 00-00 A8-86 95-55 55-55 00-00 B0-C7 B0-55 55-55 00-00 04-00 00-00 00-00 00-00 68-74 74-70 00-68 74-74 70-73 00-00 00-00 00-00 02-00 00-00 00-00 00-00 40-55 B1-55 55-55 00-00 ... 00-00 00-00 00-00 00-00 68-C8 B0-55 55-55 00-00 68-C8 B0-55 55-55 00-00 00-00 00-00 00-00 00-00 A0-C8 B0-55 55-55 00-00 00-00 00-00 00-00 00-00 00-65 6C-6C 6F-00 00-00 98-C8 B0-55 55-55 00-00>
[  FAILED  ] parseURLRelative/ParseURLRelativeTestSuite.resolve/resolvesRelativePathIpv6AddressWithZoneId, where GetParam() = 336-byte object <3F-00 00-00 00-00 00-00 18-90 95-55 55-55 00-00 10-00 00-00 00-00 00-00 68-34 94-55 55-55 00-00 B0-F2 AF-55 55-55 00-00 04-00 00-00 00-00 00-00 68-74 74-70 00-00 00-00 00-00 00-00 00-00 00-00 ... A0-F3 AF-55 55-55 00-00 00-00 00-00 00-00 00-00 00-F3 AF-55 55-55 00-00 00-00 00-00 00-00 00-00 90-74 B1-55 55-55 00-00 29-00 00-00 00-00 00-00 29-00 00-00 00-00 00-00 F0-F3 AF-55 55-55 00-00>
[  FAILED  ] parseURLRelative/ParseURLRelativeTestSuite.resolve/absOverrideWithZoneId, where GetParam() = 336-byte object <21-00 00-00 00-00 00-00 60-8E 95-55 55-55 00-00 3C-00 00-00 00-00 00-00 88-8E 95-55 55-55 00-00 B0-F2 AF-55 55-55 00-00 05-00 00-00 00-00 00-00 68-74 74-70 73-00 00-00 00-00 00-00 00-00 00-00 ... A0-F3 AF-55 55-55 00-00 00-00 00-00 00-00 00-00 00-72 61-67 00-55 00-00 00-00 00-00 00-00 00-00 C0-3B B1-55 55-55 00-00 15-00 00-00 00-00 00-00 15-00 00-00 00-00 00-00 69-64 65-00 55-55 00-00>
 5 FAILED TESTS
  YOU HAVE 1 DISABLED TEST

nix-util-tests-run:
[  FAILED  ] 5 tests, listed below:
[  FAILED  ] ParseURLSuccessCases/ParseURLSuccess.parsesAsExpected/5, where GetParam() = 288-byte object <31-00 00-00 00-00 00-00 A8-86 95-55 55-55 00-00 B0-C7 B0-55 55-55 00-00 04-00 00-00 00-00 00-00 68-74 74-70 00-68 74-74 70-73 00-00 00-00 00-00 02-00 00-00 00-00 00-00 00-56 B0-55 55-55 00-00 ... 00-00 00-00 00-00 00-00 68-C8 B0-55 55-55 00-00 68-C8 B0-55 55-55 00-00 00-00 00-00 00-00 00-00 A0-C8 B0-55 55-55 00-00 00-00 00-00 00-00 00-00 00-65 6C-6C 6F-00 00-00 98-C8 B0-55 55-55 00-00>
[  FAILED  ] ParseURLSuccessCases/ParseURLSuccess.toStringRoundTrips/5, where GetParam() = 288-byte object <31-00 00-00 00-00 00-00 A8-86 95-55 55-55 00-00 B0-C7 B0-55 55-55 00-00 04-00 00-00 00-00 00-00 68-74 74-70 00-68 74-74 70-73 00-00 00-00 00-00 02-00 00-00 00-00 00-00 F0-2F B1-55 55-55 00-00 ... 00-00 00-00 00-00 00-00 68-C8 B0-55 55-55 00-00 68-C8 B0-55 55-55 00-00 00-00 00-00 00-00 00-00 A0-C8 B0-55 55-55 00-00 00-00 00-00 00-00 00-00 00-65 6C-6C 6F-00 00-00 98-C8 B0-55 55-55 00-00>
[  FAILED  ] ParseURLSuccessCases/ParseURLSuccess.makeSureFixGitURLDoesNotModify/5, where GetParam() = 288-byte object <31-00 00-00 00-00 00-00 A8-86 95-55 55-55 00-00 B0-C7 B0-55 55-55 00-00 04-00 00-00 00-00 00-00 68-74 74-70 00-68 74-74 70-73 00-00 00-00 00-00 02-00 00-00 00-00 00-00 40-55 B1-55 55-55 00-00 ... 00-00 00-00 00-00 00-00 68-C8 B0-55 55-55 00-00 68-C8 B0-55 55-55 00-00 00-00 00-00 00-00 00-00 A0-C8 B0-55 55-55 00-00 00-00 00-00 00-00 00-00 00-65 6C-6C 6F-00 00-00 98-C8 B0-55 55-55 00-00>
[  FAILED  ] parseURLRelative/ParseURLRelativeTestSuite.resolve/resolvesRelativePathIpv6AddressWithZoneId, where GetParam() = 336-byte object <3F-00 00-00 00-00 00-00 18-90 95-55 55-55 00-00 10-00 00-00 00-00 00-00 68-34 94-55 55-55 00-00 B0-F2 AF-55 55-55 00-00 04-00 00-00 00-00 00-00 68-74 74-70 00-00 00-00 00-00 00-00 00-00 00-00 ... A0-F3 AF-55 55-55 00-00 00-00 00-00 00-00 00-00 00-F3 AF-55 55-55 00-00 00-00 00-00 00-00 00-00 90-74 B1-55 55-55 00-00 29-00 00-00 00-00 00-00 29-00 00-00 00-00 00-00 F0-F3 AF-55 55-55 00-00>
[  FAILED  ] parseURLRelative/ParseURLRelativeTestSuite.resolve/absOverrideWithZoneId, where GetParam() = 336-byte object <21-00 00-00 00-00 00-00 60-8E 95-55 55-55 00-00 3C-00 00-00 00-00 00-00 88-8E 95-55 55-55 00-00 B0-F2 AF-55 55-55 00-00 05-00 00-00 00-00 00-00 68-74 74-70 73-00 00-00 00-00 00-00 00-00 00-00 ... A0-F3 AF-55 55-55 00-00 00-00 00-00 00-00 00-00 00-72 61-67 00-55 00-00 00-00 00-00 00-00 00-00 C0-3B B1-55 55-55 00-00 15-00 00-00 00-00 00-00 15-00 00-00 00-00 00-00 69-64 65-00 55-55 00-00>
 5 FAILED TESTS
  YOU HAVE 1 DISABLED TEST

… and 1 more failed derivation
failed checks.x86_64-linux.home-manager-common 14s
nix-store-tests-run: [----------] 5 tests from S3ToHttpsConversionErrors/S3ToHttpsConversionErrorTest (0 ms total) [----------] Global test environment tear-dow …
nix-store-tests-run:
[----------] 5 tests from S3ToHttpsConversionErrors/S3ToHttpsConversionErrorTest (0 ms total)
[----------] Global test environment tear-down
[==========] 798 tests from 90 test suites ran. (1412 ms total)
[  PASSED  ] 797 tests.
[  FAILED  ] 1 test, listed below:
[  FAILED  ] StoreReferenceTest.PathInfo_ssh_unbracketed_ipv6_5_from_uri
 1 FAILED TEST
  YOU HAVE 1 DISABLED TEST

nix-util-tests-run-without-new-syscalls:
[  FAILED  ] 5 tests, listed below:
[  FAILED  ] ParseURLSuccessCases/ParseURLSuccess.parsesAsExpected/5, where GetParam() = 288-byte object <31-00 00-00 00-00 00-00 A8-86 95-55 55-55 00-00 B0-C7 B0-55 55-55 00-00 04-00 00-00 00-00 00-00 68-74 74-70 00-68 74-74 70-73 00-00 00-00 00-00 02-00 00-00 00-00 00-00 00-56 B0-55 55-55 00-00 ... 00-00 00-00 00-00 00-00 68-C8 B0-55 55-55 00-00 68-C8 B0-55 55-55 00-00 00-00 00-00 00-00 00-00 A0-C8 B0-55 55-55 00-00 00-00 00-00 00-00 00-00 00-65 6C-6C 6F-00 00-00 98-C8 B0-55 55-55 00-00>
[  FAILED  ] ParseURLSuccessCases/ParseURLSuccess.toStringRoundTrips/5, where GetParam() = 288-byte object <31-00 00-00 00-00 00-00 A8-86 95-55 55-55 00-00 B0-C7 B0-55 55-55 00-00 04-00 00-00 00-00 00-00 68-74 74-70 00-68 74-74 70-73 00-00 00-00 00-00 02-00 00-00 00-00 00-00 F0-2F B1-55 55-55 00-00 ... 00-00 00-00 00-00 00-00 68-C8 B0-55 55-55 00-00 68-C8 B0-55 55-55 00-00 00-00 00-00 00-00 00-00 A0-C8 B0-55 55-55 00-00 00-00 00-00 00-00 00-00 00-65 6C-6C 6F-00 00-00 98-C8 B0-55 55-55 00-00>
[  FAILED  ] ParseURLSuccessCases/ParseURLSuccess.makeSureFixGitURLDoesNotModify/5, where GetParam() = 288-byte object <31-00 00-00 00-00 00-00 A8-86 95-55 55-55 00-00 B0-C7 B0-55 55-55 00-00 04-00 00-00 00-00 00-00 68-74 74-70 00-68 74-74 70-73 00-00 00-00 00-00 02-00 00-00 00-00 00-00 40-55 B1-55 55-55 00-00 ... 00-00 00-00 00-00 00-00 68-C8 B0-55 55-55 00-00 68-C8 B0-55 55-55 00-00 00-00 00-00 00-00 00-00 A0-C8 B0-55 55-55 00-00 00-00 00-00 00-00 00-00 00-65 6C-6C 6F-00 00-00 98-C8 B0-55 55-55 00-00>
[  FAILED  ] parseURLRelative/ParseURLRelativeTestSuite.resolve/resolvesRelativePathIpv6AddressWithZoneId, where GetParam() = 336-byte object <3F-00 00-00 00-00 00-00 18-90 95-55 55-55 00-00 10-00 00-00 00-00 00-00 68-34 94-55 55-55 00-00 B0-F2 AF-55 55-55 00-00 04-00 00-00 00-00 00-00 68-74 74-70 00-00 00-00 00-00 00-00 00-00 00-00 ... A0-F3 AF-55 55-55 00-00 00-00 00-00 00-00 00-00 00-F3 AF-55 55-55 00-00 00-00 00-00 00-00 00-00 90-74 B1-55 55-55 00-00 29-00 00-00 00-00 00-00 29-00 00-00 00-00 00-00 F0-F3 AF-55 55-55 00-00>
[  FAILED  ] parseURLRelative/ParseURLRelativeTestSuite.resolve/absOverrideWithZoneId, where GetParam() = 336-byte object <21-00 00-00 00-00 00-00 60-8E 95-55 55-55 00-00 3C-00 00-00 00-00 00-00 88-8E 95-55 55-55 00-00 B0-F2 AF-55 55-55 00-00 05-00 00-00 00-00 00-00 68-74 74-70 73-00 00-00 00-00 00-00 00-00 00-00 ... A0-F3 AF-55 55-55 00-00 00-00 00-00 00-00 00-00 00-72 61-67 00-55 00-00 00-00 00-00 00-00 00-00 C0-3B B1-55 55-55 00-00 15-00 00-00 00-00 00-00 15-00 00-00 00-00 00-00 69-64 65-00 55-55 00-00>
 5 FAILED TESTS
  YOU HAVE 1 DISABLED TEST

nix-util-tests-run:
[  FAILED  ] 5 tests, listed below:
[  FAILED  ] ParseURLSuccessCases/ParseURLSuccess.parsesAsExpected/5, where GetParam() = 288-byte object <31-00 00-00 00-00 00-00 A8-86 95-55 55-55 00-00 B0-C7 B0-55 55-55 00-00 04-00 00-00 00-00 00-00 68-74 74-70 00-68 74-74 70-73 00-00 00-00 00-00 02-00 00-00 00-00 00-00 00-56 B0-55 55-55 00-00 ... 00-00 00-00 00-00 00-00 68-C8 B0-55 55-55 00-00 68-C8 B0-55 55-55 00-00 00-00 00-00 00-00 00-00 A0-C8 B0-55 55-55 00-00 00-00 00-00 00-00 00-00 00-65 6C-6C 6F-00 00-00 98-C8 B0-55 55-55 00-00>
[  FAILED  ] ParseURLSuccessCases/ParseURLSuccess.toStringRoundTrips/5, where GetParam() = 288-byte object <31-00 00-00 00-00 00-00 A8-86 95-55 55-55 00-00 B0-C7 B0-55 55-55 00-00 04-00 00-00 00-00 00-00 68-74 74-70 00-68 74-74 70-73 00-00 00-00 00-00 02-00 00-00 00-00 00-00 F0-2F B1-55 55-55 00-00 ... 00-00 00-00 00-00 00-00 68-C8 B0-55 55-55 00-00 68-C8 B0-55 55-55 00-00 00-00 00-00 00-00 00-00 A0-C8 B0-55 55-55 00-00 00-00 00-00 00-00 00-00 00-65 6C-6C 6F-00 00-00 98-C8 B0-55 55-55 00-00>
[  FAILED  ] ParseURLSuccessCases/ParseURLSuccess.makeSureFixGitURLDoesNotModify/5, where GetParam() = 288-byte object <31-00 00-00 00-00 00-00 A8-86 95-55 55-55 00-00 B0-C7 B0-55 55-55 00-00 04-00 00-00 00-00 00-00 68-74 74-70 00-68 74-74 70-73 00-00 00-00 00-00 02-00 00-00 00-00 00-00 40-55 B1-55 55-55 00-00 ... 00-00 00-00 00-00 00-00 68-C8 B0-55 55-55 00-00 68-C8 B0-55 55-55 00-00 00-00 00-00 00-00 00-00 A0-C8 B0-55 55-55 00-00 00-00 00-00 00-00 00-00 00-65 6C-6C 6F-00 00-00 98-C8 B0-55 55-55 00-00>
[  FAILED  ] parseURLRelative/ParseURLRelativeTestSuite.resolve/resolvesRelativePathIpv6AddressWithZoneId, where GetParam() = 336-byte object <3F-00 00-00 00-00 00-00 18-90 95-55 55-55 00-00 10-00 00-00 00-00 00-00 68-34 94-55 55-55 00-00 B0-F2 AF-55 55-55 00-00 04-00 00-00 00-00 00-00 68-74 74-70 00-00 00-00 00-00 00-00 00-00 00-00 ... A0-F3 AF-55 55-55 00-00 00-00 00-00 00-00 00-00 00-F3 AF-55 55-55 00-00 00-00 00-00 00-00 00-00 90-74 B1-55 55-55 00-00 29-00 00-00 00-00 00-00 29-00 00-00 00-00 00-00 F0-F3 AF-55 55-55 00-00>
[  FAILED  ] parseURLRelative/ParseURLRelativeTestSuite.resolve/absOverrideWithZoneId, where GetParam() = 336-byte object <21-00 00-00 00-00 00-00 60-8E 95-55 55-55 00-00 3C-00 00-00 00-00 00-00 88-8E 95-55 55-55 00-00 B0-F2 AF-55 55-55 00-00 05-00 00-00 00-00 00-00 68-74 74-70 73-00 00-00 00-00 00-00 00-00 00-00 ... A0-F3 AF-55 55-55 00-00 00-00 00-00 00-00 00-00 00-72 61-67 00-55 00-00 00-00 00-00 00-00 00-00 C0-3B B1-55 55-55 00-00 15-00 00-00 00-00 00-00 15-00 00-00 00-00 00-00 69-64 65-00 55-55 00-00>
 5 FAILED TESTS
  YOU HAVE 1 DISABLED TEST
failed checks.x86_64-linux.home-manager-desktop 2m 41s
nix-util-tests-run-without-new-syscalls: [ FAILED ] 5 tests, listed below: [ FAILED ] ParseURLSuccessCases/ParseURLSuccess.parsesAsExpected/5, where GetPara …
nix-util-tests-run-without-new-syscalls:
[  FAILED  ] 5 tests, listed below:
[  FAILED  ] ParseURLSuccessCases/ParseURLSuccess.parsesAsExpected/5, where GetParam() = 288-byte object <31-00 00-00 00-00 00-00 A8-86 95-55 55-55 00-00 B0-C7 B0-55 55-55 00-00 04-00 00-00 00-00 00-00 68-74 74-70 00-68 74-74 70-73 00-00 00-00 00-00 02-00 00-00 00-00 00-00 00-56 B0-55 55-55 00-00 ... 00-00 00-00 00-00 00-00 68-C8 B0-55 55-55 00-00 68-C8 B0-55 55-55 00-00 00-00 00-00 00-00 00-00 A0-C8 B0-55 55-55 00-00 00-00 00-00 00-00 00-00 00-65 6C-6C 6F-00 00-00 98-C8 B0-55 55-55 00-00>
[  FAILED  ] ParseURLSuccessCases/ParseURLSuccess.toStringRoundTrips/5, where GetParam() = 288-byte object <31-00 00-00 00-00 00-00 A8-86 95-55 55-55 00-00 B0-C7 B0-55 55-55 00-00 04-00 00-00 00-00 00-00 68-74 74-70 00-68 74-74 70-73 00-00 00-00 00-00 02-00 00-00 00-00 00-00 F0-2F B1-55 55-55 00-00 ... 00-00 00-00 00-00 00-00 68-C8 B0-55 55-55 00-00 68-C8 B0-55 55-55 00-00 00-00 00-00 00-00 00-00 A0-C8 B0-55 55-55 00-00 00-00 00-00 00-00 00-00 00-65 6C-6C 6F-00 00-00 98-C8 B0-55 55-55 00-00>
[  FAILED  ] ParseURLSuccessCases/ParseURLSuccess.makeSureFixGitURLDoesNotModify/5, where GetParam() = 288-byte object <31-00 00-00 00-00 00-00 A8-86 95-55 55-55 00-00 B0-C7 B0-55 55-55 00-00 04-00 00-00 00-00 00-00 68-74 74-70 00-68 74-74 70-73 00-00 00-00 00-00 02-00 00-00 00-00 00-00 40-55 B1-55 55-55 00-00 ... 00-00 00-00 00-00 00-00 68-C8 B0-55 55-55 00-00 68-C8 B0-55 55-55 00-00 00-00 00-00 00-00 00-00 A0-C8 B0-55 55-55 00-00 00-00 00-00 00-00 00-00 00-65 6C-6C 6F-00 00-00 98-C8 B0-55 55-55 00-00>
[  FAILED  ] parseURLRelative/ParseURLRelativeTestSuite.resolve/resolvesRelativePathIpv6AddressWithZoneId, where GetParam() = 336-byte object <3F-00 00-00 00-00 00-00 18-90 95-55 55-55 00-00 10-00 00-00 00-00 00-00 68-34 94-55 55-55 00-00 B0-F2 AF-55 55-55 00-00 04-00 00-00 00-00 00-00 68-74 74-70 00-00 00-00 00-00 00-00 00-00 00-00 ... A0-F3 AF-55 55-55 00-00 00-00 00-00 00-00 00-00 00-F3 AF-55 55-55 00-00 00-00 00-00 00-00 00-00 90-74 B1-55 55-55 00-00 29-00 00-00 00-00 00-00 29-00 00-00 00-00 00-00 F0-F3 AF-55 55-55 00-00>
[  FAILED  ] parseURLRelative/ParseURLRelativeTestSuite.resolve/absOverrideWithZoneId, where GetParam() = 336-byte object <21-00 00-00 00-00 00-00 60-8E 95-55 55-55 00-00 3C-00 00-00 00-00 00-00 88-8E 95-55 55-55 00-00 B0-F2 AF-55 55-55 00-00 05-00 00-00 00-00 00-00 68-74 74-70 73-00 00-00 00-00 00-00 00-00 00-00 ... A0-F3 AF-55 55-55 00-00 00-00 00-00 00-00 00-00 00-72 61-67 00-55 00-00 00-00 00-00 00-00 00-00 C0-3B B1-55 55-55 00-00 15-00 00-00 00-00 00-00 15-00 00-00 00-00 00-00 69-64 65-00 55-55 00-00>
 5 FAILED TESTS
  YOU HAVE 1 DISABLED TEST

nix-util-tests-run:
[  FAILED  ] 5 tests, listed below:
[  FAILED  ] ParseURLSuccessCases/ParseURLSuccess.parsesAsExpected/5, where GetParam() = 288-byte object <31-00 00-00 00-00 00-00 A8-86 95-55 55-55 00-00 B0-C7 B0-55 55-55 00-00 04-00 00-00 00-00 00-00 68-74 74-70 00-68 74-74 70-73 00-00 00-00 00-00 02-00 00-00 00-00 00-00 00-56 B0-55 55-55 00-00 ... 00-00 00-00 00-00 00-00 68-C8 B0-55 55-55 00-00 68-C8 B0-55 55-55 00-00 00-00 00-00 00-00 00-00 A0-C8 B0-55 55-55 00-00 00-00 00-00 00-00 00-00 00-65 6C-6C 6F-00 00-00 98-C8 B0-55 55-55 00-00>
[  FAILED  ] ParseURLSuccessCases/ParseURLSuccess.toStringRoundTrips/5, where GetParam() = 288-byte object <31-00 00-00 00-00 00-00 A8-86 95-55 55-55 00-00 B0-C7 B0-55 55-55 00-00 04-00 00-00 00-00 00-00 68-74 74-70 00-68 74-74 70-73 00-00 00-00 00-00 02-00 00-00 00-00 00-00 F0-2F B1-55 55-55 00-00 ... 00-00 00-00 00-00 00-00 68-C8 B0-55 55-55 00-00 68-C8 B0-55 55-55 00-00 00-00 00-00 00-00 00-00 A0-C8 B0-55 55-55 00-00 00-00 00-00 00-00 00-00 00-65 6C-6C 6F-00 00-00 98-C8 B0-55 55-55 00-00>
[  FAILED  ] ParseURLSuccessCases/ParseURLSuccess.makeSureFixGitURLDoesNotModify/5, where GetParam() = 288-byte object <31-00 00-00 00-00 00-00 A8-86 95-55 55-55 00-00 B0-C7 B0-55 55-55 00-00 04-00 00-00 00-00 00-00 68-74 74-70 00-68 74-74 70-73 00-00 00-00 00-00 02-00 00-00 00-00 00-00 40-55 B1-55 55-55 00-00 ... 00-00 00-00 00-00 00-00 68-C8 B0-55 55-55 00-00 68-C8 B0-55 55-55 00-00 00-00 00-00 00-00 00-00 A0-C8 B0-55 55-55 00-00 00-00 00-00 00-00 00-00 00-65 6C-6C 6F-00 00-00 98-C8 B0-55 55-55 00-00>
[  FAILED  ] parseURLRelative/ParseURLRelativeTestSuite.resolve/resolvesRelativePathIpv6AddressWithZoneId, where GetParam() = 336-byte object <3F-00 00-00 00-00 00-00 18-90 95-55 55-55 00-00 10-00 00-00 00-00 00-00 68-34 94-55 55-55 00-00 B0-F2 AF-55 55-55 00-00 04-00 00-00 00-00 00-00 68-74 74-70 00-00 00-00 00-00 00-00 00-00 00-00 ... A0-F3 AF-55 55-55 00-00 00-00 00-00 00-00 00-00 00-F3 AF-55 55-55 00-00 00-00 00-00 00-00 00-00 90-74 B1-55 55-55 00-00 29-00 00-00 00-00 00-00 29-00 00-00 00-00 00-00 F0-F3 AF-55 55-55 00-00>
[  FAILED  ] parseURLRelative/ParseURLRelativeTestSuite.resolve/absOverrideWithZoneId, where GetParam() = 336-byte object <21-00 00-00 00-00 00-00 60-8E 95-55 55-55 00-00 3C-00 00-00 00-00 00-00 88-8E 95-55 55-55 00-00 B0-F2 AF-55 55-55 00-00 05-00 00-00 00-00 00-00 68-74 74-70 73-00 00-00 00-00 00-00 00-00 00-00 ... A0-F3 AF-55 55-55 00-00 00-00 00-00 00-00 00-00 00-72 61-67 00-55 00-00 00-00 00-00 00-00 00-00 C0-3B B1-55 55-55 00-00 15-00 00-00 00-00 00-00 15-00 00-00 00-00 00-00 69-64 65-00 55-55 00-00>
 5 FAILED TESTS
  YOU HAVE 1 DISABLED TEST

nix-store-tests-run:
[----------] 5 tests from S3ToHttpsConversionErrors/S3ToHttpsConversionErrorTest (0 ms total)
[----------] Global test environment tear-down
[==========] 798 tests from 90 test suites ran. (1464 ms total)
[  PASSED  ] 797 tests.
[  FAILED  ] 1 test, listed below:
[  FAILED  ] StoreReferenceTest.PathInfo_ssh_unbracketed_ipv6_5_from_uri
 1 FAILED TEST
  YOU HAVE 1 DISABLED TEST

… and 1 more failed derivation
failed checks.x86_64-linux.home-manager-eve 2m 41s
nix-store-tests-run: [----------] 5 tests from S3ToHttpsConversionErrors/S3ToHttpsConversionErrorTest (0 ms total) [----------] Global test environment tear-dow …
nix-store-tests-run:
[----------] 5 tests from S3ToHttpsConversionErrors/S3ToHttpsConversionErrorTest (0 ms total)
[----------] Global test environment tear-down
[==========] 798 tests from 90 test suites ran. (1442 ms total)
[  PASSED  ] 797 tests.
[  FAILED  ] 1 test, listed below:
[  FAILED  ] StoreReferenceTest.PathInfo_ssh_unbracketed_ipv6_5_from_uri
 1 FAILED TEST
  YOU HAVE 1 DISABLED TEST

nix-util-tests-run-without-new-syscalls:
[  FAILED  ] 5 tests, listed below:
[  FAILED  ] ParseURLSuccessCases/ParseURLSuccess.parsesAsExpected/5, where GetParam() = 288-byte object <31-00 00-00 00-00 00-00 A8-86 95-55 55-55 00-00 B0-C7 B0-55 55-55 00-00 04-00 00-00 00-00 00-00 68-74 74-70 00-68 74-74 70-73 00-00 00-00 00-00 02-00 00-00 00-00 00-00 00-56 B0-55 55-55 00-00 ... 00-00 00-00 00-00 00-00 68-C8 B0-55 55-55 00-00 68-C8 B0-55 55-55 00-00 00-00 00-00 00-00 00-00 A0-C8 B0-55 55-55 00-00 00-00 00-00 00-00 00-00 00-65 6C-6C 6F-00 00-00 98-C8 B0-55 55-55 00-00>
[  FAILED  ] ParseURLSuccessCases/ParseURLSuccess.toStringRoundTrips/5, where GetParam() = 288-byte object <31-00 00-00 00-00 00-00 A8-86 95-55 55-55 00-00 B0-C7 B0-55 55-55 00-00 04-00 00-00 00-00 00-00 68-74 74-70 00-68 74-74 70-73 00-00 00-00 00-00 02-00 00-00 00-00 00-00 F0-2F B1-55 55-55 00-00 ... 00-00 00-00 00-00 00-00 68-C8 B0-55 55-55 00-00 68-C8 B0-55 55-55 00-00 00-00 00-00 00-00 00-00 A0-C8 B0-55 55-55 00-00 00-00 00-00 00-00 00-00 00-65 6C-6C 6F-00 00-00 98-C8 B0-55 55-55 00-00>
[  FAILED  ] ParseURLSuccessCases/ParseURLSuccess.makeSureFixGitURLDoesNotModify/5, where GetParam() = 288-byte object <31-00 00-00 00-00 00-00 A8-86 95-55 55-55 00-00 B0-C7 B0-55 55-55 00-00 04-00 00-00 00-00 00-00 68-74 74-70 00-68 74-74 70-73 00-00 00-00 00-00 02-00 00-00 00-00 00-00 40-55 B1-55 55-55 00-00 ... 00-00 00-00 00-00 00-00 68-C8 B0-55 55-55 00-00 68-C8 B0-55 55-55 00-00 00-00 00-00 00-00 00-00 A0-C8 B0-55 55-55 00-00 00-00 00-00 00-00 00-00 00-65 6C-6C 6F-00 00-00 98-C8 B0-55 55-55 00-00>
[  FAILED  ] parseURLRelative/ParseURLRelativeTestSuite.resolve/resolvesRelativePathIpv6AddressWithZoneId, where GetParam() = 336-byte object <3F-00 00-00 00-00 00-00 18-90 95-55 55-55 00-00 10-00 00-00 00-00 00-00 68-34 94-55 55-55 00-00 B0-F2 AF-55 55-55 00-00 04-00 00-00 00-00 00-00 68-74 74-70 00-00 00-00 00-00 00-00 00-00 00-00 ... A0-F3 AF-55 55-55 00-00 00-00 00-00 00-00 00-00 00-F3 AF-55 55-55 00-00 00-00 00-00 00-00 00-00 90-74 B1-55 55-55 00-00 29-00 00-00 00-00 00-00 29-00 00-00 00-00 00-00 F0-F3 AF-55 55-55 00-00>
[  FAILED  ] parseURLRelative/ParseURLRelativeTestSuite.resolve/absOverrideWithZoneId, where GetParam() = 336-byte object <21-00 00-00 00-00 00-00 60-8E 95-55 55-55 00-00 3C-00 00-00 00-00 00-00 88-8E 95-55 55-55 00-00 B0-F2 AF-55 55-55 00-00 05-00 00-00 00-00 00-00 68-74 74-70 73-00 00-00 00-00 00-00 00-00 00-00 ... A0-F3 AF-55 55-55 00-00 00-00 00-00 00-00 00-00 00-72 61-67 00-55 00-00 00-00 00-00 00-00 00-00 C0-3B B1-55 55-55 00-00 15-00 00-00 00-00 00-00 15-00 00-00 00-00 00-00 69-64 65-00 55-55 00-00>
 5 FAILED TESTS
  YOU HAVE 1 DISABLED TEST

nix-util-tests-run:
[  FAILED  ] 5 tests, listed below:
[  FAILED  ] ParseURLSuccessCases/ParseURLSuccess.parsesAsExpected/5, where GetParam() = 288-byte object <31-00 00-00 00-00 00-00 A8-86 95-55 55-55 00-00 B0-C7 B0-55 55-55 00-00 04-00 00-00 00-00 00-00 68-74 74-70 00-68 74-74 70-73 00-00 00-00 00-00 02-00 00-00 00-00 00-00 00-56 B0-55 55-55 00-00 ... 00-00 00-00 00-00 00-00 68-C8 B0-55 55-55 00-00 68-C8 B0-55 55-55 00-00 00-00 00-00 00-00 00-00 A0-C8 B0-55 55-55 00-00 00-00 00-00 00-00 00-00 00-65 6C-6C 6F-00 00-00 98-C8 B0-55 55-55 00-00>
[  FAILED  ] ParseURLSuccessCases/ParseURLSuccess.toStringRoundTrips/5, where GetParam() = 288-byte object <31-00 00-00 00-00 00-00 A8-86 95-55 55-55 00-00 B0-C7 B0-55 55-55 00-00 04-00 00-00 00-00 00-00 68-74 74-70 00-68 74-74 70-73 00-00 00-00 00-00 02-00 00-00 00-00 00-00 F0-2F B1-55 55-55 00-00 ... 00-00 00-00 00-00 00-00 68-C8 B0-55 55-55 00-00 68-C8 B0-55 55-55 00-00 00-00 00-00 00-00 00-00 A0-C8 B0-55 55-55 00-00 00-00 00-00 00-00 00-00 00-65 6C-6C 6F-00 00-00 98-C8 B0-55 55-55 00-00>
[  FAILED  ] ParseURLSuccessCases/ParseURLSuccess.makeSureFixGitURLDoesNotModify/5, where GetParam() = 288-byte object <31-00 00-00 00-00 00-00 A8-86 95-55 55-55 00-00 B0-C7 B0-55 55-55 00-00 04-00 00-00 00-00 00-00 68-74 74-70 00-68 74-74 70-73 00-00 00-00 00-00 02-00 00-00 00-00 00-00 40-55 B1-55 55-55 00-00 ... 00-00 00-00 00-00 00-00 68-C8 B0-55 55-55 00-00 68-C8 B0-55 55-55 00-00 00-00 00-00 00-00 00-00 A0-C8 B0-55 55-55 00-00 00-00 00-00 00-00 00-00 00-65 6C-6C 6F-00 00-00 98-C8 B0-55 55-55 00-00>
[  FAILED  ] parseURLRelative/ParseURLRelativeTestSuite.resolve/resolvesRelativePathIpv6AddressWithZoneId, where GetParam() = 336-byte object <3F-00 00-00 00-00 00-00 18-90 95-55 55-55 00-00 10-00 00-00 00-00 00-00 68-34 94-55 55-55 00-00 B0-F2 AF-55 55-55 00-00 04-00 00-00 00-00 00-00 68-74 74-70 00-00 00-00 00-00 00-00 00-00 00-00 ... A0-F3 AF-55 55-55 00-00 00-00 00-00 00-00 00-00 00-F3 AF-55 55-55 00-00 00-00 00-00 00-00 00-00 90-74 B1-55 55-55 00-00 29-00 00-00 00-00 00-00 29-00 00-00 00-00 00-00 F0-F3 AF-55 55-55 00-00>
[  FAILED  ] parseURLRelative/ParseURLRelativeTestSuite.resolve/absOverrideWithZoneId, where GetParam() = 336-byte object <21-00 00-00 00-00 00-00 60-8E 95-55 55-55 00-00 3C-00 00-00 00-00 00-00 88-8E 95-55 55-55 00-00 B0-F2 AF-55 55-55 00-00 05-00 00-00 00-00 00-00 68-74 74-70 73-00 00-00 00-00 00-00 00-00 00-00 ... A0-F3 AF-55 55-55 00-00 00-00 00-00 00-00 00-00 00-72 61-67 00-55 00-00 00-00 00-00 00-00 00-00 C0-3B B1-55 55-55 00-00 15-00 00-00 00-00 00-00 15-00 00-00 00-00 00-00 69-64 65-00 55-55 00-00>
 5 FAILED TESTS
  YOU HAVE 1 DISABLED TEST

… and 1 more failed derivation
failed checks.x86_64-linux.home-manager-mic92 20s
nix-util-tests-run-without-new-syscalls: [ FAILED ] 5 tests, listed below: [ FAILED ] ParseURLSuccessCases/ParseURLSuccess.parsesAsExpected/5, where GetPara …
nix-util-tests-run-without-new-syscalls:
[  FAILED  ] 5 tests, listed below:
[  FAILED  ] ParseURLSuccessCases/ParseURLSuccess.parsesAsExpected/5, where GetParam() = 288-byte object <31-00 00-00 00-00 00-00 A8-86 95-55 55-55 00-00 B0-C7 B0-55 55-55 00-00 04-00 00-00 00-00 00-00 68-74 74-70 00-68 74-74 70-73 00-00 00-00 00-00 02-00 00-00 00-00 00-00 00-56 B0-55 55-55 00-00 ... 00-00 00-00 00-00 00-00 68-C8 B0-55 55-55 00-00 68-C8 B0-55 55-55 00-00 00-00 00-00 00-00 00-00 A0-C8 B0-55 55-55 00-00 00-00 00-00 00-00 00-00 00-65 6C-6C 6F-00 00-00 98-C8 B0-55 55-55 00-00>
[  FAILED  ] ParseURLSuccessCases/ParseURLSuccess.toStringRoundTrips/5, where GetParam() = 288-byte object <31-00 00-00 00-00 00-00 A8-86 95-55 55-55 00-00 B0-C7 B0-55 55-55 00-00 04-00 00-00 00-00 00-00 68-74 74-70 00-68 74-74 70-73 00-00 00-00 00-00 02-00 00-00 00-00 00-00 F0-2F B1-55 55-55 00-00 ... 00-00 00-00 00-00 00-00 68-C8 B0-55 55-55 00-00 68-C8 B0-55 55-55 00-00 00-00 00-00 00-00 00-00 A0-C8 B0-55 55-55 00-00 00-00 00-00 00-00 00-00 00-65 6C-6C 6F-00 00-00 98-C8 B0-55 55-55 00-00>
[  FAILED  ] ParseURLSuccessCases/ParseURLSuccess.makeSureFixGitURLDoesNotModify/5, where GetParam() = 288-byte object <31-00 00-00 00-00 00-00 A8-86 95-55 55-55 00-00 B0-C7 B0-55 55-55 00-00 04-00 00-00 00-00 00-00 68-74 74-70 00-68 74-74 70-73 00-00 00-00 00-00 02-00 00-00 00-00 00-00 40-55 B1-55 55-55 00-00 ... 00-00 00-00 00-00 00-00 68-C8 B0-55 55-55 00-00 68-C8 B0-55 55-55 00-00 00-00 00-00 00-00 00-00 A0-C8 B0-55 55-55 00-00 00-00 00-00 00-00 00-00 00-65 6C-6C 6F-00 00-00 98-C8 B0-55 55-55 00-00>
[  FAILED  ] parseURLRelative/ParseURLRelativeTestSuite.resolve/resolvesRelativePathIpv6AddressWithZoneId, where GetParam() = 336-byte object <3F-00 00-00 00-00 00-00 18-90 95-55 55-55 00-00 10-00 00-00 00-00 00-00 68-34 94-55 55-55 00-00 B0-F2 AF-55 55-55 00-00 04-00 00-00 00-00 00-00 68-74 74-70 00-00 00-00 00-00 00-00 00-00 00-00 ... A0-F3 AF-55 55-55 00-00 00-00 00-00 00-00 00-00 00-F3 AF-55 55-55 00-00 00-00 00-00 00-00 00-00 90-74 B1-55 55-55 00-00 29-00 00-00 00-00 00-00 29-00 00-00 00-00 00-00 F0-F3 AF-55 55-55 00-00>
[  FAILED  ] parseURLRelative/ParseURLRelativeTestSuite.resolve/absOverrideWithZoneId, where GetParam() = 336-byte object <21-00 00-00 00-00 00-00 60-8E 95-55 55-55 00-00 3C-00 00-00 00-00 00-00 88-8E 95-55 55-55 00-00 B0-F2 AF-55 55-55 00-00 05-00 00-00 00-00 00-00 68-74 74-70 73-00 00-00 00-00 00-00 00-00 00-00 ... A0-F3 AF-55 55-55 00-00 00-00 00-00 00-00 00-00 00-72 61-67 00-55 00-00 00-00 00-00 00-00 00-00 C0-3B B1-55 55-55 00-00 15-00 00-00 00-00 00-00 15-00 00-00 00-00 00-00 69-64 65-00 55-55 00-00>
 5 FAILED TESTS
  YOU HAVE 1 DISABLED TEST

nix-store-tests-run:
[----------] 5 tests from S3ToHttpsConversionErrors/S3ToHttpsConversionErrorTest (0 ms total)
[----------] Global test environment tear-down
[==========] 798 tests from 90 test suites ran. (1526 ms total)
[  PASSED  ] 797 tests.
[  FAILED  ] 1 test, listed below:
[  FAILED  ] StoreReferenceTest.PathInfo_ssh_unbracketed_ipv6_5_from_uri
 1 FAILED TEST
  YOU HAVE 1 DISABLED TEST

nix-util-tests-run:
[  FAILED  ] 5 tests, listed below:
[  FAILED  ] ParseURLSuccessCases/ParseURLSuccess.parsesAsExpected/5, where GetParam() = 288-byte object <31-00 00-00 00-00 00-00 A8-86 95-55 55-55 00-00 B0-C7 B0-55 55-55 00-00 04-00 00-00 00-00 00-00 68-74 74-70 00-68 74-74 70-73 00-00 00-00 00-00 02-00 00-00 00-00 00-00 00-56 B0-55 55-55 00-00 ... 00-00 00-00 00-00 00-00 68-C8 B0-55 55-55 00-00 68-C8 B0-55 55-55 00-00 00-00 00-00 00-00 00-00 A0-C8 B0-55 55-55 00-00 00-00 00-00 00-00 00-00 00-65 6C-6C 6F-00 00-00 98-C8 B0-55 55-55 00-00>
[  FAILED  ] ParseURLSuccessCases/ParseURLSuccess.toStringRoundTrips/5, where GetParam() = 288-byte object <31-00 00-00 00-00 00-00 A8-86 95-55 55-55 00-00 B0-C7 B0-55 55-55 00-00 04-00 00-00 00-00 00-00 68-74 74-70 00-68 74-74 70-73 00-00 00-00 00-00 02-00 00-00 00-00 00-00 F0-2F B1-55 55-55 00-00 ... 00-00 00-00 00-00 00-00 68-C8 B0-55 55-55 00-00 68-C8 B0-55 55-55 00-00 00-00 00-00 00-00 00-00 A0-C8 B0-55 55-55 00-00 00-00 00-00 00-00 00-00 00-65 6C-6C 6F-00 00-00 98-C8 B0-55 55-55 00-00>
[  FAILED  ] ParseURLSuccessCases/ParseURLSuccess.makeSureFixGitURLDoesNotModify/5, where GetParam() = 288-byte object <31-00 00-00 00-00 00-00 A8-86 95-55 55-55 00-00 B0-C7 B0-55 55-55 00-00 04-00 00-00 00-00 00-00 68-74 74-70 00-68 74-74 70-73 00-00 00-00 00-00 02-00 00-00 00-00 00-00 40-55 B1-55 55-55 00-00 ... 00-00 00-00 00-00 00-00 68-C8 B0-55 55-55 00-00 68-C8 B0-55 55-55 00-00 00-00 00-00 00-00 00-00 A0-C8 B0-55 55-55 00-00 00-00 00-00 00-00 00-00 00-65 6C-6C 6F-00 00-00 98-C8 B0-55 55-55 00-00>
[  FAILED  ] parseURLRelative/ParseURLRelativeTestSuite.resolve/resolvesRelativePathIpv6AddressWithZoneId, where GetParam() = 336-byte object <3F-00 00-00 00-00 00-00 18-90 95-55 55-55 00-00 10-00 00-00 00-00 00-00 68-34 94-55 55-55 00-00 B0-F2 AF-55 55-55 00-00 04-00 00-00 00-00 00-00 68-74 74-70 00-00 00-00 00-00 00-00 00-00 00-00 ... A0-F3 AF-55 55-55 00-00 00-00 00-00 00-00 00-00 00-F3 AF-55 55-55 00-00 00-00 00-00 00-00 00-00 90-74 B1-55 55-55 00-00 29-00 00-00 00-00 00-00 29-00 00-00 00-00 00-00 F0-F3 AF-55 55-55 00-00>
[  FAILED  ] parseURLRelative/ParseURLRelativeTestSuite.resolve/absOverrideWithZoneId, where GetParam() = 336-byte object <21-00 00-00 00-00 00-00 60-8E 95-55 55-55 00-00 3C-00 00-00 00-00 00-00 88-8E 95-55 55-55 00-00 B0-F2 AF-55 55-55 00-00 05-00 00-00 00-00 00-00 68-74 74-70 73-00 00-00 00-00 00-00 00-00 00-00 ... A0-F3 AF-55 55-55 00-00 00-00 00-00 00-00 00-00 00-72 61-67 00-55 00-00 00-00 00-00 00-00 00-00 C0-3B B1-55 55-55 00-00 15-00 00-00 00-00 00-00 15-00 00-00 00-00 00-00 69-64 65-00 55-55 00-00>
 5 FAILED TESTS
  YOU HAVE 1 DISABLED TEST
failed checks.x86_64-linux.home-manager-utm-vm 2m 31s
nix-store-tests-run: [----------] 5 tests from S3ToHttpsConversionErrors/S3ToHttpsConversionErrorTest (0 ms total) [----------] Global test environment tear-dow …
nix-store-tests-run:
[----------] 5 tests from S3ToHttpsConversionErrors/S3ToHttpsConversionErrorTest (0 ms total)
[----------] Global test environment tear-down
[==========] 798 tests from 90 test suites ran. (1401 ms total)
[  PASSED  ] 797 tests.
[  FAILED  ] 1 test, listed below:
[  FAILED  ] StoreReferenceTest.PathInfo_ssh_unbracketed_ipv6_5_from_uri
 1 FAILED TEST
  YOU HAVE 1 DISABLED TEST

nix-util-tests-run-without-new-syscalls:
[  FAILED  ] 5 tests, listed below:
[  FAILED  ] ParseURLSuccessCases/ParseURLSuccess.parsesAsExpected/5, where GetParam() = 288-byte object <31-00 00-00 00-00 00-00 A8-86 95-55 55-55 00-00 B0-C7 B0-55 55-55 00-00 04-00 00-00 00-00 00-00 68-74 74-70 00-68 74-74 70-73 00-00 00-00 00-00 02-00 00-00 00-00 00-00 00-56 B0-55 55-55 00-00 ... 00-00 00-00 00-00 00-00 68-C8 B0-55 55-55 00-00 68-C8 B0-55 55-55 00-00 00-00 00-00 00-00 00-00 A0-C8 B0-55 55-55 00-00 00-00 00-00 00-00 00-00 00-65 6C-6C 6F-00 00-00 98-C8 B0-55 55-55 00-00>
[  FAILED  ] ParseURLSuccessCases/ParseURLSuccess.toStringRoundTrips/5, where GetParam() = 288-byte object <31-00 00-00 00-00 00-00 A8-86 95-55 55-55 00-00 B0-C7 B0-55 55-55 00-00 04-00 00-00 00-00 00-00 68-74 74-70 00-68 74-74 70-73 00-00 00-00 00-00 02-00 00-00 00-00 00-00 F0-2F B1-55 55-55 00-00 ... 00-00 00-00 00-00 00-00 68-C8 B0-55 55-55 00-00 68-C8 B0-55 55-55 00-00 00-00 00-00 00-00 00-00 A0-C8 B0-55 55-55 00-00 00-00 00-00 00-00 00-00 00-65 6C-6C 6F-00 00-00 98-C8 B0-55 55-55 00-00>
[  FAILED  ] ParseURLSuccessCases/ParseURLSuccess.makeSureFixGitURLDoesNotModify/5, where GetParam() = 288-byte object <31-00 00-00 00-00 00-00 A8-86 95-55 55-55 00-00 B0-C7 B0-55 55-55 00-00 04-00 00-00 00-00 00-00 68-74 74-70 00-68 74-74 70-73 00-00 00-00 00-00 02-00 00-00 00-00 00-00 40-55 B1-55 55-55 00-00 ... 00-00 00-00 00-00 00-00 68-C8 B0-55 55-55 00-00 68-C8 B0-55 55-55 00-00 00-00 00-00 00-00 00-00 A0-C8 B0-55 55-55 00-00 00-00 00-00 00-00 00-00 00-65 6C-6C 6F-00 00-00 98-C8 B0-55 55-55 00-00>
[  FAILED  ] parseURLRelative/ParseURLRelativeTestSuite.resolve/resolvesRelativePathIpv6AddressWithZoneId, where GetParam() = 336-byte object <3F-00 00-00 00-00 00-00 18-90 95-55 55-55 00-00 10-00 00-00 00-00 00-00 68-34 94-55 55-55 00-00 B0-F2 AF-55 55-55 00-00 04-00 00-00 00-00 00-00 68-74 74-70 00-00 00-00 00-00 00-00 00-00 00-00 ... A0-F3 AF-55 55-55 00-00 00-00 00-00 00-00 00-00 00-F3 AF-55 55-55 00-00 00-00 00-00 00-00 00-00 90-74 B1-55 55-55 00-00 29-00 00-00 00-00 00-00 29-00 00-00 00-00 00-00 F0-F3 AF-55 55-55 00-00>
[  FAILED  ] parseURLRelative/ParseURLRelativeTestSuite.resolve/absOverrideWithZoneId, where GetParam() = 336-byte object <21-00 00-00 00-00 00-00 60-8E 95-55 55-55 00-00 3C-00 00-00 00-00 00-00 88-8E 95-55 55-55 00-00 B0-F2 AF-55 55-55 00-00 05-00 00-00 00-00 00-00 68-74 74-70 73-00 00-00 00-00 00-00 00-00 00-00 ... A0-F3 AF-55 55-55 00-00 00-00 00-00 00-00 00-00 00-72 61-67 00-55 00-00 00-00 00-00 00-00 00-00 C0-3B B1-55 55-55 00-00 15-00 00-00 00-00 00-00 15-00 00-00 00-00 00-00 69-64 65-00 55-55 00-00>
 5 FAILED TESTS
  YOU HAVE 1 DISABLED TEST

nix-util-tests-run:
[  FAILED  ] 5 tests, listed below:
[  FAILED  ] ParseURLSuccessCases/ParseURLSuccess.parsesAsExpected/5, where GetParam() = 288-byte object <31-00 00-00 00-00 00-00 A8-86 95-55 55-55 00-00 B0-C7 B0-55 55-55 00-00 04-00 00-00 00-00 00-00 68-74 74-70 00-68 74-74 70-73 00-00 00-00 00-00 02-00 00-00 00-00 00-00 00-56 B0-55 55-55 00-00 ... 00-00 00-00 00-00 00-00 68-C8 B0-55 55-55 00-00 68-C8 B0-55 55-55 00-00 00-00 00-00 00-00 00-00 A0-C8 B0-55 55-55 00-00 00-00 00-00 00-00 00-00 00-65 6C-6C 6F-00 00-00 98-C8 B0-55 55-55 00-00>
[  FAILED  ] ParseURLSuccessCases/ParseURLSuccess.toStringRoundTrips/5, where GetParam() = 288-byte object <31-00 00-00 00-00 00-00 A8-86 95-55 55-55 00-00 B0-C7 B0-55 55-55 00-00 04-00 00-00 00-00 00-00 68-74 74-70 00-68 74-74 70-73 00-00 00-00 00-00 02-00 00-00 00-00 00-00 F0-2F B1-55 55-55 00-00 ... 00-00 00-00 00-00 00-00 68-C8 B0-55 55-55 00-00 68-C8 B0-55 55-55 00-00 00-00 00-00 00-00 00-00 A0-C8 B0-55 55-55 00-00 00-00 00-00 00-00 00-00 00-65 6C-6C 6F-00 00-00 98-C8 B0-55 55-55 00-00>
[  FAILED  ] ParseURLSuccessCases/ParseURLSuccess.makeSureFixGitURLDoesNotModify/5, where GetParam() = 288-byte object <31-00 00-00 00-00 00-00 A8-86 95-55 55-55 00-00 B0-C7 B0-55 55-55 00-00 04-00 00-00 00-00 00-00 68-74 74-70 00-68 74-74 70-73 00-00 00-00 00-00 02-00 00-00 00-00 00-00 40-55 B1-55 55-55 00-00 ... 00-00 00-00 00-00 00-00 68-C8 B0-55 55-55 00-00 68-C8 B0-55 55-55 00-00 00-00 00-00 00-00 00-00 A0-C8 B0-55 55-55 00-00 00-00 00-00 00-00 00-00 00-65 6C-6C 6F-00 00-00 98-C8 B0-55 55-55 00-00>
[  FAILED  ] parseURLRelative/ParseURLRelativeTestSuite.resolve/resolvesRelativePathIpv6AddressWithZoneId, where GetParam() = 336-byte object <3F-00 00-00 00-00 00-00 18-90 95-55 55-55 00-00 10-00 00-00 00-00 00-00 68-34 94-55 55-55 00-00 B0-F2 AF-55 55-55 00-00 04-00 00-00 00-00 00-00 68-74 74-70 00-00 00-00 00-00 00-00 00-00 00-00 ... A0-F3 AF-55 55-55 00-00 00-00 00-00 00-00 00-00 00-F3 AF-55 55-55 00-00 00-00 00-00 00-00 00-00 90-74 B1-55 55-55 00-00 29-00 00-00 00-00 00-00 29-00 00-00 00-00 00-00 F0-F3 AF-55 55-55 00-00>
[  FAILED  ] parseURLRelative/ParseURLRelativeTestSuite.resolve/absOverrideWithZoneId, where GetParam() = 336-byte object <21-00 00-00 00-00 00-00 60-8E 95-55 55-55 00-00 3C-00 00-00 00-00 00-00 88-8E 95-55 55-55 00-00 B0-F2 AF-55 55-55 00-00 05-00 00-00 00-00 00-00 68-74 74-70 73-00 00-00 00-00 00-00 00-00 00-00 ... A0-F3 AF-55 55-55 00-00 00-00 00-00 00-00 00-00 00-72 61-67 00-55 00-00 00-00 00-00 00-00 00-00 C0-3B B1-55 55-55 00-00 15-00 00-00 00-00 00-00 15-00 00-00 00-00 00-00 69-64 65-00 55-55 00-00>
 5 FAILED TESTS
  YOU HAVE 1 DISABLED TEST

… and 1 more failed derivation
failed checks.x86_64-linux.nixos-bernie 40s
nix-store-tests-run: [----------] 5 tests from S3ToHttpsConversionErrors/S3ToHttpsConversionErrorTest (0 ms total) [----------] Global test environment tear-dow …
nix-store-tests-run:
[----------] 5 tests from S3ToHttpsConversionErrors/S3ToHttpsConversionErrorTest (0 ms total)
[----------] Global test environment tear-down
[==========] 798 tests from 90 test suites ran. (1386 ms total)
[  PASSED  ] 797 tests.
[  FAILED  ] 1 test, listed below:
[  FAILED  ] StoreReferenceTest.PathInfo_ssh_unbracketed_ipv6_5_from_uri
 1 FAILED TEST
  YOU HAVE 1 DISABLED TEST

nix-util-tests-run-without-new-syscalls:
[  FAILED  ] 5 tests, listed below:
[  FAILED  ] ParseURLSuccessCases/ParseURLSuccess.parsesAsExpected/5, where GetParam() = 288-byte object <31-00 00-00 00-00 00-00 A8-86 95-55 55-55 00-00 B0-C7 B0-55 55-55 00-00 04-00 00-00 00-00 00-00 68-74 74-70 00-68 74-74 70-73 00-00 00-00 00-00 02-00 00-00 00-00 00-00 00-56 B0-55 55-55 00-00 ... 00-00 00-00 00-00 00-00 68-C8 B0-55 55-55 00-00 68-C8 B0-55 55-55 00-00 00-00 00-00 00-00 00-00 A0-C8 B0-55 55-55 00-00 00-00 00-00 00-00 00-00 00-65 6C-6C 6F-00 00-00 98-C8 B0-55 55-55 00-00>
[  FAILED  ] ParseURLSuccessCases/ParseURLSuccess.toStringRoundTrips/5, where GetParam() = 288-byte object <31-00 00-00 00-00 00-00 A8-86 95-55 55-55 00-00 B0-C7 B0-55 55-55 00-00 04-00 00-00 00-00 00-00 68-74 74-70 00-68 74-74 70-73 00-00 00-00 00-00 02-00 00-00 00-00 00-00 F0-2F B1-55 55-55 00-00 ... 00-00 00-00 00-00 00-00 68-C8 B0-55 55-55 00-00 68-C8 B0-55 55-55 00-00 00-00 00-00 00-00 00-00 A0-C8 B0-55 55-55 00-00 00-00 00-00 00-00 00-00 00-65 6C-6C 6F-00 00-00 98-C8 B0-55 55-55 00-00>
[  FAILED  ] ParseURLSuccessCases/ParseURLSuccess.makeSureFixGitURLDoesNotModify/5, where GetParam() = 288-byte object <31-00 00-00 00-00 00-00 A8-86 95-55 55-55 00-00 B0-C7 B0-55 55-55 00-00 04-00 00-00 00-00 00-00 68-74 74-70 00-68 74-74 70-73 00-00 00-00 00-00 02-00 00-00 00-00 00-00 40-55 B1-55 55-55 00-00 ... 00-00 00-00 00-00 00-00 68-C8 B0-55 55-55 00-00 68-C8 B0-55 55-55 00-00 00-00 00-00 00-00 00-00 A0-C8 B0-55 55-55 00-00 00-00 00-00 00-00 00-00 00-65 6C-6C 6F-00 00-00 98-C8 B0-55 55-55 00-00>
[  FAILED  ] parseURLRelative/ParseURLRelativeTestSuite.resolve/resolvesRelativePathIpv6AddressWithZoneId, where GetParam() = 336-byte object <3F-00 00-00 00-00 00-00 18-90 95-55 55-55 00-00 10-00 00-00 00-00 00-00 68-34 94-55 55-55 00-00 B0-F2 AF-55 55-55 00-00 04-00 00-00 00-00 00-00 68-74 74-70 00-00 00-00 00-00 00-00 00-00 00-00 ... A0-F3 AF-55 55-55 00-00 00-00 00-00 00-00 00-00 00-F3 AF-55 55-55 00-00 00-00 00-00 00-00 00-00 90-74 B1-55 55-55 00-00 29-00 00-00 00-00 00-00 29-00 00-00 00-00 00-00 F0-F3 AF-55 55-55 00-00>
[  FAILED  ] parseURLRelative/ParseURLRelativeTestSuite.resolve/absOverrideWithZoneId, where GetParam() = 336-byte object <21-00 00-00 00-00 00-00 60-8E 95-55 55-55 00-00 3C-00 00-00 00-00 00-00 88-8E 95-55 55-55 00-00 B0-F2 AF-55 55-55 00-00 05-00 00-00 00-00 00-00 68-74 74-70 73-00 00-00 00-00 00-00 00-00 00-00 ... A0-F3 AF-55 55-55 00-00 00-00 00-00 00-00 00-00 00-72 61-67 00-55 00-00 00-00 00-00 00-00 00-00 C0-3B B1-55 55-55 00-00 15-00 00-00 00-00 00-00 15-00 00-00 00-00 00-00 69-64 65-00 55-55 00-00>
 5 FAILED TESTS
  YOU HAVE 1 DISABLED TEST

nix-util-tests-run:
[  FAILED  ] 5 tests, listed below:
[  FAILED  ] ParseURLSuccessCases/ParseURLSuccess.parsesAsExpected/5, where GetParam() = 288-byte object <31-00 00-00 00-00 00-00 A8-86 95-55 55-55 00-00 B0-C7 B0-55 55-55 00-00 04-00 00-00 00-00 00-00 68-74 74-70 00-68 74-74 70-73 00-00 00-00 00-00 02-00 00-00 00-00 00-00 00-56 B0-55 55-55 00-00 ... 00-00 00-00 00-00 00-00 68-C8 B0-55 55-55 00-00 68-C8 B0-55 55-55 00-00 00-00 00-00 00-00 00-00 A0-C8 B0-55 55-55 00-00 00-00 00-00 00-00 00-00 00-65 6C-6C 6F-00 00-00 98-C8 B0-55 55-55 00-00>
[  FAILED  ] ParseURLSuccessCases/ParseURLSuccess.toStringRoundTrips/5, where GetParam() = 288-byte object <31-00 00-00 00-00 00-00 A8-86 95-55 55-55 00-00 B0-C7 B0-55 55-55 00-00 04-00 00-00 00-00 00-00 68-74 74-70 00-68 74-74 70-73 00-00 00-00 00-00 02-00 00-00 00-00 00-00 F0-2F B1-55 55-55 00-00 ... 00-00 00-00 00-00 00-00 68-C8 B0-55 55-55 00-00 68-C8 B0-55 55-55 00-00 00-00 00-00 00-00 00-00 A0-C8 B0-55 55-55 00-00 00-00 00-00 00-00 00-00 00-65 6C-6C 6F-00 00-00 98-C8 B0-55 55-55 00-00>
[  FAILED  ] ParseURLSuccessCases/ParseURLSuccess.makeSureFixGitURLDoesNotModify/5, where GetParam() = 288-byte object <31-00 00-00 00-00 00-00 A8-86 95-55 55-55 00-00 B0-C7 B0-55 55-55 00-00 04-00 00-00 00-00 00-00 68-74 74-70 00-68 74-74 70-73 00-00 00-00 00-00 02-00 00-00 00-00 00-00 40-55 B1-55 55-55 00-00 ... 00-00 00-00 00-00 00-00 68-C8 B0-55 55-55 00-00 68-C8 B0-55 55-55 00-00 00-00 00-00 00-00 00-00 A0-C8 B0-55 55-55 00-00 00-00 00-00 00-00 00-00 00-65 6C-6C 6F-00 00-00 98-C8 B0-55 55-55 00-00>
[  FAILED  ] parseURLRelative/ParseURLRelativeTestSuite.resolve/resolvesRelativePathIpv6AddressWithZoneId, where GetParam() = 336-byte object <3F-00 00-00 00-00 00-00 18-90 95-55 55-55 00-00 10-00 00-00 00-00 00-00 68-34 94-55 55-55 00-00 B0-F2 AF-55 55-55 00-00 04-00 00-00 00-00 00-00 68-74 74-70 00-00 00-00 00-00 00-00 00-00 00-00 ... A0-F3 AF-55 55-55 00-00 00-00 00-00 00-00 00-00 00-F3 AF-55 55-55 00-00 00-00 00-00 00-00 00-00 90-74 B1-55 55-55 00-00 29-00 00-00 00-00 00-00 29-00 00-00 00-00 00-00 F0-F3 AF-55 55-55 00-00>
[  FAILED  ] parseURLRelative/ParseURLRelativeTestSuite.resolve/absOverrideWithZoneId, where GetParam() = 336-byte object <21-00 00-00 00-00 00-00 60-8E 95-55 55-55 00-00 3C-00 00-00 00-00 00-00 88-8E 95-55 55-55 00-00 B0-F2 AF-55 55-55 00-00 05-00 00-00 00-00 00-00 68-74 74-70 73-00 00-00 00-00 00-00 00-00 00-00 ... A0-F3 AF-55 55-55 00-00 00-00 00-00 00-00 00-00 00-72 61-67 00-55 00-00 00-00 00-00 00-00 00-00 C0-3B B1-55 55-55 00-00 15-00 00-00 00-00 00-00 15-00 00-00 00-00 00-00 69-64 65-00 55-55 00-00>
 5 FAILED TESTS
  YOU HAVE 1 DISABLED TEST
failed checks.x86_64-linux.nixos-dorits-laptop 4s
nix-store-tests-run: [----------] 5 tests from S3ToHttpsConversionErrors/S3ToHttpsConversionErrorTest (0 ms total) [----------] Global test environment tear-dow …
nix-store-tests-run:
[----------] 5 tests from S3ToHttpsConversionErrors/S3ToHttpsConversionErrorTest (0 ms total)
[----------] Global test environment tear-down
[==========] 798 tests from 90 test suites ran. (1424 ms total)
[  PASSED  ] 797 tests.
[  FAILED  ] 1 test, listed below:
[  FAILED  ] StoreReferenceTest.PathInfo_ssh_unbracketed_ipv6_5_from_uri
 1 FAILED TEST
  YOU HAVE 1 DISABLED TEST

nix-util-tests-run-without-new-syscalls:
[  FAILED  ] 5 tests, listed below:
[  FAILED  ] ParseURLSuccessCases/ParseURLSuccess.parsesAsExpected/5, where GetParam() = 288-byte object <31-00 00-00 00-00 00-00 A8-86 95-55 55-55 00-00 B0-C7 B0-55 55-55 00-00 04-00 00-00 00-00 00-00 68-74 74-70 00-68 74-74 70-73 00-00 00-00 00-00 02-00 00-00 00-00 00-00 00-56 B0-55 55-55 00-00 ... 00-00 00-00 00-00 00-00 68-C8 B0-55 55-55 00-00 68-C8 B0-55 55-55 00-00 00-00 00-00 00-00 00-00 A0-C8 B0-55 55-55 00-00 00-00 00-00 00-00 00-00 00-65 6C-6C 6F-00 00-00 98-C8 B0-55 55-55 00-00>
[  FAILED  ] ParseURLSuccessCases/ParseURLSuccess.toStringRoundTrips/5, where GetParam() = 288-byte object <31-00 00-00 00-00 00-00 A8-86 95-55 55-55 00-00 B0-C7 B0-55 55-55 00-00 04-00 00-00 00-00 00-00 68-74 74-70 00-68 74-74 70-73 00-00 00-00 00-00 02-00 00-00 00-00 00-00 F0-2F B1-55 55-55 00-00 ... 00-00 00-00 00-00 00-00 68-C8 B0-55 55-55 00-00 68-C8 B0-55 55-55 00-00 00-00 00-00 00-00 00-00 A0-C8 B0-55 55-55 00-00 00-00 00-00 00-00 00-00 00-65 6C-6C 6F-00 00-00 98-C8 B0-55 55-55 00-00>
[  FAILED  ] ParseURLSuccessCases/ParseURLSuccess.makeSureFixGitURLDoesNotModify/5, where GetParam() = 288-byte object <31-00 00-00 00-00 00-00 A8-86 95-55 55-55 00-00 B0-C7 B0-55 55-55 00-00 04-00 00-00 00-00 00-00 68-74 74-70 00-68 74-74 70-73 00-00 00-00 00-00 02-00 00-00 00-00 00-00 40-55 B1-55 55-55 00-00 ... 00-00 00-00 00-00 00-00 68-C8 B0-55 55-55 00-00 68-C8 B0-55 55-55 00-00 00-00 00-00 00-00 00-00 A0-C8 B0-55 55-55 00-00 00-00 00-00 00-00 00-00 00-65 6C-6C 6F-00 00-00 98-C8 B0-55 55-55 00-00>
[  FAILED  ] parseURLRelative/ParseURLRelativeTestSuite.resolve/resolvesRelativePathIpv6AddressWithZoneId, where GetParam() = 336-byte object <3F-00 00-00 00-00 00-00 18-90 95-55 55-55 00-00 10-00 00-00 00-00 00-00 68-34 94-55 55-55 00-00 B0-F2 AF-55 55-55 00-00 04-00 00-00 00-00 00-00 68-74 74-70 00-00 00-00 00-00 00-00 00-00 00-00 ... A0-F3 AF-55 55-55 00-00 00-00 00-00 00-00 00-00 00-F3 AF-55 55-55 00-00 00-00 00-00 00-00 00-00 90-74 B1-55 55-55 00-00 29-00 00-00 00-00 00-00 29-00 00-00 00-00 00-00 F0-F3 AF-55 55-55 00-00>
[  FAILED  ] parseURLRelative/ParseURLRelativeTestSuite.resolve/absOverrideWithZoneId, where GetParam() = 336-byte object <21-00 00-00 00-00 00-00 60-8E 95-55 55-55 00-00 3C-00 00-00 00-00 00-00 88-8E 95-55 55-55 00-00 B0-F2 AF-55 55-55 00-00 05-00 00-00 00-00 00-00 68-74 74-70 73-00 00-00 00-00 00-00 00-00 00-00 ... A0-F3 AF-55 55-55 00-00 00-00 00-00 00-00 00-00 00-72 61-67 00-55 00-00 00-00 00-00 00-00 00-00 C0-3B B1-55 55-55 00-00 15-00 00-00 00-00 00-00 15-00 00-00 00-00 00-00 69-64 65-00 55-55 00-00>
 5 FAILED TESTS
  YOU HAVE 1 DISABLED TEST

nix-util-tests-run:
[  FAILED  ] 5 tests, listed below:
[  FAILED  ] ParseURLSuccessCases/ParseURLSuccess.parsesAsExpected/5, where GetParam() = 288-byte object <31-00 00-00 00-00 00-00 A8-86 95-55 55-55 00-00 B0-C7 B0-55 55-55 00-00 04-00 00-00 00-00 00-00 68-74 74-70 00-68 74-74 70-73 00-00 00-00 00-00 02-00 00-00 00-00 00-00 00-56 B0-55 55-55 00-00 ... 00-00 00-00 00-00 00-00 68-C8 B0-55 55-55 00-00 68-C8 B0-55 55-55 00-00 00-00 00-00 00-00 00-00 A0-C8 B0-55 55-55 00-00 00-00 00-00 00-00 00-00 00-65 6C-6C 6F-00 00-00 98-C8 B0-55 55-55 00-00>
[  FAILED  ] ParseURLSuccessCases/ParseURLSuccess.toStringRoundTrips/5, where GetParam() = 288-byte object <31-00 00-00 00-00 00-00 A8-86 95-55 55-55 00-00 B0-C7 B0-55 55-55 00-00 04-00 00-00 00-00 00-00 68-74 74-70 00-68 74-74 70-73 00-00 00-00 00-00 02-00 00-00 00-00 00-00 F0-2F B1-55 55-55 00-00 ... 00-00 00-00 00-00 00-00 68-C8 B0-55 55-55 00-00 68-C8 B0-55 55-55 00-00 00-00 00-00 00-00 00-00 A0-C8 B0-55 55-55 00-00 00-00 00-00 00-00 00-00 00-65 6C-6C 6F-00 00-00 98-C8 B0-55 55-55 00-00>
[  FAILED  ] ParseURLSuccessCases/ParseURLSuccess.makeSureFixGitURLDoesNotModify/5, where GetParam() = 288-byte object <31-00 00-00 00-00 00-00 A8-86 95-55 55-55 00-00 B0-C7 B0-55 55-55 00-00 04-00 00-00 00-00 00-00 68-74 74-70 00-68 74-74 70-73 00-00 00-00 00-00 02-00 00-00 00-00 00-00 40-55 B1-55 55-55 00-00 ... 00-00 00-00 00-00 00-00 68-C8 B0-55 55-55 00-00 68-C8 B0-55 55-55 00-00 00-00 00-00 00-00 00-00 A0-C8 B0-55 55-55 00-00 00-00 00-00 00-00 00-00 00-65 6C-6C 6F-00 00-00 98-C8 B0-55 55-55 00-00>
[  FAILED  ] parseURLRelative/ParseURLRelativeTestSuite.resolve/resolvesRelativePathIpv6AddressWithZoneId, where GetParam() = 336-byte object <3F-00 00-00 00-00 00-00 18-90 95-55 55-55 00-00 10-00 00-00 00-00 00-00 68-34 94-55 55-55 00-00 B0-F2 AF-55 55-55 00-00 04-00 00-00 00-00 00-00 68-74 74-70 00-00 00-00 00-00 00-00 00-00 00-00 ... A0-F3 AF-55 55-55 00-00 00-00 00-00 00-00 00-00 00-F3 AF-55 55-55 00-00 00-00 00-00 00-00 00-00 90-74 B1-55 55-55 00-00 29-00 00-00 00-00 00-00 29-00 00-00 00-00 00-00 F0-F3 AF-55 55-55 00-00>
[  FAILED  ] parseURLRelative/ParseURLRelativeTestSuite.resolve/absOverrideWithZoneId, where GetParam() = 336-byte object <21-00 00-00 00-00 00-00 60-8E 95-55 55-55 00-00 3C-00 00-00 00-00 00-00 88-8E 95-55 55-55 00-00 B0-F2 AF-55 55-55 00-00 05-00 00-00 00-00 00-00 68-74 74-70 73-00 00-00 00-00 00-00 00-00 00-00 ... A0-F3 AF-55 55-55 00-00 00-00 00-00 00-00 00-00 00-72 61-67 00-55 00-00 00-00 00-00 00-00 00-00 C0-3B B1-55 55-55 00-00 15-00 00-00 00-00 00-00 15-00 00-00 00-00 00-00 69-64 65-00 55-55 00-00>
 5 FAILED TESTS
  YOU HAVE 1 DISABLED TEST
failed checks.x86_64-linux.nixos-eva 4s
nix-store-tests-run: [----------] 5 tests from S3ToHttpsConversionErrors/S3ToHttpsConversionErrorTest (0 ms total) [----------] Global test environment tear-dow …
nix-store-tests-run:
[----------] 5 tests from S3ToHttpsConversionErrors/S3ToHttpsConversionErrorTest (0 ms total)
[----------] Global test environment tear-down
[==========] 798 tests from 90 test suites ran. (1664 ms total)
[  PASSED  ] 797 tests.
[  FAILED  ] 1 test, listed below:
[  FAILED  ] StoreReferenceTest.PathInfo_ssh_unbracketed_ipv6_5_from_uri
 1 FAILED TEST
  YOU HAVE 1 DISABLED TEST

nix-util-tests-run-without-new-syscalls:
[  FAILED  ] 5 tests, listed below:
[  FAILED  ] ParseURLSuccessCases/ParseURLSuccess.parsesAsExpected/5, where GetParam() = 288-byte object <31-00 00-00 00-00 00-00 10-BE E4-AA AA-AA 00-00 00-B1 FF-AA AA-AA 00-00 04-00 00-00 00-00 00-00 68-74 74-70 00-68 74-74 70-73 00-00 00-00 00-00 02-00 00-00 00-00 00-00 10-FC FE-AA AA-AA 00-00 ... 00-00 00-00 00-00 00-00 B8-B1 FF-AA AA-AA 00-00 B8-B1 FF-AA AA-AA 00-00 00-00 00-00 00-00 00-00 F0-B1 FF-AA AA-AA 00-00 00-00 00-00 00-00 00-00 00-65 6C-6C 6F-00 00-00 E8-B1 FF-AA AA-AA 00-00>
[  FAILED  ] ParseURLSuccessCases/ParseURLSuccess.toStringRoundTrips/5, where GetParam() = 288-byte object <31-00 00-00 00-00 00-00 10-BE E4-AA AA-AA 00-00 00-B1 FF-AA AA-AA 00-00 04-00 00-00 00-00 00-00 68-74 74-70 00-68 74-74 70-73 00-00 00-00 00-00 02-00 00-00 00-00 00-00 60-1B 00-AB AA-AA 00-00 ... 00-00 00-00 00-00 00-00 B8-B1 FF-AA AA-AA 00-00 B8-B1 FF-AA AA-AA 00-00 00-00 00-00 00-00 00-00 F0-B1 FF-AA AA-AA 00-00 00-00 00-00 00-00 00-00 00-65 6C-6C 6F-00 00-00 E8-B1 FF-AA AA-AA 00-00>
[  FAILED  ] ParseURLSuccessCases/ParseURLSuccess.makeSureFixGitURLDoesNotModify/5, where GetParam() = 288-byte object <31-00 00-00 00-00 00-00 10-BE E4-AA AA-AA 00-00 00-B1 FF-AA AA-AA 00-00 04-00 00-00 00-00 00-00 68-74 74-70 00-68 74-74 70-73 00-00 00-00 00-00 02-00 00-00 00-00 00-00 C0-3F 00-AB AA-AA 00-00 ... 00-00 00-00 00-00 00-00 B8-B1 FF-AA AA-AA 00-00 B8-B1 FF-AA AA-AA 00-00 00-00 00-00 00-00 00-00 F0-B1 FF-AA AA-AA 00-00 00-00 00-00 00-00 00-00 00-65 6C-6C 6F-00 00-00 E8-B1 FF-AA AA-AA 00-00>
[  FAILED  ] parseURLRelative/ParseURLRelativeTestSuite.resolve/resolvesRelativePathIpv6AddressWithZoneId, where GetParam() = 336-byte object <3F-00 00-00 00-00 00-00 D8-C9 E4-AA AA-AA 00-00 10-00 00-00 00-00 00-00 18-CA E4-AA AA-AA 00-00 E0-4D FF-AA AA-AA 00-00 04-00 00-00 00-00 00-00 68-74 74-70 00-00 00-00 01-00 00-00 00-00 00-00 ... D0-4E FF-AA AA-AA 00-00 00-00 00-00 00-00 00-00 00-4E FF-AA AA-AA 00-00 00-00 00-00 00-00 00-00 A0-5E 00-AB AA-AA 00-00 29-00 00-00 00-00 00-00 29-00 00-00 00-00 00-00 30-96 FE-AA AA-AA 00-00>
[  FAILED  ] parseURLRelative/ParseURLRelativeTestSuite.resolve/absOverrideWithZoneId, where GetParam() = 336-byte object <21-00 00-00 00-00 00-00 18-CC E4-AA AA-AA 00-00 3C-00 00-00 00-00 00-00 80-CC E4-AA AA-AA 00-00 E0-4D FF-AA AA-AA 00-00 05-00 00-00 00-00 00-00 68-74 74-70 73-00 00-00 01-00 00-00 00-00 00-00 ... D0-4E FF-AA AA-AA 00-00 00-00 00-00 00-00 00-00 00-72 61-67 00-AA 00-00 00-00 00-00 00-00 00-00 10-2A 00-AB AA-AA 00-00 15-00 00-00 00-00 00-00 15-00 00-00 00-00 00-00 69-64 65-00 AA-AA 00-00>
 5 FAILED TESTS
  YOU HAVE 1 DISABLED TEST

nix-util-tests-run:
[  FAILED  ] 5 tests, listed below:
[  FAILED  ] ParseURLSuccessCases/ParseURLSuccess.parsesAsExpected/5, where GetParam() = 288-byte object <31-00 00-00 00-00 00-00 10-BE E4-AA AA-AA 00-00 00-B1 FF-AA AA-AA 00-00 04-00 00-00 00-00 00-00 68-74 74-70 00-68 74-74 70-73 00-00 00-00 00-00 02-00 00-00 00-00 00-00 10-FC FE-AA AA-AA 00-00 ... 00-00 00-00 00-00 00-00 B8-B1 FF-AA AA-AA 00-00 B8-B1 FF-AA AA-AA 00-00 00-00 00-00 00-00 00-00 F0-B1 FF-AA AA-AA 00-00 00-00 00-00 00-00 00-00 00-65 6C-6C 6F-00 00-00 E8-B1 FF-AA AA-AA 00-00>
[  FAILED  ] ParseURLSuccessCases/ParseURLSuccess.toStringRoundTrips/5, where GetParam() = 288-byte object <31-00 00-00 00-00 00-00 10-BE E4-AA AA-AA 00-00 00-B1 FF-AA AA-AA 00-00 04-00 00-00 00-00 00-00 68-74 74-70 00-68 74-74 70-73 00-00 00-00 00-00 02-00 00-00 00-00 00-00 60-1B 00-AB AA-AA 00-00 ... 00-00 00-00 00-00 00-00 B8-B1 FF-AA AA-AA 00-00 B8-B1 FF-AA AA-AA 00-00 00-00 00-00 00-00 00-00 F0-B1 FF-AA AA-AA 00-00 00-00 00-00 00-00 00-00 00-65 6C-6C 6F-00 00-00 E8-B1 FF-AA AA-AA 00-00>
[  FAILED  ] ParseURLSuccessCases/ParseURLSuccess.makeSureFixGitURLDoesNotModify/5, where GetParam() = 288-byte object <31-00 00-00 00-00 00-00 10-BE E4-AA AA-AA 00-00 00-B1 FF-AA AA-AA 00-00 04-00 00-00 00-00 00-00 68-74 74-70 00-68 74-74 70-73 00-00 00-00 00-00 02-00 00-00 00-00 00-00 C0-3F 00-AB AA-AA 00-00 ... 00-00 00-00 00-00 00-00 B8-B1 FF-AA AA-AA 00-00 B8-B1 FF-AA AA-AA 00-00 00-00 00-00 00-00 00-00 F0-B1 FF-AA AA-AA 00-00 00-00 00-00 00-00 00-00 00-65 6C-6C 6F-00 00-00 E8-B1 FF-AA AA-AA 00-00>
[  FAILED  ] parseURLRelative/ParseURLRelativeTestSuite.resolve/resolvesRelativePathIpv6AddressWithZoneId, where GetParam() = 336-byte object <3F-00 00-00 00-00 00-00 D8-C9 E4-AA AA-AA 00-00 10-00 00-00 00-00 00-00 18-CA E4-AA AA-AA 00-00 E0-4D FF-AA AA-AA 00-00 04-00 00-00 00-00 00-00 68-74 74-70 00-00 00-00 01-00 00-00 00-00 00-00 ... D0-4E FF-AA AA-AA 00-00 00-00 00-00 00-00 00-00 00-4E FF-AA AA-AA 00-00 00-00 00-00 00-00 00-00 A0-5E 00-AB AA-AA 00-00 29-00 00-00 00-00 00-00 29-00 00-00 00-00 00-00 30-96 FE-AA AA-AA 00-00>
[  FAILED  ] parseURLRelative/ParseURLRelativeTestSuite.resolve/absOverrideWithZoneId, where GetParam() = 336-byte object <21-00 00-00 00-00 00-00 18-CC E4-AA AA-AA 00-00 3C-00 00-00 00-00 00-00 80-CC E4-AA AA-AA 00-00 E0-4D FF-AA AA-AA 00-00 05-00 00-00 00-00 00-00 68-74 74-70 73-00 00-00 01-00 00-00 00-00 00-00 ... D0-4E FF-AA AA-AA 00-00 00-00 00-00 00-00 00-00 00-72 61-67 00-AA 00-00 00-00 00-00 00-00 00-00 10-2A 00-AB AA-AA 00-00 15-00 00-00 00-00 00-00 15-00 00-00 00-00 00-00 69-64 65-00 AA-AA 00-00>
 5 FAILED TESTS
  YOU HAVE 1 DISABLED TEST
failed eval checks.x86_64-linux.nixos-jacquardmachine
error: … while evaluating a branch condition at «string»:25:5: 24| v: 25| if !builtins.isAttrs v || isDrv v then …
error:
       … while evaluating a branch condition
         at «string»:25:5:
           24|     v:
           25|     if !builtins.isAttrs v || isDrv v then
             |     ^
           26|       v

       … in the left operand of the OR (||) operator
         at «string»:25:28:
           24|     v:
           25|     if !builtins.isAttrs v || isDrv v then
             |                            ^
           26|       v

       … while evaluating the option `system.build.toplevel':

       … while evaluating definitions from `/nix/store/5x23x1akdim64im7bq7wsqy3j723wjzr-source/nixos/modules/system/activation/top-level.nix':

       (stack trace truncated; use '--show-trace' to show the full, detailed trace)

       error:
       Failed assertions:
       - The option definition `services.journald.extraConfig' in `/nix/store/mfvgksvay8cjpr5z86ysvwkph6hb84ls-source/nixosModules/workstation.nix' no longer has any effect; please remove it.
       Use services.journald.settings.Journal instead.
failed checks.x86_64-linux.nixos-matchbox 4s
nix-store-tests-run: [----------] 5 tests from S3ToHttpsConversionErrors/S3ToHttpsConversionErrorTest (0 ms total) [----------] Global test environment tear-dow …
nix-store-tests-run:
[----------] 5 tests from S3ToHttpsConversionErrors/S3ToHttpsConversionErrorTest (0 ms total)
[----------] Global test environment tear-down
[==========] 798 tests from 90 test suites ran. (1461 ms total)
[  PASSED  ] 797 tests.
[  FAILED  ] 1 test, listed below:
[  FAILED  ] StoreReferenceTest.PathInfo_ssh_unbracketed_ipv6_5_from_uri
 1 FAILED TEST
  YOU HAVE 1 DISABLED TEST

nix-util-tests-run-without-new-syscalls:
[  FAILED  ] 5 tests, listed below:
[  FAILED  ] ParseURLSuccessCases/ParseURLSuccess.parsesAsExpected/5, where GetParam() = 288-byte object <31-00 00-00 00-00 00-00 A8-86 95-55 55-55 00-00 B0-C7 B0-55 55-55 00-00 04-00 00-00 00-00 00-00 68-74 74-70 00-68 74-74 70-73 00-00 00-00 00-00 02-00 00-00 00-00 00-00 00-56 B0-55 55-55 00-00 ... 00-00 00-00 00-00 00-00 68-C8 B0-55 55-55 00-00 68-C8 B0-55 55-55 00-00 00-00 00-00 00-00 00-00 A0-C8 B0-55 55-55 00-00 00-00 00-00 00-00 00-00 00-65 6C-6C 6F-00 00-00 98-C8 B0-55 55-55 00-00>
[  FAILED  ] ParseURLSuccessCases/ParseURLSuccess.toStringRoundTrips/5, where GetParam() = 288-byte object <31-00 00-00 00-00 00-00 A8-86 95-55 55-55 00-00 B0-C7 B0-55 55-55 00-00 04-00 00-00 00-00 00-00 68-74 74-70 00-68 74-74 70-73 00-00 00-00 00-00 02-00 00-00 00-00 00-00 F0-2F B1-55 55-55 00-00 ... 00-00 00-00 00-00 00-00 68-C8 B0-55 55-55 00-00 68-C8 B0-55 55-55 00-00 00-00 00-00 00-00 00-00 A0-C8 B0-55 55-55 00-00 00-00 00-00 00-00 00-00 00-65 6C-6C 6F-00 00-00 98-C8 B0-55 55-55 00-00>
[  FAILED  ] ParseURLSuccessCases/ParseURLSuccess.makeSureFixGitURLDoesNotModify/5, where GetParam() = 288-byte object <31-00 00-00 00-00 00-00 A8-86 95-55 55-55 00-00 B0-C7 B0-55 55-55 00-00 04-00 00-00 00-00 00-00 68-74 74-70 00-68 74-74 70-73 00-00 00-00 00-00 02-00 00-00 00-00 00-00 40-55 B1-55 55-55 00-00 ... 00-00 00-00 00-00 00-00 68-C8 B0-55 55-55 00-00 68-C8 B0-55 55-55 00-00 00-00 00-00 00-00 00-00 A0-C8 B0-55 55-55 00-00 00-00 00-00 00-00 00-00 00-65 6C-6C 6F-00 00-00 98-C8 B0-55 55-55 00-00>
[  FAILED  ] parseURLRelative/ParseURLRelativeTestSuite.resolve/resolvesRelativePathIpv6AddressWithZoneId, where GetParam() = 336-byte object <3F-00 00-00 00-00 00-00 18-90 95-55 55-55 00-00 10-00 00-00 00-00 00-00 68-34 94-55 55-55 00-00 B0-F2 AF-55 55-55 00-00 04-00 00-00 00-00 00-00 68-74 74-70 00-00 00-00 00-00 00-00 00-00 00-00 ... A0-F3 AF-55 55-55 00-00 00-00 00-00 00-00 00-00 00-F3 AF-55 55-55 00-00 00-00 00-00 00-00 00-00 90-74 B1-55 55-55 00-00 29-00 00-00 00-00 00-00 29-00 00-00 00-00 00-00 F0-F3 AF-55 55-55 00-00>
[  FAILED  ] parseURLRelative/ParseURLRelativeTestSuite.resolve/absOverrideWithZoneId, where GetParam() = 336-byte object <21-00 00-00 00-00 00-00 60-8E 95-55 55-55 00-00 3C-00 00-00 00-00 00-00 88-8E 95-55 55-55 00-00 B0-F2 AF-55 55-55 00-00 05-00 00-00 00-00 00-00 68-74 74-70 73-00 00-00 00-00 00-00 00-00 00-00 ... A0-F3 AF-55 55-55 00-00 00-00 00-00 00-00 00-00 00-72 61-67 00-55 00-00 00-00 00-00 00-00 00-00 C0-3B B1-55 55-55 00-00 15-00 00-00 00-00 00-00 15-00 00-00 00-00 00-00 69-64 65-00 55-55 00-00>
 5 FAILED TESTS
  YOU HAVE 1 DISABLED TEST

nix-util-tests-run:
[  FAILED  ] 5 tests, listed below:
[  FAILED  ] ParseURLSuccessCases/ParseURLSuccess.parsesAsExpected/5, where GetParam() = 288-byte object <31-00 00-00 00-00 00-00 A8-86 95-55 55-55 00-00 B0-C7 B0-55 55-55 00-00 04-00 00-00 00-00 00-00 68-74 74-70 00-68 74-74 70-73 00-00 00-00 00-00 02-00 00-00 00-00 00-00 00-56 B0-55 55-55 00-00 ... 00-00 00-00 00-00 00-00 68-C8 B0-55 55-55 00-00 68-C8 B0-55 55-55 00-00 00-00 00-00 00-00 00-00 A0-C8 B0-55 55-55 00-00 00-00 00-00 00-00 00-00 00-65 6C-6C 6F-00 00-00 98-C8 B0-55 55-55 00-00>
[  FAILED  ] ParseURLSuccessCases/ParseURLSuccess.toStringRoundTrips/5, where GetParam() = 288-byte object <31-00 00-00 00-00 00-00 A8-86 95-55 55-55 00-00 B0-C7 B0-55 55-55 00-00 04-00 00-00 00-00 00-00 68-74 74-70 00-68 74-74 70-73 00-00 00-00 00-00 02-00 00-00 00-00 00-00 F0-2F B1-55 55-55 00-00 ... 00-00 00-00 00-00 00-00 68-C8 B0-55 55-55 00-00 68-C8 B0-55 55-55 00-00 00-00 00-00 00-00 00-00 A0-C8 B0-55 55-55 00-00 00-00 00-00 00-00 00-00 00-65 6C-6C 6F-00 00-00 98-C8 B0-55 55-55 00-00>
[  FAILED  ] ParseURLSuccessCases/ParseURLSuccess.makeSureFixGitURLDoesNotModify/5, where GetParam() = 288-byte object <31-00 00-00 00-00 00-00 A8-86 95-55 55-55 00-00 B0-C7 B0-55 55-55 00-00 04-00 00-00 00-00 00-00 68-74 74-70 00-68 74-74 70-73 00-00 00-00 00-00 02-00 00-00 00-00 00-00 40-55 B1-55 55-55 00-00 ... 00-00 00-00 00-00 00-00 68-C8 B0-55 55-55 00-00 68-C8 B0-55 55-55 00-00 00-00 00-00 00-00 00-00 A0-C8 B0-55 55-55 00-00 00-00 00-00 00-00 00-00 00-65 6C-6C 6F-00 00-00 98-C8 B0-55 55-55 00-00>
[  FAILED  ] parseURLRelative/ParseURLRelativeTestSuite.resolve/resolvesRelativePathIpv6AddressWithZoneId, where GetParam() = 336-byte object <3F-00 00-00 00-00 00-00 18-90 95-55 55-55 00-00 10-00 00-00 00-00 00-00 68-34 94-55 55-55 00-00 B0-F2 AF-55 55-55 00-00 04-00 00-00 00-00 00-00 68-74 74-70 00-00 00-00 00-00 00-00 00-00 00-00 ... A0-F3 AF-55 55-55 00-00 00-00 00-00 00-00 00-00 00-F3 AF-55 55-55 00-00 00-00 00-00 00-00 00-00 90-74 B1-55 55-55 00-00 29-00 00-00 00-00 00-00 29-00 00-00 00-00 00-00 F0-F3 AF-55 55-55 00-00>
[  FAILED  ] parseURLRelative/ParseURLRelativeTestSuite.resolve/absOverrideWithZoneId, where GetParam() = 336-byte object <21-00 00-00 00-00 00-00 60-8E 95-55 55-55 00-00 3C-00 00-00 00-00 00-00 88-8E 95-55 55-55 00-00 B0-F2 AF-55 55-55 00-00 05-00 00-00 00-00 00-00 68-74 74-70 73-00 00-00 00-00 00-00 00-00 00-00 ... A0-F3 AF-55 55-55 00-00 00-00 00-00 00-00 00-00 00-72 61-67 00-55 00-00 00-00 00-00 00-00 00-00 C0-3B B1-55 55-55 00-00 15-00 00-00 00-00 00-00 15-00 00-00 00-00 00-00 69-64 65-00 55-55 00-00>
 5 FAILED TESTS
  YOU HAVE 1 DISABLED TEST
failed eval checks.x86_64-linux.nixos-turingmachine
error: … while evaluating a branch condition at «string»:25:5: 24| v: 25| if !builtins.isAttrs v || isDrv v then …
error:
       … while evaluating a branch condition
         at «string»:25:5:
           24|     v:
           25|     if !builtins.isAttrs v || isDrv v then
             |     ^
           26|       v

       … in the left operand of the OR (||) operator
         at «string»:25:28:
           24|     v:
           25|     if !builtins.isAttrs v || isDrv v then
             |                            ^
           26|       v

       … while evaluating the option `system.build.toplevel':

       … while evaluating definitions from `/nix/store/5x23x1akdim64im7bq7wsqy3j723wjzr-source/nixos/modules/system/activation/top-level.nix':

       (stack trace truncated; use '--show-trace' to show the full, detailed trace)

       error:
       Failed assertions:
       - The option definition `services.journald.extraConfig' in `/nix/store/mfvgksvay8cjpr5z86ysvwkph6hb84ls-source/nixosModules/workstation.nix' no longer has any effect; please remove it.
       Use services.journald.settings.Journal instead.
failed checks.x86_64-linux.package-app-windows-extension 1s
app-windows-1.16: tribuchet: building on jamie no configure script, doing nothing jsconfig.json(8,15): error TS6046: Argument for '--module' option must be: 'co …
app-windows-1.16:
tribuchet: building on jamie
no configure script, doing nothing
jsconfig.json(8,15): error TS6046: Argument for '--module' option must be: 'commonjs', 'es6', 'es2015', 'es2020', 'es2022', 'esnext', 'node16', 'node18', 'node20', 'nodenext', 'preserve'.
3 succeeded
succeeded attributes
status attribute duration
loading…
235 already built
skipped attributes
status attribute duration
loading…