failed attributes
| status |
attribute |
duration |
| failed |
checks.x86_64-linux.nixos-bernie
- The option `nix.nixPath' defined in `/nix/store/f1ip4qsxmxm5fxxxvrmbg3bd52jhl8n0-source/nixosModules/nix-daemon.nix' and `/nix/store/f1ip4qsxmxm5fxxxvrmbg3bd52jhl8n0-source/nixosModules/nix-path.nix' has been renamed to `nix.settings.nix-path'.
|
19m 46s |
nix-store-2.36.0pre:
[1/2] Compiling C++ object libnixstore.so.2.36.0.p/meson-generated_nixstore-unity0.cpp.o
FAILED: [code=1] libnixstore.so.2.36.0.p/meson-gen …
nix-store-2.36.0pre:
[1/2] Compiling C++ object libnixstore.so.2.36.0.p/meson-generated_nixstore-unity0.cpp.o
FAILED: [code=1] libnixstore.so.2.36.0.p/meson-generated_nixstore-unity0.cpp.o
g++ -Ilibnixstore.so.2.36.0.p -I. -I.. -Iinclude -I../include -I../linux/build -Ilinux/include -I../linux/include -I../unix/build -Iunix/include -I../unix/include -I/nix/store/la1rzzb3q1wjdz50dyvh62fix41ayifa-nix-util-2.36.0pre-dev/include -I/nix/store/2ybid2fqf6nfqrwcgizv9qvvckyp6axh-libarchive-3.8.9-dev/include -I/nix/store/0dz9bi5rv50d46w8xykwdxrj4ssy6pnp-nlohmann_json-3.12.0/include -I/nix/store/aph5dkajglxjn9642bp0h3x7cwzijr52-curl-8.22.0-dev/include -I/nix/store/q2yrf8yhmj405nv9qbbraxr8wlz7n5kv-libseccomp-2.6.1-dev/include -I/nix/store/xrcjl59yi7zswbv0vzm8cmvw4vplsbgj-sqlite-3.53.3-dev/include -I/nix/store/2zgasbvd9mzmj145mxsmnzxiy7rnz…
libnixstore.so.2.36.0.p/nixstore-unity0.cpp:3:9: fatal error: /build/source/src/libstore/build/build/build-log.cc: No such file or directory
3 | #include</build/source/src/libstore/build/build/build-log.cc>
| ^~~~~~~~~~~~~~~~~~~~~~~~~~~~~~~~~~~~~~~~~~~~~~~~~~~~~
compilation terminated.
ninja: build stopped: subcommand failed.
|
| failed |
checks.x86_64-linux.nixos-dorits-laptop
- The option `nix.nixPath' defined in `/nix/store/f1ip4qsxmxm5fxxxvrmbg3bd52jhl8n0-source/nixosModules/nix-daemon.nix' and `/nix/store/f1ip4qsxmxm5fxxxvrmbg3bd52jhl8n0-source/nixosModules/nix-path.nix' has been renamed to `nix.settings.nix-path'.
|
17m 18s |
nix-store-2.36.0pre:
[1/2] Compiling C++ object libnixstore.so.2.36.0.p/meson-generated_nixstore-unity0.cpp.o
FAILED: [code=1] libnixstore.so.2.36.0.p/meson-gen …
nix-store-2.36.0pre:
[1/2] Compiling C++ object libnixstore.so.2.36.0.p/meson-generated_nixstore-unity0.cpp.o
FAILED: [code=1] libnixstore.so.2.36.0.p/meson-generated_nixstore-unity0.cpp.o
g++ -Ilibnixstore.so.2.36.0.p -I. -I.. -Iinclude -I../include -I../linux/build -Ilinux/include -I../linux/include -I../unix/build -Iunix/include -I../unix/include -I/nix/store/la1rzzb3q1wjdz50dyvh62fix41ayifa-nix-util-2.36.0pre-dev/include -I/nix/store/2ybid2fqf6nfqrwcgizv9qvvckyp6axh-libarchive-3.8.9-dev/include -I/nix/store/0dz9bi5rv50d46w8xykwdxrj4ssy6pnp-nlohmann_json-3.12.0/include -I/nix/store/aph5dkajglxjn9642bp0h3x7cwzijr52-curl-8.22.0-dev/include -I/nix/store/q2yrf8yhmj405nv9qbbraxr8wlz7n5kv-libseccomp-2.6.1-dev/include -I/nix/store/xrcjl59yi7zswbv0vzm8cmvw4vplsbgj-sqlite-3.53.3-dev/include -I/nix/store/2zgasbvd9mzmj145mxsmnzxiy7rnz…
libnixstore.so.2.36.0.p/nixstore-unity0.cpp:3:9: fatal error: /build/source/src/libstore/build/build/build-log.cc: No such file or directory
3 | #include</build/source/src/libstore/build/build/build-log.cc>
| ^~~~~~~~~~~~~~~~~~~~~~~~~~~~~~~~~~~~~~~~~~~~~~~~~~~~~
compilation terminated.
ninja: build stopped: subcommand failed.
|
| failed |
checks.x86_64-linux.nixos-jacquardmachine
- The option `nix.nixPath' defined in `/nix/store/f1ip4qsxmxm5fxxxvrmbg3bd52jhl8n0-source/nixosModules/nix-daemon.nix' and `/nix/store/f1ip4qsxmxm5fxxxvrmbg3bd52jhl8n0-source/nixosModules/nix-path.nix' has been renamed to `nix.settings.nix-path'.
|
19m 47s |
nix-store-2.36.0pre:
[1/2] Compiling C++ object libnixstore.so.2.36.0.p/meson-generated_nixstore-unity0.cpp.o
FAILED: [code=1] libnixstore.so.2.36.0.p/meson-gen …
nix-store-2.36.0pre:
[1/2] Compiling C++ object libnixstore.so.2.36.0.p/meson-generated_nixstore-unity0.cpp.o
FAILED: [code=1] libnixstore.so.2.36.0.p/meson-generated_nixstore-unity0.cpp.o
g++ -Ilibnixstore.so.2.36.0.p -I. -I.. -Iinclude -I../include -I../linux/build -Ilinux/include -I../linux/include -I../unix/build -Iunix/include -I../unix/include -I/nix/store/la1rzzb3q1wjdz50dyvh62fix41ayifa-nix-util-2.36.0pre-dev/include -I/nix/store/2ybid2fqf6nfqrwcgizv9qvvckyp6axh-libarchive-3.8.9-dev/include -I/nix/store/0dz9bi5rv50d46w8xykwdxrj4ssy6pnp-nlohmann_json-3.12.0/include -I/nix/store/aph5dkajglxjn9642bp0h3x7cwzijr52-curl-8.22.0-dev/include -I/nix/store/q2yrf8yhmj405nv9qbbraxr8wlz7n5kv-libseccomp-2.6.1-dev/include -I/nix/store/xrcjl59yi7zswbv0vzm8cmvw4vplsbgj-sqlite-3.53.3-dev/include -I/nix/store/2zgasbvd9mzmj145mxsmnzxiy7rnz…
libnixstore.so.2.36.0.p/nixstore-unity0.cpp:3:9: fatal error: /build/source/src/libstore/build/build/build-log.cc: No such file or directory
3 | #include</build/source/src/libstore/build/build/build-log.cc>
| ^~~~~~~~~~~~~~~~~~~~~~~~~~~~~~~~~~~~~~~~~~~~~~~~~~~~~
compilation terminated.
ninja: build stopped: subcommand failed.
|
| failed |
checks.x86_64-linux.nixos-matchbox
- The option `nix.nixPath' defined in `/nix/store/f1ip4qsxmxm5fxxxvrmbg3bd52jhl8n0-source/nixosModules/nix-daemon.nix' and `/nix/store/f1ip4qsxmxm5fxxxvrmbg3bd52jhl8n0-source/nixosModules/nix-path.nix' has been renamed to `nix.settings.nix-path'.
|
19m 45s |
nix-store-2.36.0pre:
[1/2] Compiling C++ object libnixstore.so.2.36.0.p/meson-generated_nixstore-unity0.cpp.o
FAILED: [code=1] libnixstore.so.2.36.0.p/meson-gen …
nix-store-2.36.0pre:
[1/2] Compiling C++ object libnixstore.so.2.36.0.p/meson-generated_nixstore-unity0.cpp.o
FAILED: [code=1] libnixstore.so.2.36.0.p/meson-generated_nixstore-unity0.cpp.o
g++ -Ilibnixstore.so.2.36.0.p -I. -I.. -Iinclude -I../include -I../linux/build -Ilinux/include -I../linux/include -I../unix/build -Iunix/include -I../unix/include -I/nix/store/la1rzzb3q1wjdz50dyvh62fix41ayifa-nix-util-2.36.0pre-dev/include -I/nix/store/2ybid2fqf6nfqrwcgizv9qvvckyp6axh-libarchive-3.8.9-dev/include -I/nix/store/0dz9bi5rv50d46w8xykwdxrj4ssy6pnp-nlohmann_json-3.12.0/include -I/nix/store/aph5dkajglxjn9642bp0h3x7cwzijr52-curl-8.22.0-dev/include -I/nix/store/q2yrf8yhmj405nv9qbbraxr8wlz7n5kv-libseccomp-2.6.1-dev/include -I/nix/store/xrcjl59yi7zswbv0vzm8cmvw4vplsbgj-sqlite-3.53.3-dev/include -I/nix/store/2zgasbvd9mzmj145mxsmnzxiy7rnz…
libnixstore.so.2.36.0.p/nixstore-unity0.cpp:3:9: fatal error: /build/source/src/libstore/build/build/build-log.cc: No such file or directory
3 | #include</build/source/src/libstore/build/build/build-log.cc>
| ^~~~~~~~~~~~~~~~~~~~~~~~~~~~~~~~~~~~~~~~~~~~~~~~~~~~~
compilation terminated.
ninja: build stopped: subcommand failed.
|
| failed |
checks.x86_64-linux.nixos-turingmachine
- The option `nix.nixPath' defined in `/nix/store/f1ip4qsxmxm5fxxxvrmbg3bd52jhl8n0-source/nixosModules/nix-daemon.nix' and `/nix/store/f1ip4qsxmxm5fxxxvrmbg3bd52jhl8n0-source/nixosModules/nix-path.nix' has been renamed to `nix.settings.nix-path'.
|
10m 33s |
nix-store-2.36.0pre:
[1/2] Compiling C++ object libnixstore.so.2.36.0.p/meson-generated_nixstore-unity0.cpp.o
FAILED: [code=1] libnixstore.so.2.36.0.p/meson-gen …
nix-store-2.36.0pre:
[1/2] Compiling C++ object libnixstore.so.2.36.0.p/meson-generated_nixstore-unity0.cpp.o
FAILED: [code=1] libnixstore.so.2.36.0.p/meson-generated_nixstore-unity0.cpp.o
g++ -Ilibnixstore.so.2.36.0.p -I. -I.. -Iinclude -I../include -I../linux/build -Ilinux/include -I../linux/include -I../unix/build -Iunix/include -I../unix/include -I/nix/store/la1rzzb3q1wjdz50dyvh62fix41ayifa-nix-util-2.36.0pre-dev/include -I/nix/store/2ybid2fqf6nfqrwcgizv9qvvckyp6axh-libarchive-3.8.9-dev/include -I/nix/store/0dz9bi5rv50d46w8xykwdxrj4ssy6pnp-nlohmann_json-3.12.0/include -I/nix/store/aph5dkajglxjn9642bp0h3x7cwzijr52-curl-8.22.0-dev/include -I/nix/store/q2yrf8yhmj405nv9qbbraxr8wlz7n5kv-libseccomp-2.6.1-dev/include -I/nix/store/xrcjl59yi7zswbv0vzm8cmvw4vplsbgj-sqlite-3.53.3-dev/include -I/nix/store/2zgasbvd9mzmj145mxsmnzxiy7rnz…
libnixstore.so.2.36.0.p/nixstore-unity0.cpp:3:9: fatal error: /build/source/src/libstore/build/build/build-log.cc: No such file or directory
3 | #include</build/source/src/libstore/build/build/build-log.cc>
| ^~~~~~~~~~~~~~~~~~~~~~~~~~~~~~~~~~~~~~~~~~~~~~~~~~~~~
compilation terminated.
ninja: build stopped: subcommand failed.
breakpad-2024.02.16:
g++ -std=gnu++11 -std=gnu++17 -g -O2 -o src/tools/linux/dump_syms/dump_syms src/common/tools_linux_dump_syms_dump_syms-dwarf_cfi_to_module.o src/common/tools_linux_dump_syms_dump_syms-dwarf_cu_to_module.o src/common/tools_linux_dump_syms_dump_syms-dwarf_line_to_module.o src/common/tools_linux_dump_syms_dump_syms-dwarf_range_list_handler.o src/common/tools_linux_dump_syms_dump_syms-language.o src/common/tools_linux_dump_syms_dump_syms-module.o src/common/tools_linux_dump_syms_dump_syms-path_helper.o src/common/tools_linux_dump_syms_dump_syms-stabs_reader.o src/common/tools_linux_dump_syms_dump_syms-stabs_to_module.o src/common/dwarf/tools…
g++ -std=gnu++11 -std=gnu++17 -Wmissing-braces -Wnon-virtual-dtor -Woverloaded-virtual -Wreorder -Wsign-compare -Wunused-local-typedefs -Wunused-variable -Wvla -Werror -fPIC -g -O2 -o src/processor/microdump_stackwalk src/processor/microdump_stackwalk.o src/common/path_helper.o src/processor/basic_code_modules.o src/processor/basic_source_line_resolver.o src/processor/call_stack.o src/processor/convert_old_arm64_context.o src/processor/cfi_frame_info.o src/processor/disassembler_x86.o src/processor/dump_context.o src/processor/dump_object.o src/processor/logging.o src/processor/microdump.o src/processor/microdump_processor.o src/processor…
/nix/store/y5sgl0vvrpbcwgjwpjs60r1hg0gi7i0n-binutils-2.46/bin/ld.bfd: src/processor/source_line_resolver_base.o: in function `google_breakpad::FastSourceLineResolver::Module::Module(std::__cxx11::basic_string<char, std::char_traits<char>, std::allocator<char> > const&)':
/build/breakpad/./src/processor/fast_source_line_resolver_types.h:163:(.text+0x2bc0): undefined reference to `vtable for google_breakpad::FastSourceLineResolver::Module'
/nix/store/y5sgl0vvrpbcwgjwpjs60r1hg0gi7i0n-binutils-2.46/bin/ld.bfd: /build/breakpad/./src/processor/fast_source_line_resolver_types.h:163:(.text._ZNK15google_breakpad17FastModuleFactory12CreateModuleERKNSt7__cxx1112basic_stringIcSt11char_traitsIcESaIcEEE[_ZNK15google_breakpad17FastModuleFactory12CreateModuleERKNSt7__cxx1112basic_stringIcSt11char_traitsIcESaIcEEE]+0x23): undefined reference to `vtable for google_breakpad::FastSourceLineResolver::Module'
collect2: error: ld returned 1 exit status
make: *** [Makefile:4817: src/processor/microdump_stackwalk] Error 1
make: *** Waiting for unfinished jobs....
|
| failed |
checks.aarch64-darwin.darwin-evo
|
18m 54s |
nix-store-2.36.0pre:
[1/2] Compiling C++ object libnixstore.2.36.0.dylib.p/meson-generated_nixstore-unity0.cpp.o
FAILED: [code=1] libnixstore.2.36.0.dylib.p/mes …
nix-store-2.36.0pre:
[1/2] Compiling C++ object libnixstore.2.36.0.dylib.p/meson-generated_nixstore-unity0.cpp.o
FAILED: [code=1] libnixstore.2.36.0.dylib.p/meson-generated_nixstore-unity0.cpp.o
clang++ -Ilibnixstore.2.36.0.dylib.p -I. -I.. -Iinclude -I../include -I../darwin/build -I../unix/build -Iunix/include -I../unix/include -I/nix/store/7asvmiiws8zz3c8krxpypgrx59a45da6-nix-util-2.36.0pre-dev/include -I/nix/store/kp61vxk6fc6mygavw8jbcp46rv0vhykr-libarchive-3.8.9-dev/include -I/nix/store/isybn536j7an8p4nrj0pl5ykwda6nxqq-nlohmann_json-3.12.0/include -I/nix/store/qdhck8lm021frd70ixahv7r9gsl2vwl9-curl-8.22.0-dev/include -I/nix/store/r9cljv2bvqi3ci3n6m0z0wi3ldpvlyzq-sqlite-3.53.3-dev/include -I/nix/store/3lahs2g34zsq4r6cn4yp25rxzy1h7zgq-aws-crt-cpp-0.34.3-dev/include -I/nix/store/6jh8nc6lcl14vgxdjk3icr2r1yfzdql1-aws-c-mqtt-0.13.3/inc…
libnixstore.2.36.0.dylib.p/nixstore-unity0.cpp:3:9: fatal error: '/private/var/tb/7/scratch/3c208e7df416d2bc/build/source/src/libstore/build/build/build-log.cc' file not found
3 | #include</private/var/tb/7/scratch/3c208e7df416d2bc/build/source/src/libstore/build/build/build-log.cc>
| ^~~~~~~~~~~~~~~~~~~~~~~~~~~~~~~~~~~~~~~~~~~~~~~~~~~~~~~~~~~~~~~~~~~~~~~~~~~~~~~~~~~~~~~~~~~~~~~
1 error generated.
ninja: build stopped: subcommand failed.
|
| failed |
checks.aarch64-darwin.home-manager-common
|
16m 53s |
nix-store-2.36.0pre:
[1/2] Compiling C++ object libnixstore.2.36.0.dylib.p/meson-generated_nixstore-unity0.cpp.o
FAILED: [code=1] libnixstore.2.36.0.dylib.p/mes …
nix-store-2.36.0pre:
[1/2] Compiling C++ object libnixstore.2.36.0.dylib.p/meson-generated_nixstore-unity0.cpp.o
FAILED: [code=1] libnixstore.2.36.0.dylib.p/meson-generated_nixstore-unity0.cpp.o
clang++ -Ilibnixstore.2.36.0.dylib.p -I. -I.. -Iinclude -I../include -I../darwin/build -I../unix/build -Iunix/include -I../unix/include -I/nix/store/7asvmiiws8zz3c8krxpypgrx59a45da6-nix-util-2.36.0pre-dev/include -I/nix/store/kp61vxk6fc6mygavw8jbcp46rv0vhykr-libarchive-3.8.9-dev/include -I/nix/store/isybn536j7an8p4nrj0pl5ykwda6nxqq-nlohmann_json-3.12.0/include -I/nix/store/qdhck8lm021frd70ixahv7r9gsl2vwl9-curl-8.22.0-dev/include -I/nix/store/r9cljv2bvqi3ci3n6m0z0wi3ldpvlyzq-sqlite-3.53.3-dev/include -I/nix/store/3lahs2g34zsq4r6cn4yp25rxzy1h7zgq-aws-crt-cpp-0.34.3-dev/include -I/nix/store/6jh8nc6lcl14vgxdjk3icr2r1yfzdql1-aws-c-mqtt-0.13.3/inc…
libnixstore.2.36.0.dylib.p/nixstore-unity0.cpp:3:9: fatal error: '/private/var/tb/2/scratch/7ddb4f797ca8914a/build/source/src/libstore/build/build/build-log.cc' file not found
3 | #include</private/var/tb/2/scratch/7ddb4f797ca8914a/build/source/src/libstore/build/build/build-log.cc>
| ^~~~~~~~~~~~~~~~~~~~~~~~~~~~~~~~~~~~~~~~~~~~~~~~~~~~~~~~~~~~~~~~~~~~~~~~~~~~~~~~~~~~~~~~~~~~~~~
1 error generated.
ninja: build stopped: subcommand failed.
|
| failed eval |
checks.aarch64-darwin.home-manager-macos
|
— |
error:
… while calling the 'derivationStrict' builtin
at «nix-internal»/derivation-internal.nix:37:12:
36|
37| strict = …
error:
… while calling the 'derivationStrict' builtin
at «nix-internal»/derivation-internal.nix:37:12:
36|
37| strict = derivationStrict drvAttrs;
| ^
38|
… while evaluating derivation 'home-manager-generation'
whose name attribute is located at «git+https://github.com/Mic92/nixpkgs?ref=main&rev=7c0a10b72c9f69917b6020f8f4d1d6ef1980b7ec&shallow=1»/pkgs/stdenv/generic/make-derivation.nix:651:11
… while evaluating attribute 'buildCommand' of derivation 'home-manager-generation'
at «git+https://github.com/Mic92/nixpkgs?ref=main&rev=7c0a10b72c9f69917b6020f8f4d1d6ef1980b7ec&shallow=1»/pkgs/build-support/trivial-builders/default.nix:88:9:
87| inherit name;
88| buildCommand = lib.toFunction buildCommand finalAttrs;
| ^
89| passAsFile = defaultPassAsFile ++ (userAttrs.passAsFile or [ ]);
… while evaluating the option `home.activation.checkFilesChanged.data':
… while evaluating definitions from `/nix/store/bwfz2y5gxv0fzf2z7b2l5zwp2a5c4qm7-source/modules/files.nix':
… while evaluating the option `home.file."Library/Fonts/.home-manager-fonts-version".onChange':
… while evaluating definitions from `/nix/store/bwfz2y5gxv0fzf2z7b2l5zwp2a5c4qm7-source/modules/targets/darwin/fonts.nix':
(stack trace truncated; use '--show-trace' to show the full, detailed trace)
error: Refusing to evaluate package 'radicle-node-1.10.3' in /nix/store/c73xscvypq4slnj3k075sy076gfnyb8q-source/pkgs/by-name/ra/radicle-node/package.nix:165 because it is marked as insecure
Known issues:
- Private repositories are insecure: traffic between nodes is not encrypted and not authenticated.
You can install it anyway by allowing this package, using the
following methods:
a) To temporarily allow all insecure packages, you can use an environment
variable for a single invocation of the nix tools:
$ export NIXPKGS_ALLOW_INSECURE=1
Note: When using `nix shell`, `nix build`, `nix develop`, etc with a flake,
then pass `--impure` in order to allow use of environment variables.
b) for `nixos-rebuild` you can add ‘radicle-node-1.10.3’ to
`nixpkgs.config.permittedInsecurePackages` in the configuration.nix,
like so:
{
nixpkgs.config.permittedInsecurePackages = [
"radicle-node-1.10.3"
];
}
c) For `nix-env`, `nix-build`, `nix-shell` or any other Nix command you can add
‘radicle-node-1.10.3’ to `permittedInsecurePackages` in
~/.config/nixpkgs/config.nix, like so:
{
permittedInsecurePackages = [
"radicle-node-1.10.3"
];
}
|
| failed |
checks.aarch64-darwin.home-manager-utm-vm
|
11m 19s |
nix-store-2.36.0pre:
[1/2] Compiling C++ object libnixstore.2.36.0.dylib.p/meson-generated_nixstore-unity0.cpp.o
FAILED: [code=1] libnixstore.2.36.0.dylib.p/mes …
nix-store-2.36.0pre:
[1/2] Compiling C++ object libnixstore.2.36.0.dylib.p/meson-generated_nixstore-unity0.cpp.o
FAILED: [code=1] libnixstore.2.36.0.dylib.p/meson-generated_nixstore-unity0.cpp.o
clang++ -Ilibnixstore.2.36.0.dylib.p -I. -I.. -Iinclude -I../include -I../darwin/build -I../unix/build -Iunix/include -I../unix/include -I/nix/store/7asvmiiws8zz3c8krxpypgrx59a45da6-nix-util-2.36.0pre-dev/include -I/nix/store/kp61vxk6fc6mygavw8jbcp46rv0vhykr-libarchive-3.8.9-dev/include -I/nix/store/isybn536j7an8p4nrj0pl5ykwda6nxqq-nlohmann_json-3.12.0/include -I/nix/store/qdhck8lm021frd70ixahv7r9gsl2vwl9-curl-8.22.0-dev/include -I/nix/store/r9cljv2bvqi3ci3n6m0z0wi3ldpvlyzq-sqlite-3.53.3-dev/include -I/nix/store/3lahs2g34zsq4r6cn4yp25rxzy1h7zgq-aws-crt-cpp-0.34.3-dev/include -I/nix/store/6jh8nc6lcl14vgxdjk3icr2r1yfzdql1-aws-c-mqtt-0.13.3/inc…
libnixstore.2.36.0.dylib.p/nixstore-unity0.cpp:3:9: fatal error: '/private/var/tb/2/scratch/ae69eeca3c1bf2f4/build/source/src/libstore/build/build/build-log.cc' file not found
3 | #include</private/var/tb/2/scratch/ae69eeca3c1bf2f4/build/source/src/libstore/build/build/build-log.cc>
| ^~~~~~~~~~~~~~~~~~~~~~~~~~~~~~~~~~~~~~~~~~~~~~~~~~~~~~~~~~~~~~~~~~~~~~~~~~~~~~~~~~~~~~~~~~~~~~~
1 error generated.
ninja: build stopped: subcommand failed.
|
| failed |
checks.aarch64-linux.home-manager-common
|
8m 10s |
nix-store-2.36.0pre:
[1/2] Compiling C++ object libnixstore.so.2.36.0.p/meson-generated_nixstore-unity0.cpp.o
FAILED: [code=1] libnixstore.so.2.36.0.p/meson-gen …
nix-store-2.36.0pre:
[1/2] Compiling C++ object libnixstore.so.2.36.0.p/meson-generated_nixstore-unity0.cpp.o
FAILED: [code=1] libnixstore.so.2.36.0.p/meson-generated_nixstore-unity0.cpp.o
g++ -Ilibnixstore.so.2.36.0.p -I. -I.. -Iinclude -I../include -I../linux/build -Ilinux/include -I../linux/include -I../unix/build -Iunix/include -I../unix/include -I/nix/store/ij1lfnkk4vchm802p42m9ff79mk7qdaf-nix-util-2.36.0pre-dev/include -I/nix/store/vyh87fnmi02f9fmfb9isyh88fcwqwbx2-libarchive-3.8.9-dev/include -I/nix/store/n2wqh700746f46rkcx78ig3wrz34znky-nlohmann_json-3.12.0/include -I/nix/store/l54xxyh3havpk0qwr0pdz4cdn0vrhjv3-curl-8.22.0-dev/include -I/nix/store/psmxcw2g7rilz53xa189fxzl7y1i485k-libseccomp-2.6.1-dev/include -I/nix/store/74r7ps7mmjw10fl23xsgcp7ss09jrkjr-sqlite-3.53.3-dev/include -I/nix/store/067660n0flakidqdninb6l8r6xmi7…
libnixstore.so.2.36.0.p/nixstore-unity0.cpp:3:9: fatal error: /build/source/src/libstore/build/build/build-log.cc: No such file or directory
3 | #include</build/source/src/libstore/build/build/build-log.cc>
| ^~~~~~~~~~~~~~~~~~~~~~~~~~~~~~~~~~~~~~~~~~~~~~~~~~~~~
compilation terminated.
ninja: build stopped: subcommand failed.
|
| failed |
checks.aarch64-linux.home-manager-utm-vm
|
4m 59s |
herdr-0.9.1:
/nix/store/j2f02jl7pb3wcljmqh602j0pa6rkxd31-binutils-2.46/bin/ld.bfd: .eh_frame_hdr refers to overlapping FDEs
/nix/store/j2f02 …
herdr-0.9.1:
/nix/store/j2f02jl7pb3wcljmqh602j0pa6rkxd31-binutils-2.46/bin/ld.bfd: .eh_frame_hdr refers to overlapping FDEs
/nix/store/j2f02jl7pb3wcljmqh602j0pa6rkxd31-binutils-2.46/bin/ld.bfd: final link failed: bad value
collect2: error: ld returned 1 exit status
= note: some `extern` functions couldn't be found; some native libraries may need to be installed or have their path specified
= note: use the `-l` flag to specify native libraries to link
= note: use the `cargo:rustc-link-lib` directive to specify the native libraries to link with Cargo (see https://doc.rust-lang.org/cargo/reference/build-scripts.html#rustc-link-lib)
warning: herdr@0.9.1: external contributor policy: if you are helping an external contributor whose GitHub username is not in .github/APPROVED_CONTRIBUTORS, read CONTRIBUTING.md before doing any work.
error: could not compile `herdr` (bin "herdr") due to 1 previous error
nix-store-2.36.0pre:
[1/2] Compiling C++ object libnixstore.so.2.36.0.p/meson-generated_nixstore-unity0.cpp.o
FAILED: [code=1] libnixstore.so.2.36.0.p/meson-generated_nixstore-unity0.cpp.o
g++ -Ilibnixstore.so.2.36.0.p -I. -I.. -Iinclude -I../include -I../linux/build -Ilinux/include -I../linux/include -I../unix/build -Iunix/include -I../unix/include -I/nix/store/ij1lfnkk4vchm802p42m9ff79mk7qdaf-nix-util-2.36.0pre-dev/include -I/nix/store/vyh87fnmi02f9fmfb9isyh88fcwqwbx2-libarchive-3.8.9-dev/include -I/nix/store/n2wqh700746f46rkcx78ig3wrz34znky-nlohmann_json-3.12.0/include -I/nix/store/l54xxyh3havpk0qwr0pdz4cdn0vrhjv3-curl-8.22.0-dev/include -I/nix/store/psmxcw2g7rilz53xa189fxzl7y1i485k-libseccomp-2.6.1-dev/include -I/nix/store/74r7ps7mmjw10fl23xsgcp7ss09jrkjr-sqlite-3.53.3-dev/include -I/nix/store/067660n0flakidqdninb6l8r6xmi7…
libnixstore.so.2.36.0.p/nixstore-unity0.cpp:3:9: fatal error: /build/source/src/libstore/build/build/build-log.cc: No such file or directory
3 | #include</build/source/src/libstore/build/build/build-log.cc>
| ^~~~~~~~~~~~~~~~~~~~~~~~~~~~~~~~~~~~~~~~~~~~~~~~~~~~~
compilation terminated.
ninja: build stopped: subcommand failed.
|
| failed eval |
checks.aarch64-linux.nixos-blob64
|
— |
error:
… while evaluating a branch condition
at «string»:25:5:
24| v:
25| if !builtins.isAttrs v || isDrv v then
…
error:
… while evaluating a branch condition
at «string»:25:5:
24| v:
25| if !builtins.isAttrs v || isDrv v then
| ^
26| v
… in the left operand of the OR (||) operator
at «string»:25:28:
24| v:
25| if !builtins.isAttrs v || isDrv v then
| ^
26| v
… while evaluating the option `system.build.toplevel':
… while evaluating definitions from `/nix/store/c73xscvypq4slnj3k075sy076gfnyb8q-source/nixos/modules/system/activation/top-level.nix':
… while evaluating the option `systemd.services.radicle-node.serviceConfig':
… while evaluating definitions from `/nix/store/c73xscvypq4slnj3k075sy076gfnyb8q-source/nixos/modules/services/misc/radicle.nix':
(stack trace truncated; use '--show-trace' to show the full, detailed trace)
error: Refusing to evaluate package 'radicle-node-1.10.3' in /nix/store/c73xscvypq4slnj3k075sy076gfnyb8q-source/pkgs/by-name/ra/radicle-node/package.nix:165 because it is marked as insecure
Known issues:
- Private repositories are insecure: traffic between nodes is not encrypted and not authenticated.
You can install it anyway by allowing this package, using the
following methods:
a) To temporarily allow all insecure packages, you can use an environment
variable for a single invocation of the nix tools:
$ export NIXPKGS_ALLOW_INSECURE=1
Note: When using `nix shell`, `nix build`, `nix develop`, etc with a flake,
then pass `--impure` in order to allow use of environment variables.
b) for `nixos-rebuild` you can add ‘radicle-node-1.10.3’ to
`nixpkgs.config.permittedInsecurePackages` in the configuration.nix,
like so:
{
nixpkgs.config.permittedInsecurePackages = [
"radicle-node-1.10.3"
];
}
c) For `nix-env`, `nix-build`, `nix-shell` or any other Nix command you can add
‘radicle-node-1.10.3’ to `permittedInsecurePackages` in
~/.config/nixpkgs/config.nix, like so:
{
permittedInsecurePackages = [
"radicle-node-1.10.3"
];
}
|
| failed |
checks.x86_64-linux.home-manager-bernie
|
12m 24s |
nix-store-2.36.0pre:
[1/2] Compiling C++ object libnixstore.so.2.36.0.p/meson-generated_nixstore-unity0.cpp.o
FAILED: [code=1] libnixstore.so.2.36.0.p/meson-gen …
nix-store-2.36.0pre:
[1/2] Compiling C++ object libnixstore.so.2.36.0.p/meson-generated_nixstore-unity0.cpp.o
FAILED: [code=1] libnixstore.so.2.36.0.p/meson-generated_nixstore-unity0.cpp.o
g++ -Ilibnixstore.so.2.36.0.p -I. -I.. -Iinclude -I../include -I../linux/build -Ilinux/include -I../linux/include -I../unix/build -Iunix/include -I../unix/include -I/nix/store/la1rzzb3q1wjdz50dyvh62fix41ayifa-nix-util-2.36.0pre-dev/include -I/nix/store/2ybid2fqf6nfqrwcgizv9qvvckyp6axh-libarchive-3.8.9-dev/include -I/nix/store/0dz9bi5rv50d46w8xykwdxrj4ssy6pnp-nlohmann_json-3.12.0/include -I/nix/store/aph5dkajglxjn9642bp0h3x7cwzijr52-curl-8.22.0-dev/include -I/nix/store/q2yrf8yhmj405nv9qbbraxr8wlz7n5kv-libseccomp-2.6.1-dev/include -I/nix/store/xrcjl59yi7zswbv0vzm8cmvw4vplsbgj-sqlite-3.53.3-dev/include -I/nix/store/2zgasbvd9mzmj145mxsmnzxiy7rnz…
libnixstore.so.2.36.0.p/nixstore-unity0.cpp:3:9: fatal error: /build/source/src/libstore/build/build/build-log.cc: No such file or directory
3 | #include</build/source/src/libstore/build/build/build-log.cc>
| ^~~~~~~~~~~~~~~~~~~~~~~~~~~~~~~~~~~~~~~~~~~~~~~~~~~~~
compilation terminated.
ninja: build stopped: subcommand failed.
|
| failed |
checks.x86_64-linux.home-manager-coder
|
20m 50s |
herdr-0.9.1:
|
= note: "/nix/store/j1938gsbvbhkyz4kbmvjk56r479mkw3s-gcc-wrapper-16.2.0/bin/cc" "-m64" "/build/source/target/x86_64-unknown-linux-gnu/releas …
herdr-0.9.1:
|
= note: "/nix/store/j1938gsbvbhkyz4kbmvjk56r479mkw3s-gcc-wrapper-16.2.0/bin/cc" "-m64" "/build/source/target/x86_64-unknown-linux-gnu/release/deps/rustccR9lIW/symbols.o" "<17 object files omitted>" "-Wl,--as-needed" "-Wl,-Bstatic" "-lghostty-vt" "/build/source/target/x86_64-unknown-linux-gnu/release/deps/{libpng-54386eb7a14b83bf,libbitflags-fa462dbced21372d,libflate2-867594931100dbc4,libminiz_oxide-7ae36ca81de61fe4,libfdeflate-8bfaf3d13e799018,libsimd_adler32-6c2fb6b10a4c2e62,libcrc32fast-d78482ef999ab85e,libserde_ignored-2eeac271084da52f,libctrlc-d8d63052612d1d48,libnix-534e14fcf215d8dc,libtoml-95ac1eaca142fbe1,libtoml_edit-a4a10777d1ad5…
= note: some arguments are omitted. use `--verbose` to show all linker arguments
= note: /nix/store/y5sgl0vvrpbcwgjwpjs60r1hg0gi7i0n-binutils-2.46/bin/ld.bfd: .eh_frame_hdr refers to overlapping FDEs
/nix/store/y5sgl0vvrpbcwgjwpjs60r1hg0gi7i0n-binutils-2.46/bin/ld.bfd: final link failed: bad value
collect2: error: ld returned 1 exit status
warning: herdr@0.9.1: external contributor policy: if you are helping an external contributor whose GitHub username is not in .github/APPROVED_CONTRIBUTORS, read CONTRIBUTING.md before doing any work.
error: could not compile `herdr` (bin "herdr") due to 1 previous error
nix-store-2.36.0pre:
[1/2] Compiling C++ object libnixstore.so.2.36.0.p/meson-generated_nixstore-unity0.cpp.o
FAILED: [code=1] libnixstore.so.2.36.0.p/meson-generated_nixstore-unity0.cpp.o
g++ -Ilibnixstore.so.2.36.0.p -I. -I.. -Iinclude -I../include -I../linux/build -Ilinux/include -I../linux/include -I../unix/build -Iunix/include -I../unix/include -I/nix/store/la1rzzb3q1wjdz50dyvh62fix41ayifa-nix-util-2.36.0pre-dev/include -I/nix/store/2ybid2fqf6nfqrwcgizv9qvvckyp6axh-libarchive-3.8.9-dev/include -I/nix/store/0dz9bi5rv50d46w8xykwdxrj4ssy6pnp-nlohmann_json-3.12.0/include -I/nix/store/aph5dkajglxjn9642bp0h3x7cwzijr52-curl-8.22.0-dev/include -I/nix/store/q2yrf8yhmj405nv9qbbraxr8wlz7n5kv-libseccomp-2.6.1-dev/include -I/nix/store/xrcjl59yi7zswbv0vzm8cmvw4vplsbgj-sqlite-3.53.3-dev/include -I/nix/store/2zgasbvd9mzmj145mxsmnzxiy7rnz…
libnixstore.so.2.36.0.p/nixstore-unity0.cpp:3:9: fatal error: /build/source/src/libstore/build/build/build-log.cc: No such file or directory
3 | #include</build/source/src/libstore/build/build/build-log.cc>
| ^~~~~~~~~~~~~~~~~~~~~~~~~~~~~~~~~~~~~~~~~~~~~~~~~~~~~
compilation terminated.
ninja: build stopped: subcommand failed.
|
| failed |
checks.x86_64-linux.home-manager-common
|
12m 21s |
nix-store-2.36.0pre:
[1/2] Compiling C++ object libnixstore.so.2.36.0.p/meson-generated_nixstore-unity0.cpp.o
FAILED: [code=1] libnixstore.so.2.36.0.p/meson-gen …
nix-store-2.36.0pre:
[1/2] Compiling C++ object libnixstore.so.2.36.0.p/meson-generated_nixstore-unity0.cpp.o
FAILED: [code=1] libnixstore.so.2.36.0.p/meson-generated_nixstore-unity0.cpp.o
g++ -Ilibnixstore.so.2.36.0.p -I. -I.. -Iinclude -I../include -I../linux/build -Ilinux/include -I../linux/include -I../unix/build -Iunix/include -I../unix/include -I/nix/store/la1rzzb3q1wjdz50dyvh62fix41ayifa-nix-util-2.36.0pre-dev/include -I/nix/store/2ybid2fqf6nfqrwcgizv9qvvckyp6axh-libarchive-3.8.9-dev/include -I/nix/store/0dz9bi5rv50d46w8xykwdxrj4ssy6pnp-nlohmann_json-3.12.0/include -I/nix/store/aph5dkajglxjn9642bp0h3x7cwzijr52-curl-8.22.0-dev/include -I/nix/store/q2yrf8yhmj405nv9qbbraxr8wlz7n5kv-libseccomp-2.6.1-dev/include -I/nix/store/xrcjl59yi7zswbv0vzm8cmvw4vplsbgj-sqlite-3.53.3-dev/include -I/nix/store/2zgasbvd9mzmj145mxsmnzxiy7rnz…
libnixstore.so.2.36.0.p/nixstore-unity0.cpp:3:9: fatal error: /build/source/src/libstore/build/build/build-log.cc: No such file or directory
3 | #include</build/source/src/libstore/build/build/build-log.cc>
| ^~~~~~~~~~~~~~~~~~~~~~~~~~~~~~~~~~~~~~~~~~~~~~~~~~~~~
compilation terminated.
ninja: build stopped: subcommand failed.
|
| failed eval |
checks.x86_64-linux.home-manager-desktop
|
— |
error:
… while calling the 'derivationStrict' builtin
at «nix-internal»/derivation-internal.nix:37:12:
36|
37| strict = …
error:
… while calling the 'derivationStrict' builtin
at «nix-internal»/derivation-internal.nix:37:12:
36|
37| strict = derivationStrict drvAttrs;
| ^
38|
… while evaluating derivation 'home-manager-generation'
whose name attribute is located at «git+https://github.com/Mic92/nixpkgs?ref=main&rev=7c0a10b72c9f69917b6020f8f4d1d6ef1980b7ec&shallow=1»/pkgs/stdenv/generic/make-derivation.nix:651:11
… while evaluating attribute 'buildCommand' of derivation 'home-manager-generation'
at «git+https://github.com/Mic92/nixpkgs?ref=main&rev=7c0a10b72c9f69917b6020f8f4d1d6ef1980b7ec&shallow=1»/pkgs/build-support/trivial-builders/default.nix:88:9:
87| inherit name;
88| buildCommand = lib.toFunction buildCommand finalAttrs;
| ^
89| passAsFile = defaultPassAsFile ++ (userAttrs.passAsFile or [ ]);
… while evaluating the option `home.activation.installPackages.data':
… while evaluating definitions from `/nix/store/bwfz2y5gxv0fzf2z7b2l5zwp2a5c4qm7-source/modules/home-environment.nix':
(stack trace truncated; use '--show-trace' to show the full, detailed trace)
error: Refusing to evaluate package 'radicle-node-1.10.3' in /nix/store/c73xscvypq4slnj3k075sy076gfnyb8q-source/pkgs/by-name/ra/radicle-node/package.nix:165 because it is marked as insecure
Known issues:
- Private repositories are insecure: traffic between nodes is not encrypted and not authenticated.
You can install it anyway by allowing this package, using the
following methods:
a) To temporarily allow all insecure packages, you can use an environment
variable for a single invocation of the nix tools:
$ export NIXPKGS_ALLOW_INSECURE=1
Note: When using `nix shell`, `nix build`, `nix develop`, etc with a flake,
then pass `--impure` in order to allow use of environment variables.
b) for `nixos-rebuild` you can add ‘radicle-node-1.10.3’ to
`nixpkgs.config.permittedInsecurePackages` in the configuration.nix,
like so:
{
nixpkgs.config.permittedInsecurePackages = [
"radicle-node-1.10.3"
];
}
c) For `nix-env`, `nix-build`, `nix-shell` or any other Nix command you can add
‘radicle-node-1.10.3’ to `permittedInsecurePackages` in
~/.config/nixpkgs/config.nix, like so:
{
permittedInsecurePackages = [
"radicle-node-1.10.3"
];
}
|
| failed |
checks.x86_64-linux.home-manager-eve
|
17m 36s |
herdr-0.9.1:
|
= note: "/nix/store/j1938gsbvbhkyz4kbmvjk56r479mkw3s-gcc-wrapper-16.2.0/bin/cc" "-m64" "/build/source/target/x86_64-unknown-linux-gnu/releas …
herdr-0.9.1:
|
= note: "/nix/store/j1938gsbvbhkyz4kbmvjk56r479mkw3s-gcc-wrapper-16.2.0/bin/cc" "-m64" "/build/source/target/x86_64-unknown-linux-gnu/release/deps/rustcJjlJDX/symbols.o" "<17 object files omitted>" "-Wl,--as-needed" "-Wl,-Bstatic" "-lghostty-vt" "/build/source/target/x86_64-unknown-linux-gnu/release/deps/{libpng-54386eb7a14b83bf,libbitflags-fa462dbced21372d,libflate2-867594931100dbc4,libminiz_oxide-7ae36ca81de61fe4,libfdeflate-8bfaf3d13e799018,libsimd_adler32-6c2fb6b10a4c2e62,libcrc32fast-d78482ef999ab85e,libserde_ignored-2eeac271084da52f,libctrlc-d8d63052612d1d48,libnix-534e14fcf215d8dc,libtoml-95ac1eaca142fbe1,libtoml_edit-a4a10777d1ad5…
= note: some arguments are omitted. use `--verbose` to show all linker arguments
= note: /nix/store/y5sgl0vvrpbcwgjwpjs60r1hg0gi7i0n-binutils-2.46/bin/ld.bfd: .eh_frame_hdr refers to overlapping FDEs
/nix/store/y5sgl0vvrpbcwgjwpjs60r1hg0gi7i0n-binutils-2.46/bin/ld.bfd: final link failed: bad value
collect2: error: ld returned 1 exit status
warning: herdr@0.9.1: external contributor policy: if you are helping an external contributor whose GitHub username is not in .github/APPROVED_CONTRIBUTORS, read CONTRIBUTING.md before doing any work.
error: could not compile `herdr` (bin "herdr") due to 1 previous error
nix-store-2.36.0pre:
[1/2] Compiling C++ object libnixstore.so.2.36.0.p/meson-generated_nixstore-unity0.cpp.o
FAILED: [code=1] libnixstore.so.2.36.0.p/meson-generated_nixstore-unity0.cpp.o
g++ -Ilibnixstore.so.2.36.0.p -I. -I.. -Iinclude -I../include -I../linux/build -Ilinux/include -I../linux/include -I../unix/build -Iunix/include -I../unix/include -I/nix/store/la1rzzb3q1wjdz50dyvh62fix41ayifa-nix-util-2.36.0pre-dev/include -I/nix/store/2ybid2fqf6nfqrwcgizv9qvvckyp6axh-libarchive-3.8.9-dev/include -I/nix/store/0dz9bi5rv50d46w8xykwdxrj4ssy6pnp-nlohmann_json-3.12.0/include -I/nix/store/aph5dkajglxjn9642bp0h3x7cwzijr52-curl-8.22.0-dev/include -I/nix/store/q2yrf8yhmj405nv9qbbraxr8wlz7n5kv-libseccomp-2.6.1-dev/include -I/nix/store/xrcjl59yi7zswbv0vzm8cmvw4vplsbgj-sqlite-3.53.3-dev/include -I/nix/store/2zgasbvd9mzmj145mxsmnzxiy7rnz…
libnixstore.so.2.36.0.p/nixstore-unity0.cpp:3:9: fatal error: /build/source/src/libstore/build/build/build-log.cc: No such file or directory
3 | #include</build/source/src/libstore/build/build/build-log.cc>
| ^~~~~~~~~~~~~~~~~~~~~~~~~~~~~~~~~~~~~~~~~~~~~~~~~~~~~
compilation terminated.
ninja: build stopped: subcommand failed.
|
| failed |
checks.x86_64-linux.home-manager-mic92
|
12m 11s |
nix-store-2.36.0pre:
[1/2] Compiling C++ object libnixstore.so.2.36.0.p/meson-generated_nixstore-unity0.cpp.o
FAILED: [code=1] libnixstore.so.2.36.0.p/meson-gen …
nix-store-2.36.0pre:
[1/2] Compiling C++ object libnixstore.so.2.36.0.p/meson-generated_nixstore-unity0.cpp.o
FAILED: [code=1] libnixstore.so.2.36.0.p/meson-generated_nixstore-unity0.cpp.o
g++ -Ilibnixstore.so.2.36.0.p -I. -I.. -Iinclude -I../include -I../linux/build -Ilinux/include -I../linux/include -I../unix/build -Iunix/include -I../unix/include -I/nix/store/la1rzzb3q1wjdz50dyvh62fix41ayifa-nix-util-2.36.0pre-dev/include -I/nix/store/2ybid2fqf6nfqrwcgizv9qvvckyp6axh-libarchive-3.8.9-dev/include -I/nix/store/0dz9bi5rv50d46w8xykwdxrj4ssy6pnp-nlohmann_json-3.12.0/include -I/nix/store/aph5dkajglxjn9642bp0h3x7cwzijr52-curl-8.22.0-dev/include -I/nix/store/q2yrf8yhmj405nv9qbbraxr8wlz7n5kv-libseccomp-2.6.1-dev/include -I/nix/store/xrcjl59yi7zswbv0vzm8cmvw4vplsbgj-sqlite-3.53.3-dev/include -I/nix/store/2zgasbvd9mzmj145mxsmnzxiy7rnz…
libnixstore.so.2.36.0.p/nixstore-unity0.cpp:3:9: fatal error: /build/source/src/libstore/build/build/build-log.cc: No such file or directory
3 | #include</build/source/src/libstore/build/build/build-log.cc>
| ^~~~~~~~~~~~~~~~~~~~~~~~~~~~~~~~~~~~~~~~~~~~~~~~~~~~~
compilation terminated.
ninja: build stopped: subcommand failed.
|
| failed |
checks.x86_64-linux.home-manager-utm-vm
|
17m 38s |
nix-store-2.36.0pre:
[1/2] Compiling C++ object libnixstore.so.2.36.0.p/meson-generated_nixstore-unity0.cpp.o
FAILED: [code=1] libnixstore.so.2.36.0.p/meson-gen …
nix-store-2.36.0pre:
[1/2] Compiling C++ object libnixstore.so.2.36.0.p/meson-generated_nixstore-unity0.cpp.o
FAILED: [code=1] libnixstore.so.2.36.0.p/meson-generated_nixstore-unity0.cpp.o
g++ -Ilibnixstore.so.2.36.0.p -I. -I.. -Iinclude -I../include -I../linux/build -Ilinux/include -I../linux/include -I../unix/build -Iunix/include -I../unix/include -I/nix/store/la1rzzb3q1wjdz50dyvh62fix41ayifa-nix-util-2.36.0pre-dev/include -I/nix/store/2ybid2fqf6nfqrwcgizv9qvvckyp6axh-libarchive-3.8.9-dev/include -I/nix/store/0dz9bi5rv50d46w8xykwdxrj4ssy6pnp-nlohmann_json-3.12.0/include -I/nix/store/aph5dkajglxjn9642bp0h3x7cwzijr52-curl-8.22.0-dev/include -I/nix/store/q2yrf8yhmj405nv9qbbraxr8wlz7n5kv-libseccomp-2.6.1-dev/include -I/nix/store/xrcjl59yi7zswbv0vzm8cmvw4vplsbgj-sqlite-3.53.3-dev/include -I/nix/store/2zgasbvd9mzmj145mxsmnzxiy7rnz…
libnixstore.so.2.36.0.p/nixstore-unity0.cpp:3:9: fatal error: /build/source/src/libstore/build/build/build-log.cc: No such file or directory
3 | #include</build/source/src/libstore/build/build/build-log.cc>
| ^~~~~~~~~~~~~~~~~~~~~~~~~~~~~~~~~~~~~~~~~~~~~~~~~~~~~
compilation terminated.
ninja: build stopped: subcommand failed.
herdr-0.9.1:
|
= note: "/nix/store/j1938gsbvbhkyz4kbmvjk56r479mkw3s-gcc-wrapper-16.2.0/bin/cc" "-m64" "/build/source/target/x86_64-unknown-linux-gnu/release/deps/rustcWRZZXP/symbols.o" "<17 object files omitted>" "-Wl,--as-needed" "-Wl,-Bstatic" "-lghostty-vt" "/build/source/target/x86_64-unknown-linux-gnu/release/deps/{libpng-54386eb7a14b83bf,libbitflags-fa462dbced21372d,libflate2-867594931100dbc4,libminiz_oxide-7ae36ca81de61fe4,libfdeflate-8bfaf3d13e799018,libsimd_adler32-6c2fb6b10a4c2e62,libcrc32fast-d78482ef999ab85e,libserde_ignored-2eeac271084da52f,libctrlc-d8d63052612d1d48,libnix-534e14fcf215d8dc,libtoml-95ac1eaca142fbe1,libtoml_edit-a4a10777d1ad5…
= note: some arguments are omitted. use `--verbose` to show all linker arguments
= note: /nix/store/y5sgl0vvrpbcwgjwpjs60r1hg0gi7i0n-binutils-2.46/bin/ld.bfd: .eh_frame_hdr refers to overlapping FDEs
/nix/store/y5sgl0vvrpbcwgjwpjs60r1hg0gi7i0n-binutils-2.46/bin/ld.bfd: final link failed: bad value
collect2: error: ld returned 1 exit status
warning: herdr@0.9.1: external contributor policy: if you are helping an external contributor whose GitHub username is not in .github/APPROVED_CONTRIBUTORS, read CONTRIBUTING.md before doing any work.
error: could not compile `herdr` (bin "herdr") due to 1 previous error
|
| failed eval |
checks.x86_64-linux.nixos-eva
|
— |
error:
… while evaluating a branch condition
at «string»:25:5:
24| v:
25| if !builtins.isAttrs v || isDrv v then
…
error:
… while evaluating a branch condition
at «string»:25:5:
24| v:
25| if !builtins.isAttrs v || isDrv v then
| ^
26| v
… in the left operand of the OR (||) operator
at «string»:25:28:
24| v:
25| if !builtins.isAttrs v || isDrv v then
| ^
26| v
… while evaluating the option `system.build.toplevel':
… while evaluating definitions from `/nix/store/c73xscvypq4slnj3k075sy076gfnyb8q-source/nixos/modules/system/activation/top-level.nix':
… while evaluating the option `systemd.services.radicle-node.serviceConfig':
… while evaluating definitions from `/nix/store/c73xscvypq4slnj3k075sy076gfnyb8q-source/nixos/modules/services/misc/radicle.nix':
(stack trace truncated; use '--show-trace' to show the full, detailed trace)
error: Refusing to evaluate package 'radicle-node-1.10.3' in /nix/store/c73xscvypq4slnj3k075sy076gfnyb8q-source/pkgs/by-name/ra/radicle-node/package.nix:165 because it is marked as insecure
Known issues:
- Private repositories are insecure: traffic between nodes is not encrypted and not authenticated.
You can install it anyway by allowing this package, using the
following methods:
a) To temporarily allow all insecure packages, you can use an environment
variable for a single invocation of the nix tools:
$ export NIXPKGS_ALLOW_INSECURE=1
Note: When using `nix shell`, `nix build`, `nix develop`, etc with a flake,
then pass `--impure` in order to allow use of environment variables.
b) for `nixos-rebuild` you can add ‘radicle-node-1.10.3’ to
`nixpkgs.config.permittedInsecurePackages` in the configuration.nix,
like so:
{
nixpkgs.config.permittedInsecurePackages = [
"radicle-node-1.10.3"
];
}
c) For `nix-env`, `nix-build`, `nix-shell` or any other Nix command you can add
‘radicle-node-1.10.3’ to `permittedInsecurePackages` in
~/.config/nixpkgs/config.nix, like so:
{
permittedInsecurePackages = [
"radicle-node-1.10.3"
];
}
|
| failed eval |
checks.x86_64-linux.nixos-eve
|
— |
error:
… while evaluating a branch condition
at «string»:25:5:
24| v:
25| if !builtins.isAttrs v || isDrv v then
…
error:
… while evaluating a branch condition
at «string»:25:5:
24| v:
25| if !builtins.isAttrs v || isDrv v then
| ^
26| v
… in the left operand of the OR (||) operator
at «string»:25:28:
24| v:
25| if !builtins.isAttrs v || isDrv v then
| ^
26| v
… while evaluating the option `system.build.toplevel':
… while evaluating definitions from `/nix/store/c73xscvypq4slnj3k075sy076gfnyb8q-source/nixos/modules/system/activation/top-level.nix':
… while evaluating the option `warnings':
… while evaluating definitions from `/nix/store/c73xscvypq4slnj3k075sy076gfnyb8q-source/nixos/modules/system/boot/systemd.nix':
… while evaluating the option `systemd.services.radicle-mirror.serviceConfig':
… while evaluating definitions from `/nix/store/hwxl98gkfpqbhs2d01szc0cv1cbc56rd-source/nix/module.nix':
(stack trace truncated; use '--show-trace' to show the full, detailed trace)
error: Refusing to evaluate package 'radicle-node-1.10.3' in /nix/store/c73xscvypq4slnj3k075sy076gfnyb8q-source/pkgs/by-name/ra/radicle-node/package.nix:165 because it is marked as insecure
Known issues:
- Private repositories are insecure: traffic between nodes is not encrypted and not authenticated.
You can install it anyway by allowing this package, using the
following methods:
a) To temporarily allow all insecure packages, you can use an environment
variable for a single invocation of the nix tools:
$ export NIXPKGS_ALLOW_INSECURE=1
Note: When using `nix shell`, `nix build`, `nix develop`, etc with a flake,
then pass `--impure` in order to allow use of environment variables.
b) for `nixos-rebuild` you can add ‘radicle-node-1.10.3’ to
`nixpkgs.config.permittedInsecurePackages` in the configuration.nix,
like so:
{
nixpkgs.config.permittedInsecurePackages = [
"radicle-node-1.10.3"
];
}
c) For `nix-env`, `nix-build`, `nix-shell` or any other Nix command you can add
‘radicle-node-1.10.3’ to `permittedInsecurePackages` in
~/.config/nixpkgs/config.nix, like so:
{
permittedInsecurePackages = [
"radicle-node-1.10.3"
];
}
|