nixbot

builds

cancelled checks.aarch64-darwin.home-manager-utm-vm build #809 · raw · eval 12.3 s · 1.5 GiB allocated · ·

1these 51 derivations will be built:2  /nix/store/0w1qmgxqkn2d93yxaqwdr2xya7qkkfbd-herdr-0.9.5.drv3  /nix/store/1vddz4hma6ywmpailwnx34bx4d2c1rkx-go-mockery-3.8.0.drv4  /nix/store/9lgc90k03pg509hm6kdnqff8i5p73d7k-sesh-2.32.0.drv5  /nix/store/azfc49451xhx5jdf8svzdv3ks4d4ms0h-jscpd-5.4.1.drv6  /nix/store/yjn4yv18a485dnpqb9h6q74qpqd0s8iw-boost-1.89.0.drv7  /nix/store/kxrd4a2xn7nl4916spr86avkrk3wbwg3-nix-util-2.36.0pre.drv8  /nix/store/xi2qm99ll9qv71yik6n0pj5h1b7rj2q1-aws-c-io-0.27.2.drv9  /nix/store/53q9wnh7fpj9dsrn6w6vnk83im9bjh07-aws-c-http-0.11.0.drv10  /nix/store/49bgnnx8s1dsz44pdn4zihgqjx62a1fx-aws-c-auth-0.9.1.drv11  /nix/store/gjbwmfglbj27ri4gcxa7cwndrw0xids0-aws-c-s3-0.8.7.drv12  /nix/store/pr80aq99g69xh53pifv45rwc6g9fgp9s-aws-c-mqtt-0.13.3.drv13  /nix/store/xs405zdcwh150nvlv2akdibbdv5sil79-aws-c-event-stream-0.7.0.drv14  /nix/store/7dbqan8v9zl4lh88wc745q4b1665xkz1-aws-crt-cpp-0.34.3.drv15  /nix/store/q49s2lgz0564dy817ngh2wpb0cj92y6v-nix-store-2.36.0pre.drv16  /nix/store/cavblalszkcxk8c86x3mg55iqwwk4hba-nix-fetchers-2.36.0pre.drv17  /nix/store/nvbapc1x4rihb32vlzhzi79ccrz12ak4-nix-expr-2.36.0pre.drv18  /nix/store/69vaxqkyydrdh4iszxdyi600m5zipg4a-nix-flake-2.36.0pre.drv19  /nix/store/ly3dzh7b69g0dk72dgm8qfdywpm5zh3y-nix-main-2.36.0pre.drv20  /nix/store/0mddy4vqsma54aq9vlwwjjk7d1a5adxn-nix-cmd-2.36.0pre.drv21  /nix/store/py34rs4llgxd4i4fq57a69q30ccc4z2v-nix-util-c-2.36.0pre.drv22  /nix/store/9q2mbmzhrpc1q8d899nd2pmapnsc66mb-nix-store-c-2.36.0pre.drv23  /nix/store/dkdrx4v0yq16fm0shnv3vygq3xwvxylq-nix-main-c-2.36.0pre.drv24  /nix/store/fjs6zrl9f2bkpirhg7ri9scbh7w8cdg2-nix-expr-c-2.36.0pre.drv25  /nix/store/z5r1ys687hlm0j43jpsxl87wzrr1q18i-nix-fetchers-c-2.36.0pre.drv26  /nix/store/rg82fzhx29lql3iy3sg2bvxy3nf8mw1d-nix-flake-c-2.36.0pre.drv27  /nix/store/0kyspm9dzm7bv2969diy76l57yh510xq-nix-2.36.0pre20261015_c9f81f4.drv28  /nix/store/w2wwkbp9c8mm1mbza7w6crz6bcpvrbzb-nix-util-test-support-2.36.0pre.drv29  /nix/store/9vm9ch8b8y8wqmxq3fgn9p8rmqrc9hsx-nix-store-test-support-2.36.0pre.drv30  /nix/store/wlqakxlrlf7d9x0xyzgs600xp1inlmm5-nix-util-test-support-2.36.0pre.drv31  /nix/store/s0mja2i7nxsajvhf3rcks0c6zmnr53jz-nix-expr-tests-2.36.0pre.drv32  /nix/store/0xwacl4yas8gfdyy4gxw68xzdchxn6k4-nix-expr-tests-run.drv33  /nix/store/2iiy9kdaasypxq99mh3g0c144gm7hr3q-nix-manual-2.36.0pre20261015_c9f81f4.drv34  /nix/store/cqlrf2crk2imsira8av5s8x40s4lic5x-nix-flake-tests-2.36.0pre.drv35  /nix/store/4i57ff6v1d6fya7044lfc3xih8c2534y-nix-flake-tests-run.drv36  /nix/store/jmhz83dbsmbakw3k84p510c9sznb6sn7-nix-functional-tests-2.36.0pre20261015_c9f81f4.drv37  /nix/store/flaq6w9y9j0p5fgv043s1h125i32vgdw-nix-fetchers-tests-2.36.0pre.drv38  /nix/store/k0cdxc5yd2makqjdzyr2iyx349z71cn7-nix-fetchers-tests-run.drv39  /nix/store/ibzzwvb11gnq7k3mkhj9lxvjbvhglapg-nix-util-tests-2.36.0pre.drv40  /nix/store/qg3x9bk5pi0mmas7w0dc4d76yzil6sjy-nix-util-tests-run.drv41  /nix/store/gv94p6fw49a516hpdl7wx56cfsqqsmbb-nix-store-tests-2.36.0pre.drv42  /nix/store/s24jnawbvsy92sl3xssa4rff3v0kk0ls-nix-store-tests-run.drv43  /nix/store/gx2w40fl1z4f0k8x6v5900lkvh49mv60-nix-2.36.0pre20261015_c9f81f4.drv44  /nix/store/ysvgx94p3qx5cibkxvjh14rmdxk6i4lb-tuicr-0.27.0.drv45  /nix/store/3wrasj38f1z0lhr3fpr9cqzhl3733d94-home-manager-path.drv46  /nix/store/7c3fa9aj2kklxcqnx9nylncc5iqjfb3q-home-manager-applications.drv47  /nix/store/bvr9613icahihafh0iam4iy2x24rgjry-home-manager-fonts.drv48  /nix/store/ywwk6wjfw6a4v266kkff323imafnb4ml-hm_LibraryFonts.homemanagerfontsversion.drv49  /nix/store/71hcwd97xljb490d6s258sz0isphlyyk-home-manager-files.drv50  /nix/store/7i2jrn4gs5grw1anwb3i15kgh001nqv4-activation-script.drv51  /nix/store/cls66vr7d0m3rh74iz25l23w8mb8kmnl-hm-putter.json.drv52  /nix/store/0jdqvqncfz85smlk9rgnfbzfwg3fzb56-home-manager-generation.drv53building '/nix/store/azfc49451xhx5jdf8svzdv3ks4d4ms0h-jscpd-5.4.1.drv'54building '/nix/store/ysvgx94p3qx5cibkxvjh14rmdxk6i4lb-tuicr-0.27.0.drv'55jscpd-5.4.1> tribuchet: building on mac0256tuicr-0.27.0> tribuchet: building on mac0257jscpd-5.4.1> Using versionCheckHook58jscpd-5.4.1> Running phase: unpackPhase59jscpd-5.4.1> unpacking source archive /nix/store/nxqrvivhyxhrxz5lf3sf4zj9fyygns9w-source60jscpd-5.4.1> source root is source/rust61jscpd-5.4.1> Executing cargoSetupPostUnpackHook62jscpd-5.4.1> Finished cargoSetupPostUnpackHook63jscpd-5.4.1> Running phase: patchPhase64jscpd-5.4.1> Executing cargoSetupPostPatchHook65jscpd-5.4.1> Validating consistency between /private/var/tb/8/scratch/fd725a154ac2733a/build/source/rust/Cargo.lock and /private/var/tb/8/scratch/fd725a154ac2733a/build/jscpd-5.4.1-vendor/Cargo.lock66jscpd-5.4.1> Finished cargoSetupPostPatchHook67jscpd-5.4.1> Running phase: updateAutotoolsGnuConfigScriptsPhase68jscpd-5.4.1> Running phase: configurePhase69jscpd-5.4.1> Running phase: buildPhase70jscpd-5.4.1> Executing cargoBuildHook71jscpd-5.4.1> cargoBuildHook flags: -j 24 --target aarch64-apple-darwin --offline --profile release -p jscpd72jscpd-5.4.1> warning: crates/cpd/Cargo.toml: file `/private/var/tb/8/scratch/fd725a154ac2733a/build/source/rust/crates/cpd/src/main.rs` found to be present in multiple build targets:73jscpd-5.4.1>   * `bin` target `cpd`74jscpd-5.4.1>   * `bin` target `jscpd`75jscpd-5.4.1> warning: `jscpd` (manifest) generated 1 warning76jscpd-5.4.1>    Compiling proc-macro2 v1.0.10777jscpd-5.4.1>    Compiling quote v1.0.4778jscpd-5.4.1>    Compiling unicode-ident v1.0.2679jscpd-5.4.1>    Compiling shlex v2.0.180jscpd-5.4.1>    Compiling find-msvc-tools v0.1.1481jscpd-5.4.1>    Compiling cfg-if v1.0.582jscpd-5.4.1>    Compiling serde_core v1.0.22983jscpd-5.4.1>    Compiling serde v1.0.22984jscpd-5.4.1>    Compiling libc v0.2.18985jscpd-5.4.1>    Compiling memchr v2.8.386jscpd-5.4.1>    Compiling zmij v1.0.2387jscpd-5.4.1>    Compiling itoa v1.0.1888jscpd-5.4.1>    Compiling tree-sitter-language v0.1.889jscpd-5.4.1>    Compiling bitflags v2.13.290jscpd-5.4.1>    Compiling allocator-api2 v0.2.2191jscpd-5.4.1>    Compiling stable_deref_trait v1.2.192jscpd-5.4.1>    Compiling rustversion v1.0.2393jscpd-5.4.1>    Compiling autocfg v1.5.194jscpd-5.4.1>    Compiling libm v0.2.1695jscpd-5.4.1>    Compiling siphasher v1.0.496jscpd-5.4.1>    Compiling static_assertions v1.1.097jscpd-5.4.1>    Compiling crossbeam-utils v0.8.2398jscpd-5.4.1>    Compiling either v1.18.099jscpd-5.4.1>    Compiling writeable v0.6.4100jscpd-5.4.1>    Compiling crossbeam-epoch v0.9.21101jscpd-5.4.1>    Compiling crossbeam-deque v0.8.8102jscpd-5.4.1>    Compiling litemap v0.8.3103jscpd-5.4.1>    Compiling rayon-core v1.13.0104jscpd-5.4.1>    Compiling cc v1.5.1105jscpd-5.4.1>    Compiling getrandom v0.3.4106jscpd-5.4.1>    Compiling rustc-hash v2.1.3107jscpd-5.4.1>    Compiling zerocopy v0.8.59108jscpd-5.4.1>    Compiling utf8_iter v1.0.4109jscpd-5.4.1>    Compiling phf_shared v0.14.0110jscpd-5.4.1>    Compiling unicode-segmentation v1.13.3111jscpd-5.4.1>    Compiling regex-syntax v0.8.11112jscpd-5.4.1>    Compiling icu_locale_fallback_data v2.3.0113jscpd-5.4.1>    Compiling heck v0.5.0114jscpd-5.4.1>    Compiling version_check v0.9.5115jscpd-5.4.1>    Compiling once_cell v1.21.4116jscpd-5.4.1>    Compiling log v0.4.34117jscpd-5.4.1>    Compiling equivalent v1.0.2118jscpd-5.4.1>    Compiling percent-encoding v2.3.2119tuicr-0.27.0> Using versionCheckHook120tuicr-0.27.0> Running phase: unpackPhase121tuicr-0.27.0> unpacking source archive /nix/store/v5pn269cn1kr1zh9f66lglgda4k2bzh8-source122jscpd-5.4.1>    Compiling smallvec v1.16.2123tuicr-0.27.0> source root is source124tuicr-0.27.0> Executing cargoSetupPostUnpackHook125jscpd-5.4.1>    Compiling num-traits v0.2.19126jscpd-5.4.1>    Compiling icu_segmenter_data v2.3.0127jscpd-5.4.1>    Compiling oxc_data_structures v0.153.0128jscpd-5.4.1>    Compiling phf v0.14.0129jscpd-5.4.1>    Compiling seq-macro v0.3.6130jscpd-5.4.1>    Compiling oxc_estree v0.153.0131jscpd-5.4.1>    Compiling fastrand v2.5.0132jscpd-5.4.1>    Compiling hashbrown v0.17.1133jscpd-5.4.1>    Compiling pastey v0.2.3134jscpd-5.4.1>    Compiling aho-corasick v1.1.5135jscpd-5.4.1>    Compiling dragonbox_ecma v0.1.12136jscpd-5.4.1>    Compiling cow-utils v0.1.3137jscpd-5.4.1>    Compiling phf_generator v0.14.0138jscpd-5.4.1>    Compiling smawk v0.3.3139jscpd-5.4.1>    Compiling unicode-width v0.2.2140jscpd-5.4.1>    Compiling bytecount v0.6.9141jscpd-5.4.1>    Compiling castaway v0.2.4142jscpd-5.4.1>    Compiling ryu v1.0.23143jscpd-5.4.1>    Compiling nonmax v0.5.5144jscpd-5.4.1>    Compiling compact_str v0.10.0145jscpd-5.4.1>    Compiling serde_json v1.0.151146tuicr-0.27.0> Finished cargoSetupPostUnpackHook147tuicr-0.27.0> Running phase: patchPhase148tuicr-0.27.0> applying patch /nix/store/y3fxdgcz596dly20sysgkz9vi20hdxv2-0001-config-add-initial_focus.patch149tuicr-0.27.0> patching file docs/CONFIG.md150tuicr-0.27.0> Hunk #1 succeeded at 28 with fuzz 1.151tuicr-0.27.0> Hunk #2 FAILED at 87.152tuicr-0.27.0> 1 out of 2 hunks FAILED -- saving rejects to file docs/CONFIG.md.rej153tuicr-0.27.0> patching file src/config/mod.rs154tuicr-0.27.0> Hunk #1 FAILED at 134.155tuicr-0.27.0> Hunk #2 succeeded at 264 with fuzz 2 (offset 56 lines).156tuicr-0.27.0> Hunk #3 FAILED at 454.157tuicr-0.27.0> Hunk #4 succeeded at 1280 (offset 162 lines).158tuicr-0.27.0> 2 out of 4 hunks FAILED -- saving rejects to file src/config/mod.rs.rej159tuicr-0.27.0> patching file src/main.rs160tuicr-0.27.0> Hunk #1 succeeded at 400 (offset 15 lines).161jscpd-5.4.1>    Compiling unicode-id-start v1.5.0162jscpd-5.4.1>    Compiling thiserror v1.0.69163error: Cannot build '/nix/store/ysvgx94p3qx5cibkxvjh14rmdxk6i4lb-tuicr-0.27.0.drv'.164       Reason: builder failed with exit code 1.165       Output paths:166         /nix/store/k5zm1vnii6aqim0ik1sjqjq2q2m7anp9-tuicr-0.27.0167       Last 21 log lines:168       > tribuchet: building on mac02169       > Using versionCheckHook170       > Running phase: unpackPhase171       > unpacking source archive /nix/store/v5pn269cn1kr1zh9f66lglgda4k2bzh8-source172       > source root is source173       > Executing cargoSetupPostUnpackHook174       > Finished cargoSetupPostUnpackHook175       > Running phase: patchPhase176       > applying patch /nix/store/y3fxdgcz596dly20sysgkz9vi20hdxv2-0001-config-add-initial_focus.patch177       > patching file docs/CONFIG.md178       > Hunk #1 succeeded at 28 with fuzz 1.179       > Hunk #2 FAILED at 87.180       > 1 out of 2 hunks FAILED -- saving rejects to file docs/CONFIG.md.rej181       > patching file src/config/mod.rs182       > Hunk #1 FAILED at 134.183       > Hunk #2 succeeded at 264 with fuzz 2 (offset 56 lines).184       > Hunk #3 FAILED at 454.185       > Hunk #4 succeeded at 1280 (offset 162 lines).186       > 2 out of 4 hunks FAILED -- saving rejects to file src/config/mod.rs.rej187       > patching file src/main.rs188       > Hunk #1 succeeded at 400 (offset 15 lines).189       For full logs, run:190         nix log /nix/store/ysvgx94p3qx5cibkxvjh14rmdxk6i4lb-tuicr-0.27.0.drv191jscpd-5.4.1>    Compiling paste v1.0.15 (/private/var/tb/8/scratch/fd725a154ac2733a/build/source/rust/patches/paste)192jscpd-5.4.1>    Compiling pulp v0.22.3193jscpd-5.4.1>    Compiling collection_literals v1.0.3194jscpd-5.4.1>    Compiling syn v3.0.6195jscpd-5.4.1>    Compiling syn v2.0.119196jscpd-5.4.1>    Compiling proc-macro-utils v0.10.0197jscpd-5.4.1>    Compiling interpolator v0.5.0198jscpd-5.4.1>    Compiling core-foundation-sys v0.8.7199jscpd-5.4.1>    Compiling strsim v0.11.1200jscpd-5.4.1>    Compiling reborrow v0.5.5201jscpd-5.4.1>    Compiling dyn-stack-macros v0.1.3202jscpd-5.4.1>    Compiling ident_case v1.0.1203jscpd-5.4.1>    Compiling rand_core v0.9.5204jscpd-5.4.1>    Compiling byteorder v1.5.0205jscpd-5.4.1>    Compiling pulp-wasm-simd-flag v0.1.1206jscpd-5.4.1>    Compiling fnv v1.0.7207jscpd-5.4.1>    Compiling raw-cpuid v11.6.0208jscpd-5.4.1>    Compiling object v0.39.1209jscpd-5.4.1>    Compiling thiserror v2.0.21210jscpd-5.4.1>    Compiling phf_shared v0.11.3211jscpd-5.4.1>    Compiling rustix v1.1.5212jscpd-5.4.1>    Compiling thin-vec v0.2.20213jscpd-5.4.1>    Compiling getrandom v0.4.3214jscpd-5.4.1>    Compiling errno v0.3.14215jscpd-5.4.1>    Compiling pkg-config v0.3.34216jscpd-5.4.1>    Compiling oxc_allocator v0.153.0217jscpd-5.4.1>    Compiling indexmap v2.14.2218jscpd-5.4.1>    Compiling getrandom v0.2.17219jscpd-5.4.1>    Compiling rand_core v0.6.4220jscpd-5.4.1>    Compiling manyhow-macros v0.11.4221jscpd-5.4.1>    Compiling bstr v1.13.1222jscpd-5.4.1>    Compiling ahash v0.8.12223jscpd-5.4.1>    Compiling getopts v0.2.24224jscpd-5.4.1>    Compiling esaxx-rs v0.1.10225jscpd-5.4.1>    Compiling xxhash-rust v0.8.19226jscpd-5.4.1>    Compiling tree-sitter-php v0.24.2227jscpd-5.4.1>    Compiling tree-sitter-java v0.23.5228jscpd-5.4.1>    Compiling tree-sitter-ruby v0.23.1229jscpd-5.4.1>    Compiling onig_sys v69.9.3230jscpd-5.4.1>    Compiling tree-sitter-python v0.25.0231jscpd-5.4.1>    Compiling tree-sitter-rust v0.24.2232jscpd-5.4.1>    Compiling tree-sitter-typescript v0.23.2233jscpd-5.4.1>    Compiling tree-sitter-go v0.25.0234jscpd-5.4.1>    Compiling rayon v1.12.0235jscpd-5.4.1>    Compiling tree-sitter-kotlin-ng v1.1.0236jscpd-5.4.1>    Compiling tree-sitter-cpp v0.23.4237jscpd-5.4.1>    Compiling tree-sitter-c-sharp v0.23.5238jscpd-5.4.1>    Compiling tree-sitter-scala v0.26.2239jscpd-5.4.1>    Compiling tree-sitter-swift v0.7.4240jscpd-5.4.1>    Compiling minimal-lexical v0.2.1241jscpd-5.4.1>    Compiling oxc_str v0.153.0242jscpd-5.4.1>    Compiling num-integer v0.1.47243jscpd-5.4.1>    Compiling nom v7.1.3244jscpd-5.4.1>    Compiling regex-automata v0.4.18245jscpd-5.4.1>    Compiling ordermap v1.2.2246jscpd-5.4.1>    Compiling num-bigint v0.5.1247jscpd-5.4.1>    Compiling tempfile v3.27.0248jscpd-5.4.1>    Compiling memmap2 v0.9.11249jscpd-5.4.1>    Compiling winnow v1.0.4250jscpd-5.4.1>    Compiling tree-sitter v0.27.0251jscpd-5.4.1>    Compiling manyhow v0.11.4252jscpd-5.4.1>    Compiling darling_core v0.20.11253jscpd-5.4.1>    Compiling itertools v0.15.0254jscpd-5.4.1>    Compiling itertools v0.14.0255jscpd-5.4.1>    Compiling synstructure v0.14.0256jscpd-5.4.1>    Compiling ppv-lite86 v0.2.21257jscpd-5.4.1>    Compiling macro_rules_attribute-proc_macro v0.2.3258jscpd-5.4.1>    Compiling ar_archive_writer v0.5.3259jscpd-5.4.1>    Compiling rand_chacha v0.3.1260jscpd-5.4.1>    Compiling base64 v0.13.1261jscpd-5.4.1>    Compiling icu_normalizer_data v2.3.0262jscpd-5.4.1>    Compiling same-file v1.0.6263jscpd-5.4.1>    Compiling tinyvec v1.13.3264jscpd-5.4.1>    Compiling crc32fast v1.5.2265jscpd-5.4.1>    Compiling rand v0.8.8266jscpd-5.4.1>    Compiling utf8parse v0.2.2267jscpd-5.4.1>    Compiling typenum v1.20.1268building '/nix/store/1vddz4hma6ywmpailwnx34bx4d2c1rkx-go-mockery-3.8.0.drv'269go-mockery-3.8.0> tribuchet: building on mac02270jscpd-5.4.1>    Compiling icu_properties_data v2.3.0271jscpd-5.4.1>    Compiling streaming-iterator v0.1.9272jscpd-5.4.1>    Compiling anstyle-parse v1.0.0273go-mockery-3.8.0> Using versionCheckHook274go-mockery-3.8.0> Running phase: unpackPhase275go-mockery-3.8.0> unpacking source archive /nix/store/vrlv5sg9z041kz82fnr9qr2mzmb6grd5-source276go-mockery-3.8.0> source root is source277go-mockery-3.8.0> Running phase: patchPhase278go-mockery-3.8.0> patching script interpreter paths in e2e279go-mockery-3.8.0> e2e/test_missing_interface/run.sh: interpreter directive changed from "#!/bin/bash" to "/nix/store/f0b9dbw2gl596cm03pvdsss72381qhlp-bash-5.3p15/bin/bash"280go-mockery-3.8.0> e2e/run_all.sh: interpreter directive changed from "#!/bin/bash" to "/nix/store/f0b9dbw2gl596cm03pvdsss72381qhlp-bash-5.3p15/bin/bash"281go-mockery-3.8.0> e2e/test_infinite_mocking.sh: interpreter directive changed from "#!/bin/bash" to "/nix/store/f0b9dbw2gl596cm03pvdsss72381qhlp-bash-5.3p15/bin/bash"282go-mockery-3.8.0> e2e/test_mockery_generation.sh: interpreter directive changed from "#!/bin/bash" to "/nix/store/f0b9dbw2gl596cm03pvdsss72381qhlp-bash-5.3p15/bin/bash"283go-mockery-3.8.0> Running phase: updateAutotoolsGnuConfigScriptsPhase284go-mockery-3.8.0> Running phase: configurePhase285go-mockery-3.8.0> Running phase: buildPhase286jscpd-5.4.1>    Compiling walkdir v2.5.0287jscpd-5.4.1>    Compiling macro_rules_attribute v0.2.3288go-mockery-3.8.0> Building subPackage ./.289jscpd-5.4.1>    Compiling psm v0.1.32290jscpd-5.4.1>    Compiling basic-toml v0.1.10291jscpd-5.4.1>    Compiling stacker v0.1.25292jscpd-5.4.1>    Compiling iana-time-zone v0.1.65293jscpd-5.4.1>    Compiling unicode-normalization v0.1.25294jscpd-5.4.1>    Compiling colorchoice v1.0.5295jscpd-5.4.1>    Compiling zerocopy-derive v0.8.59296jscpd-5.4.1>    Compiling phf_macros v0.14.0297jscpd-5.4.1>    Compiling quote-use-macros v0.8.4298jscpd-5.4.1>    Compiling thiserror-impl v1.0.69299jscpd-5.4.1>    Compiling enum-as-inner v0.6.1300jscpd-5.4.1>    Compiling phf_generator v0.11.3301jscpd-5.4.1>    Compiling serde_derive v1.0.229302jscpd-5.4.1>    Compiling zerofrom-derive v0.1.8303jscpd-5.4.1>    Compiling yoke-derive v0.8.4304jscpd-5.4.1>    Compiling zerovec-derive v0.11.6305jscpd-5.4.1>    Compiling displaydoc v0.2.7306jscpd-5.4.1>    Compiling bytemuck_derive v1.12.1307jscpd-5.4.1>    Compiling oxc_ast_macros v0.153.0308jscpd-5.4.1>    Compiling quote-use v0.8.4309jscpd-5.4.1>    Compiling derive-where v1.7.0310jscpd-5.4.1>    Compiling attribute-derive-macro v0.10.5311jscpd-5.4.1>    Compiling thiserror-impl v2.0.21312jscpd-5.4.1>    Compiling phf_codegen v0.11.3313jscpd-5.4.1>    Compiling monostate-impl v0.1.18314jscpd-5.4.1>    Compiling unicode_names2_generator v1.3.0315jscpd-5.4.1>    Compiling hybrid-array v0.4.15316jscpd-5.4.1>    Compiling monostate v0.1.18317jscpd-5.4.1>    Compiling oxc_span v0.153.0318jscpd-5.4.1>    Compiling regex v1.13.1319jscpd-5.4.1>    Compiling rayon-cond v0.4.0320jscpd-5.4.1>    Compiling globset v0.4.20321jscpd-5.4.1>    Compiling sysctl v0.6.0322jscpd-5.4.1>    Compiling accelerate-src v0.3.2323jscpd-5.4.1>    Compiling unicode_names2 v1.3.0324jscpd-5.4.1>    Compiling foldhash v0.2.0325jscpd-5.4.1>    Compiling glob v0.3.4326jscpd-5.4.1>    Compiling anstyle v1.0.14327jscpd-5.4.1>    Compiling zerofrom v0.1.8328jscpd-5.4.1>    Compiling anstyle-query v1.1.5329jscpd-5.4.1>    Compiling zeroize v1.9.0330jscpd-5.4.1>    Compiling httparse v1.10.1331jscpd-5.4.1>    Compiling unicode_categories v0.1.1332jscpd-5.4.1>    Compiling darling_macro v0.20.11333jscpd-5.4.1>    Compiling yoke v0.8.3334jscpd-5.4.1>    Compiling is_terminal_polyfill v1.70.2335jscpd-5.4.1>    Compiling anstream v1.0.0336jscpd-5.4.1>    Compiling hashbrown v0.16.1337jscpd-5.4.1>    Compiling phf v0.11.3338jscpd-5.4.1>    Compiling is-macro v0.3.8339jscpd-5.4.1>    Compiling bytemuck v1.25.2340jscpd-5.4.1>    Compiling chrono v0.4.45341jscpd-5.4.1>    Compiling darling v0.20.11342jscpd-5.4.1>    Compiling zerovec v0.11.8343jscpd-5.4.1>    Compiling zerotrie v0.2.5344jscpd-5.4.1>    Compiling derive_builder_core v0.20.2345jscpd-5.4.1>    Compiling ignore v0.4.33346jscpd-5.4.1>    Compiling attribute-derive v0.10.5347jscpd-5.4.1>    Compiling num-complex v0.4.6348jscpd-5.4.1>    Compiling dyn-stack v0.13.2349jscpd-5.4.1>    Compiling core-foundation v0.10.1350jscpd-5.4.1>    Compiling security-framework-sys v2.17.0351jscpd-5.4.1>    Compiling bit-vec v0.8.0352jscpd-5.4.1>    Compiling base64ct v1.8.3353jscpd-5.4.1>    Compiling typed-path v0.12.3354jscpd-5.4.1>    Compiling native-tls v0.2.18355jscpd-5.4.1>    Compiling bytes v1.12.1356jscpd-5.4.1>    Compiling arrayvec v0.7.8357jscpd-5.4.1>    Compiling security-framework v3.7.0358jscpd-5.4.1>    Compiling pem-rfc7468 v1.0.0359jscpd-5.4.1>    Compiling get-size-derive2 v0.11.0360go-mockery-3.8.0> go: downloading github.com/spf13/cobra v1.10.2361go-mockery-3.8.0> go: downloading github.com/knadh/koanf/providers/structs v1.0.0362go-mockery-3.8.0> go: downloading github.com/rs/zerolog v1.34.0363go-mockery-3.8.0> go: downloading github.com/knadh/koanf/parsers/yaml v1.1.0364go-mockery-3.8.0> go: downloading github.com/jedib0t/go-pretty/v6 v6.7.8365go-mockery-3.8.0> go: downloading github.com/knadh/koanf/v2 v2.3.2366go-mockery-3.8.0> go: downloading github.com/spf13/pflag v1.0.10367go-mockery-3.8.0> go: downloading golang.org/x/term v0.40.0368go-mockery-3.8.0> go: downloading golang.org/x/tools v0.49.0369go-mockery-3.8.0> go: downloading gopkg.in/yaml.v3 v3.0.1370go-mockery-3.8.0> go: downloading github.com/go-viper/mapstructure/v2 v2.5.0371go-mockery-3.8.0> go: downloading github.com/brunoga/deep v1.3.1372go-mockery-3.8.0> go: downloading github.com/knadh/koanf/providers/env v1.1.0373go-mockery-3.8.0> go: downloading github.com/knadh/koanf/providers/posflag v1.0.1374go-mockery-3.8.0> go: downloading github.com/knadh/koanf/providers/file v1.2.1375go-mockery-3.8.0> go: downloading github.com/xeipuuv/gojsonschema v1.2.0376go-mockery-3.8.0> go: downloading go.yaml.in/yaml/v3 v3.0.4377go-mockery-3.8.0> go: downloading github.com/fatih/structs v1.1.0378go-mockery-3.8.0> go: downloading github.com/knadh/koanf/maps v0.1.2379go-mockery-3.8.0> go: downloading golang.org/x/sys v0.47.0380go-mockery-3.8.0> go: downloading github.com/mitchellh/copystructure v1.2.0381go-mockery-3.8.0> go: downloading github.com/mattn/go-colorable v0.1.14382go-mockery-3.8.0> go: downloading github.com/huandu/xstrings v1.5.0383go-mockery-3.8.0> go: downloading golang.org/x/exp v0.0.0-20260212183809-81e46e3db34a384go-mockery-3.8.0> go: downloading github.com/fsnotify/fsnotify v1.9.0385go-mockery-3.8.0> go: downloading github.com/mitchellh/reflectwalk v1.0.2386go-mockery-3.8.0> go: downloading github.com/mattn/go-runewidth v0.0.19387go-mockery-3.8.0> go: downloading golang.org/x/text v0.34.0388go-mockery-3.8.0> go: downloading github.com/xeipuuv/gojsonreference v0.0.0-20180127040603-bd5ef7bd5415389go-mockery-3.8.0> go: downloading github.com/mattn/go-isatty v0.0.20390go-mockery-3.8.0> go: downloading github.com/xeipuuv/gojsonpointer v0.0.0-20190905194746-02993c407bfb391go-mockery-3.8.0> go: downloading github.com/clipperhouse/uax29/v2 v2.2.0392go-mockery-3.8.0> go: downloading golang.org/x/mod v0.39.0393go-mockery-3.8.0> go: downloading golang.org/x/sync v0.22.0394go-mockery-3.8.0> Running phase: checkPhase395jscpd-5.4.1>    Compiling bit-set v0.8.0396go-mockery-3.8.0> task: [mocks.remove.unix] find . -name '*_mock.go' -o -name 'mock_*_test.go' -o -name "mocks_moq.go"  -o -name 'mocks_test.go' -o -name 'mocks_*_test.go' -o -name 'mocks_matryer_*.go' -o -name 'mocks.go' | xargs -r rm397go-mockery-3.8.0> task: [mocks.remove.unix] rm -rf mocks/398go-mockery-3.8.0> task: [mocks.generate.matryer] MOCKERY_CONFIG=./.mockery_matryer.yml GOWORK=off go run .399go-mockery-3.8.0> task: [mocks.generate.testify] MOCKERY_CONFIG=./.mockery_testify.yml GOWORK=off go run .400jscpd-5.4.1>    Compiling derive_builder_macro v0.20.2401jscpd-5.4.1>    Compiling rustls-pki-types v1.15.1402jscpd-5.4.1>    Compiling block-buffer v0.12.1403jscpd-5.4.1>    Compiling crypto-common v0.2.2404go-mockery-3.8.0> 2026-10-15T09:22:40.814724000Z INF Starting mockery config-file=./.mockery_matryer.yml version=v0.0.0-dev405go-mockery-3.8.0> 2026-10-15T09:22:40.814928000Z INF Parsing configured packages... version=v0.0.0-dev406jscpd-5.4.1>    Compiling derive_builder v0.20.2407go-mockery-3.8.0> 2026-10-15T09:22:41.245035000Z ERR encountered error when loading package error="/private/var/tb/5/scratch/fd6d5f1d6bcc683f/build/source/internal/fixtures/embedded_types/service.go:3:8: could not import context (reading /private/var/tb/5/scratch/fd6d5f1d6bcc683f/build/go-cache/e6/e6e1e12b9fd8e29daf7be09c8ed9e8f95955a320ffcfd5bc1fd508cff282b211-d: internal error in importing \"context\" (cannot decode \"context\", export data version 5 is greater than maximum supported version 4); please report an issue)" version=v0.0.0-dev408go-mockery-3.8.0> 2026-10-15T09:22:41.245144000Z ERR unable to parse packages error="error occurred when loading packages" version=v0.0.0-dev409go-mockery-3.8.0> 2026-10-15T09:22:41.245164000Z FTL app failed error="error occurred when loading packages" version=v0.0.0-dev410go-mockery-3.8.0> exit status 1411go-mockery-3.8.0> 2026-10-15T09:22:41.387208000Z INF Starting mockery config-file=./.mockery_testify.yml version=v0.0.0-dev412go-mockery-3.8.0> 2026-10-15T09:22:41.387379000Z INF Parsing configured packages... version=v0.0.0-dev413jscpd-5.4.1>    Compiling tree-sitter-c v0.24.2414jscpd-5.4.1>    Compiling num_cpus v1.17.0415jscpd-5.4.1>    Compiling csv-core v0.1.13416jscpd-5.4.1>    Compiling const-oid v0.10.2417jscpd-5.4.1>    Compiling drop_bomb v0.1.5418jscpd-5.4.1>    Compiling clap_lex v1.1.1419jscpd-5.4.1>    Compiling jiff-core v0.1.1420go-mockery-3.8.0> 2026-10-15T09:22:43.967136000Z ERR encountered error when loading package error="/private/var/tb/5/scratch/fd6d5f1d6bcc683f/build/source/internal/fixtures/iface_new_type/interface.go:3:8: could not import github.com/vektra/mockery/v3/internal/fixtures/iface_new_type/subpkg (reading /private/var/tb/5/scratch/fd6d5f1d6bcc683f/build/go-cache/e1/e139e5bbbaa5112dc9bf7f95bc4a2206dfebf298ff750b77770c57a924c15215-d: internal error in importing \"github.com/vektra/mockery/v3/internal/fixtures/iface_new_type/subpkg\" (cannot decode \"github.com/vektra/mockery/v3/internal/fixtures/iface_new_type/subpkg\", export data version 5 is greater than maximum supported version 4); please report an issue)" version=v0.0.0-dev421go-mockery-3.8.0> 2026-10-15T09:22:43.967212000Z ERR unable to parse packages error="error occurred when loading packages" version=v0.0.0-dev422go-mockery-3.8.0> 2026-10-15T09:22:43.967235000Z FTL app failed error="error occurred when loading packages" version=v0.0.0-dev423go-mockery-3.8.0> exit status 1424go-mockery-3.8.0> task: Failed to run task "test.ci": task: Failed to run task "mocks": task: Failed to run task "mocks.generate": task: Failed to run task "mocks.generate.matryer": exit status 1425jscpd-5.4.1>    Compiling base64 v0.23.1426error: Cannot build '/nix/store/1vddz4hma6ywmpailwnx34bx4d2c1rkx-go-mockery-3.8.0.drv'.427       Reason: builder failed with exit code 201.428       Output paths:429         /nix/store/s7jay9q36pylk2kv1cc60d6j4yaxpk1c-go-mockery-3.8.0430       Last 25 log lines:431       > go: downloading golang.org/x/text v0.34.0432       > go: downloading github.com/xeipuuv/gojsonreference v0.0.0-20180127040603-bd5ef7bd5415433       > go: downloading github.com/mattn/go-isatty v0.0.20434       > go: downloading github.com/xeipuuv/gojsonpointer v0.0.0-20190905194746-02993c407bfb435       > go: downloading github.com/clipperhouse/uax29/v2 v2.2.0436       > go: downloading golang.org/x/mod v0.39.0437       > go: downloading golang.org/x/sync v0.22.0438       > Running phase: checkPhase439       > task: [mocks.remove.unix] find . -name '*_mock.go' -o -name 'mock_*_test.go' -o -name "mocks_moq.go"  -o -name 'mocks_test.go' -o -name 'mocks_*_test.go' -o -name 'mocks_matryer_*.go' -o -name 'mocks.go' | xargs -r rm440       > task: [mocks.remove.unix] rm -rf mocks/441       > task: [mocks.generate.matryer] MOCKERY_CONFIG=./.mockery_matryer.yml GOWORK=off go run .442       > task: [mocks.generate.testify] MOCKERY_CONFIG=./.mockery_testify.yml GOWORK=off go run .443       > 2026-10-15T09:22:40.814724000Z INF Starting mockery config-file=./.mockery_matryer.yml version=v0.0.0-dev444       > 2026-10-15T09:22:40.814928000Z INF Parsing configured packages... version=v0.0.0-dev445       > 2026-10-15T09:22:41.245035000Z ERR encountered error when loading package error="/private/var/tb/5/scratch/fd6d5f1d6bcc683f/build/source/internal/fixtures/embedded_types/service.go:3:8: could not import context (reading /private/var/tb/5/scratch/fd6d5f1d6bcc683f/build/go-cache/e6/e6e1e12b9fd8e29daf7be09c8ed9e8f95955a320ffcfd5bc1fd508cff282b211-d: internal error in importing \"context\" (cannot decode \"context\", export data version 5 is greater than maximum supported version 4); please report an issue)" version=v0.0.0-dev446       > 2026-10-15T09:22:41.245144000Z ERR unable to parse packages error="error occurred when loading packages" version=v0.0.0-dev447       > 2026-10-15T09:22:41.245164000Z FTL app failed error="error occurred when loading packages" version=v0.0.0-dev448       > exit status 1449       > 2026-10-15T09:22:41.387208000Z INF Starting mockery config-file=./.mockery_testify.yml version=v0.0.0-dev450       > 2026-10-15T09:22:41.387379000Z INF Parsing configured packages... version=v0.0.0-dev451       > 2026-10-15T09:22:43.967136000Z ERR encountered error when loading package error="/private/var/tb/5/scratch/fd6d5f1d6bcc683f/build/source/internal/fixtures/iface_new_type/interface.go:3:8: could not import github.com/vektra/mockery/v3/internal/fixtures/iface_new_type/subpkg (reading /private/var/tb/5/scratch/fd6d5f1d6bcc683f/build/go-cache/e1/e139e5bbbaa5112dc9bf7f95bc4a2206dfebf298ff750b77770c57a924c15215-d: internal error in importing \"github.com/vektra/mockery/v3/internal/fixtures/iface_new_type/subpkg\" (cannot decode \"github.com/vektra/mockery/v3/internal/fixtures/iface_new_type/subpkg\", export data version 5 is greater than maximum supported version 4); please report an issue)" version=v0.0.0-dev452       > 2026-10-15T09:22:43.967212000Z ERR unable to parse packages error="error occurred when loading packages" version=v0.0.0-dev453       > 2026-10-15T09:22:43.967235000Z FTL app failed error="error occurred when loading packages" version=v0.0.0-dev454       > exit status 1455       > task: Failed to run task "test.ci": task: Failed to run task "mocks": task: Failed to run task "mocks.generate": task: Failed to run task "mocks.generate.matryer": exit status 1456       For full logs, run:457         nix log /nix/store/1vddz4hma6ywmpailwnx34bx4d2c1rkx-go-mockery-3.8.0.drv458error: Cannot build '/nix/store/9lgc90k03pg509hm6kdnqff8i5p73d7k-sesh-2.32.0.drv'.459       Reason: 1 dependency failed.460       Output paths:461         /nix/store/hssicxzkay6hcx4v8hjrbbjas2z4zf5f-sesh-2.32.0462jscpd-5.4.1>    Compiling http v1.5.0463jscpd-5.4.1>    Compiling clap_builder v4.6.7464jscpd-5.4.1>    Compiling webpki-root-certs v1.0.9465jscpd-5.4.1>    Compiling csv v1.4.0466jscpd-5.4.1>    Compiling tinystr v0.8.4467jscpd-5.4.1>    Compiling potential_utf v0.1.6468jscpd-5.4.1>    Compiling icu_collections v2.3.0469jscpd-5.4.1>    Compiling icu_locale_core v2.3.0470jscpd-5.4.1>    Compiling askama_parser v0.16.1471jscpd-5.4.1>    Compiling zip v8.6.0472jscpd-5.4.1>    Compiling digest v0.11.3473jscpd-5.4.1>    Compiling jiff v0.2.37474jscpd-5.4.1>    Compiling oxc_index v5.0.0475jscpd-5.4.1>    Compiling cpd-core v0.1.21 (/private/var/tb/8/scratch/fd725a154ac2733a/build/source/rust/crates/cpd-core)476jscpd-5.4.1>    Compiling get-size2 v0.11.0477jscpd-5.4.1>    Compiling unicode-normalization-alignments v0.1.12478jscpd-5.4.1>    Compiling spm_precompiled v0.1.4479jscpd-5.4.1>    Compiling compact_str v0.9.1480jscpd-5.4.1>    Compiling dary_heap v0.3.9