nixbot

builds

cancelled checks.x86_64-linux.home-manager-utm-vm build #809 · raw · eval 5.0 s · 505.9 MiB allocated · ·

1these 48 derivations will be built:2  /nix/store/3qdirpxsznzyyvdcks0as0f3qm9jznhh-boost-1.89.0.drv3  /nix/store/lc1nxcdcrwnm6pmlbwis40x6q4bjaxw8-nix-util-2.36.0pre.drv4  /nix/store/wjcffalnxws2gvfzmp46mxiyr5kkxia6-nix-store-2.36.0pre.drv5  /nix/store/10ilxbwmr5w5iqsf909r5qdsmnfvnyfr-nix-fetchers-2.36.0pre.drv6  /nix/store/ibvw4wgzrynp67l55872dpyvh680xsnb-nix-util-c-2.36.0pre.drv7  /nix/store/fnd0ja8jwy6jgc1v8x6a5590hbbg5vgb-nix-store-c-2.36.0pre.drv8  /nix/store/x4flw65hclk9g8r9yg58r8h6did3agcm-nix-expr-2.36.0pre.drv9  /nix/store/zggc0las45kk6hxwb555ijy72c9wlhls-nix-expr-c-2.36.0pre.drv10  /nix/store/1vqmw4pad2dlgg789hfmi5cgak05yqig-nix-fetchers-c-2.36.0pre.drv11  /nix/store/hb70hd66nqc1k8l081gsnmnpgfzq0l58-nix-flake-2.36.0pre.drv12  /nix/store/kskjiz2w4av3hmrg7asn70zlr2gz7zh5-nix-main-2.36.0pre.drv13  /nix/store/2hk6bnybma5g9lczhclgpfdyw1zfkdlc-nix-cmd-2.36.0pre.drv14  /nix/store/bxyxjn1bpnr7k3zd4pmqqnvryzz0fq7l-nix-util-test-support-2.36.0pre.drv15  /nix/store/bbh4md9jby2l6kmvjd8plrqyqr61xlsv-nix-store-test-support-2.36.0pre.drv16  /nix/store/shxv04hlzym9r693j4wqkks5bs8vh2bn-nix-util-test-support-2.36.0pre.drv17  /nix/store/22z6icfbp93rf8454rpmrxwcb19nykmb-nix-expr-tests-2.36.0pre.drv18  /nix/store/30ywm8ycwdpqkl5s7n5i697gwn9mkdb7-nix-expr-tests-run.drv19  /nix/store/85zbav1rppg06py4xnppkfzi5y70zjx6-nix-main-c-2.36.0pre.drv20  /nix/store/rdsla0yc02d6z293nfqk6gvb8129i7d2-nix-flake-c-2.36.0pre.drv21  /nix/store/516qrg4cwqq9ccmz3y06dirfqlr54m7v-nix-2.36.0pre20261015_c9f81f4.drv22  /nix/store/dsgk28mwvk8iq5lxv9zrdzdl4cqv11s4-nix-nswrapper-2.36.0pre.drv23  /nix/store/7vv75v962bxqii7zvz1cqpr7k4vh6m1w-nix-store-tests-2.36.0pre.drv24  /nix/store/g5gn1wrf7ain46wdly43mg57zkhn6r8i-nix-store-tests-run.drv25  /nix/store/4zzg7zc42sfyh851gshfaimql0wv5alp-nix-flake-tests-2.36.0pre.drv26  /nix/store/hchqm8p2rb65l58hrwfk9jfkk8gjj727-nix-flake-tests-run.drv27  /nix/store/phj3n2xb3cb094mvk728qc448i0wgzbb-nix-manual-2.36.0pre20261015_c9f81f4.drv28  /nix/store/qw4ga228kn4cks987jaj1wxgxwk0a582-nix-functional-tests-2.36.0pre20261015_c9f81f4.drv29  /nix/store/a3971przjvjb2babmyk26n5syz4bvdbz-nix-fetchers-tests-2.36.0pre.drv30  /nix/store/sg8nzghkdvgmc6jvsqw77d3z672nrd91-nix-fetchers-tests-run.drv31  /nix/store/qfqj5yln71y08s91m2pf7jc1q72nawbl-nix-util-tests-2.36.0pre.drv32  /nix/store/v6bd95ims8z08dalavmr04m6zz0sg4vp-nix-util-tests-run-without-new-syscalls.drv33  /nix/store/zg2hmslilb7x5li4h3bhaq87xf8z5pxb-nix-util-tests-run.drv34  /nix/store/9zbiih7zhgj2ynswncmsdbf895wr6dn5-nix-2.36.0pre20261015_c9f81f4.drv35  /nix/store/gkqgcnhs8mhk2iph8z1gv8gkm6s8c8p2-go-mockery-3.8.0.drv36  /nix/store/5blymz8vn1vs1g9ajhfd431n9m17vkh4-sesh-2.32.0.drv37  /nix/store/6jb162ym0hlkvbrkvphqjnnc1r2zjkkh-herdr-0.9.5.drv38  /nix/store/bnz9bqvw2971n991rdy1kwglp44n46zj-tuicr-0.27.0.drv39  /nix/store/cx7h8vzlv9yyw20q62mrnh416p2c8ghq-jscpd-5.4.1.drv40  /nix/store/k3y0kfznr02j6wgb091wrp1a050rakvn-openspec-1.14.2.drv41  /nix/store/ra82hg6a6ixvpagf062q4zp9mcrz5ifq-email-sync.drv42  /nix/store/kkn4273823vnr0pf5jyffifmlivhq4lg-pim-0.2.0.drv43  /nix/store/vfwcha69043j8gwn39ad8nsmqqr3w7mg-iets-0.1.0.drv44  /nix/store/krvprbj110pyvx65732fhsm059wmdv15-home-manager-path.drv45  /nix/store/08frfal33f3b7wq1iyh3c2izhq87dgw1-activation-script.drv46  /nix/store/r8k3c21awmqwf9lcr3s96cwxxr31q8vg-mbsync.service.drv47  /nix/store/mapyh1vzzzllvq23x3rmy7f3fqlg0pgs-home-manager-files.drv48  /nix/store/vpzgs3wi6plb2ddmld7q65dr1yhqnjd6-hm-putter.json.drv49  /nix/store/c9dh68cigwklcc619lfnfbh9dc7i1cxh-home-manager-generation.drv50building '/nix/store/r8k3c21awmqwf9lcr3s96cwxxr31q8vg-mbsync.service.drv'51mbsync.service> tribuchet: building on jamie52building '/nix/store/bnz9bqvw2971n991rdy1kwglp44n46zj-tuicr-0.27.0.drv'53tuicr-0.27.0> tribuchet: building on jamie54tuicr-0.27.0> Using versionCheckHook55tuicr-0.27.0> Running phase: unpackPhase56tuicr-0.27.0> unpacking source archive /nix/store/v5pn269cn1kr1zh9f66lglgda4k2bzh8-source57tuicr-0.27.0> source root is source58tuicr-0.27.0> Executing cargoSetupPostUnpackHook59tuicr-0.27.0> Finished cargoSetupPostUnpackHook60tuicr-0.27.0> Running phase: patchPhase61tuicr-0.27.0> applying patch /nix/store/y3fxdgcz596dly20sysgkz9vi20hdxv2-0001-config-add-initial_focus.patch62tuicr-0.27.0> patching file docs/CONFIG.md63tuicr-0.27.0> Hunk #1 succeeded at 28 with fuzz 1.64tuicr-0.27.0> Hunk #2 FAILED at 87.65tuicr-0.27.0> 1 out of 2 hunks FAILED -- saving rejects to file docs/CONFIG.md.rej66tuicr-0.27.0> patching file src/config/mod.rs67tuicr-0.27.0> Hunk #1 FAILED at 134.68tuicr-0.27.0> Hunk #2 succeeded at 264 with fuzz 2 (offset 56 lines).69tuicr-0.27.0> Hunk #3 FAILED at 454.70tuicr-0.27.0> Hunk #4 succeeded at 1280 (offset 162 lines).71tuicr-0.27.0> 2 out of 4 hunks FAILED -- saving rejects to file src/config/mod.rs.rej72tuicr-0.27.0> patching file src/main.rs73tuicr-0.27.0> Hunk #1 succeeded at 400 (offset 15 lines).74error: Cannot build '/nix/store/bnz9bqvw2971n991rdy1kwglp44n46zj-tuicr-0.27.0.drv'.75       Reason: builder failed with exit code 1.76       Output paths:77         /nix/store/b353xwqzxngi82ik552zwf4gqlhl2bf6-tuicr-0.27.078       Last 21 log lines:79       > tribuchet: building on jamie80       > Using versionCheckHook81       > Running phase: unpackPhase82       > unpacking source archive /nix/store/v5pn269cn1kr1zh9f66lglgda4k2bzh8-source83       > source root is source84       > Executing cargoSetupPostUnpackHook85       > Finished cargoSetupPostUnpackHook86       > Running phase: patchPhase87       > applying patch /nix/store/y3fxdgcz596dly20sysgkz9vi20hdxv2-0001-config-add-initial_focus.patch88       > patching file docs/CONFIG.md89       > Hunk #1 succeeded at 28 with fuzz 1.90       > Hunk #2 FAILED at 87.91       > 1 out of 2 hunks FAILED -- saving rejects to file docs/CONFIG.md.rej92       > patching file src/config/mod.rs93       > Hunk #1 FAILED at 134.94       > Hunk #2 succeeded at 264 with fuzz 2 (offset 56 lines).95       > Hunk #3 FAILED at 454.96       > Hunk #4 succeeded at 1280 (offset 162 lines).97       > 2 out of 4 hunks FAILED -- saving rejects to file src/config/mod.rs.rej98       > patching file src/main.rs99       > Hunk #1 succeeded at 400 (offset 15 lines).100       For full logs, run:101         nix log /nix/store/bnz9bqvw2971n991rdy1kwglp44n46zj-tuicr-0.27.0.drv102mbsync.service> structuredAttrs is enabled103building '/nix/store/mapyh1vzzzllvq23x3rmy7f3fqlg0pgs-home-manager-files.drv'104home-manager-files> tribuchet: building on jamie105building '/nix/store/vpzgs3wi6plb2ddmld7q65dr1yhqnjd6-hm-putter.json.drv'106hm-putter.json> tribuchet: building on jamie107hm-putter.json> structuredAttrs is enabled108building '/nix/store/gkqgcnhs8mhk2iph8z1gv8gkm6s8c8p2-go-mockery-3.8.0.drv'109go-mockery-3.8.0> tribuchet: building on jamie110go-mockery-3.8.0> Using versionCheckHook111go-mockery-3.8.0> Running phase: unpackPhase112go-mockery-3.8.0> unpacking source archive /nix/store/vrlv5sg9z041kz82fnr9qr2mzmb6grd5-source113go-mockery-3.8.0> source root is source114go-mockery-3.8.0> Running phase: patchPhase115go-mockery-3.8.0> patching script interpreter paths in e2e116go-mockery-3.8.0> e2e/run_all.sh: interpreter directive changed from "#!/bin/bash" to "/nix/store/10dxp0qxqxxsyiljrh2kp0xqhz6arhcx-bash-5.3p15/bin/bash"117go-mockery-3.8.0> e2e/test_infinite_mocking.sh: interpreter directive changed from "#!/bin/bash" to "/nix/store/10dxp0qxqxxsyiljrh2kp0xqhz6arhcx-bash-5.3p15/bin/bash"118go-mockery-3.8.0> e2e/test_missing_interface/run.sh: interpreter directive changed from "#!/bin/bash" to "/nix/store/10dxp0qxqxxsyiljrh2kp0xqhz6arhcx-bash-5.3p15/bin/bash"119go-mockery-3.8.0> e2e/test_mockery_generation.sh: interpreter directive changed from "#!/bin/bash" to "/nix/store/10dxp0qxqxxsyiljrh2kp0xqhz6arhcx-bash-5.3p15/bin/bash"120go-mockery-3.8.0> Running phase: updateAutotoolsGnuConfigScriptsPhase121go-mockery-3.8.0> Running phase: configurePhase122go-mockery-3.8.0> Running phase: buildPhase123go-mockery-3.8.0> Building subPackage ./.124go-mockery-3.8.0> go: downloading github.com/knadh/koanf/parsers/yaml v1.1.0125go-mockery-3.8.0> go: downloading golang.org/x/term v0.40.0126go-mockery-3.8.0> go: downloading golang.org/x/tools v0.49.0127go-mockery-3.8.0> go: downloading github.com/spf13/pflag v1.0.10128go-mockery-3.8.0> go: downloading github.com/knadh/koanf/providers/structs v1.0.0129go-mockery-3.8.0> go: downloading github.com/rs/zerolog v1.34.0130go-mockery-3.8.0> go: downloading gopkg.in/yaml.v3 v3.0.1131go-mockery-3.8.0> go: downloading github.com/jedib0t/go-pretty/v6 v6.7.8132go-mockery-3.8.0> go: downloading github.com/spf13/cobra v1.10.2133go-mockery-3.8.0> go: downloading github.com/knadh/koanf/v2 v2.3.2134go-mockery-3.8.0> go: downloading github.com/knadh/koanf/providers/posflag v1.0.1135go-mockery-3.8.0> go: downloading github.com/knadh/koanf/providers/file v1.2.1136go-mockery-3.8.0> go: downloading github.com/knadh/koanf/providers/env v1.1.0137go-mockery-3.8.0> go: downloading github.com/brunoga/deep v1.3.1138go-mockery-3.8.0> go: downloading github.com/go-viper/mapstructure/v2 v2.5.0139go-mockery-3.8.0> go: downloading golang.org/x/exp v0.0.0-20260212183809-81e46e3db34a140go-mockery-3.8.0> go: downloading github.com/huandu/xstrings v1.5.0141go-mockery-3.8.0> go: downloading github.com/xeipuuv/gojsonschema v1.2.0142go-mockery-3.8.0> go: downloading github.com/knadh/koanf/maps v0.1.2143go-mockery-3.8.0> go: downloading github.com/fsnotify/fsnotify v1.9.0144go-mockery-3.8.0> go: downloading go.yaml.in/yaml/v3 v3.0.4145go-mockery-3.8.0> go: downloading github.com/fatih/structs v1.1.0146go-mockery-3.8.0> go: downloading github.com/mitchellh/copystructure v1.2.0147go-mockery-3.8.0> go: downloading github.com/mitchellh/reflectwalk v1.0.2148go-mockery-3.8.0> go: downloading golang.org/x/sys v0.47.0149go-mockery-3.8.0> go: downloading github.com/mattn/go-colorable v0.1.14150go-mockery-3.8.0> go: downloading github.com/mattn/go-isatty v0.0.20151go-mockery-3.8.0> go: downloading github.com/xeipuuv/gojsonreference v0.0.0-20180127040603-bd5ef7bd5415152go-mockery-3.8.0> go: downloading github.com/xeipuuv/gojsonpointer v0.0.0-20190905194746-02993c407bfb153go-mockery-3.8.0> go: downloading golang.org/x/text v0.34.0154go-mockery-3.8.0> go: downloading github.com/mattn/go-runewidth v0.0.19155go-mockery-3.8.0> go: downloading github.com/clipperhouse/uax29/v2 v2.2.0156go-mockery-3.8.0> go: downloading golang.org/x/mod v0.39.0157go-mockery-3.8.0> go: downloading golang.org/x/sync v0.22.0158go-mockery-3.8.0> Running phase: checkPhase159go-mockery-3.8.0> task: [mocks.remove.unix] find . -name '*_mock.go' -o -name 'mock_*_test.go' -o -name "mocks_moq.go"  -o -name 'mocks_test.go' -o -name 'mocks_*_test.go' -o -name 'mocks_matryer_*.go' -o -name 'mocks.go' | xargs -r rm160go-mockery-3.8.0> task: [mocks.remove.unix] rm -rf mocks/161go-mockery-3.8.0> task: [mocks.generate.matryer] MOCKERY_CONFIG=./.mockery_matryer.yml GOWORK=off go run .162go-mockery-3.8.0> task: [mocks.generate.testify] MOCKERY_CONFIG=./.mockery_testify.yml GOWORK=off go run .163go-mockery-3.8.0> 2026-10-15T09:22:16.582663329Z INF Starting mockery config-file=./.mockery_matryer.yml version=v0.0.0-dev164go-mockery-3.8.0> 2026-10-15T09:22:16.582822789Z INF Parsing configured packages... version=v0.0.0-dev165go-mockery-3.8.0> 2026-10-15T09:22:17.005327687Z INF Starting mockery config-file=./.mockery_testify.yml version=v0.0.0-dev166go-mockery-3.8.0> 2026-10-15T09:22:17.005522067Z INF Parsing configured packages... version=v0.0.0-dev167go-mockery-3.8.0> 2026-10-15T09:22:17.093785826Z ERR encountered error when loading package error="/build/source/internal/fixtures/embedded_types/service.go:3:8: could not import context (reading /build/go-cache/16/16d7426311830f53869cc8722ab1bcb3419c71216fa9c306d75d02f25431fbee-d: internal error in importing \"context\" (cannot decode \"context\", export data version 5 is greater than maximum supported version 4); please report an issue)" version=v0.0.0-dev168go-mockery-3.8.0> 2026-10-15T09:22:17.093937496Z ERR unable to parse packages error="error occurred when loading packages" version=v0.0.0-dev169go-mockery-3.8.0> 2026-10-15T09:22:17.093964216Z FTL app failed error="error occurred when loading packages" version=v0.0.0-dev170go-mockery-3.8.0> exit status 1171go-mockery-3.8.0> 2026-10-15T09:22:18.594962349Z ERR encountered error when loading package error="/build/source/internal/fixtures/constraint_ifaces/constraint_interfaces.go:3:8: could not import golang.org/x/exp/constraints (reading /build/go-cache/1a/1a3dcbf550ee23d61ef37b4fe10f07f168d92a0a0466829b4495ff7668f10b66-d: internal error in importing \"golang.org/x/exp/constraints\" (cannot decode \"golang.org/x/exp/constraints\", export data version 5 is greater than maximum supported version 4); please report an issue)" version=v0.0.0-dev172go-mockery-3.8.0> 2026-10-15T09:22:18.595098759Z ERR unable to parse packages error="error occurred when loading packages" version=v0.0.0-dev173go-mockery-3.8.0> 2026-10-15T09:22:18.595119249Z FTL app failed error="error occurred when loading packages" version=v0.0.0-dev174go-mockery-3.8.0> exit status 1175go-mockery-3.8.0> task: Failed to run task "test.ci": task: Failed to run task "mocks": task: Failed to run task "mocks.generate": task: Failed to run task "mocks.generate.matryer": exit status 1176error: Cannot build '/nix/store/gkqgcnhs8mhk2iph8z1gv8gkm6s8c8p2-go-mockery-3.8.0.drv'.177       Reason: builder failed with exit code 201.178       Output paths:179         /nix/store/d17x8sn2schb2x6r357i35ql9i7h0f4y-go-mockery-3.8.0180       Last 25 log lines:181       > go: downloading github.com/xeipuuv/gojsonreference v0.0.0-20180127040603-bd5ef7bd5415182       > go: downloading github.com/xeipuuv/gojsonpointer v0.0.0-20190905194746-02993c407bfb183       > go: downloading golang.org/x/text v0.34.0184       > go: downloading github.com/mattn/go-runewidth v0.0.19185       > go: downloading github.com/clipperhouse/uax29/v2 v2.2.0186       > go: downloading golang.org/x/mod v0.39.0187       > go: downloading golang.org/x/sync v0.22.0188       > Running phase: checkPhase189       > task: [mocks.remove.unix] find . -name '*_mock.go' -o -name 'mock_*_test.go' -o -name "mocks_moq.go"  -o -name 'mocks_test.go' -o -name 'mocks_*_test.go' -o -name 'mocks_matryer_*.go' -o -name 'mocks.go' | xargs -r rm190       > task: [mocks.remove.unix] rm -rf mocks/191       > task: [mocks.generate.matryer] MOCKERY_CONFIG=./.mockery_matryer.yml GOWORK=off go run .192       > task: [mocks.generate.testify] MOCKERY_CONFIG=./.mockery_testify.yml GOWORK=off go run .193       > 2026-10-15T09:22:16.582663329Z INF Starting mockery config-file=./.mockery_matryer.yml version=v0.0.0-dev194       > 2026-10-15T09:22:16.582822789Z INF Parsing configured packages... version=v0.0.0-dev195       > 2026-10-15T09:22:17.005327687Z INF Starting mockery config-file=./.mockery_testify.yml version=v0.0.0-dev196       > 2026-10-15T09:22:17.005522067Z INF Parsing configured packages... version=v0.0.0-dev197       > 2026-10-15T09:22:17.093785826Z ERR encountered error when loading package error="/build/source/internal/fixtures/embedded_types/service.go:3:8: could not import context (reading /build/go-cache/16/16d7426311830f53869cc8722ab1bcb3419c71216fa9c306d75d02f25431fbee-d: internal error in importing \"context\" (cannot decode \"context\", export data version 5 is greater than maximum supported version 4); please report an issue)" version=v0.0.0-dev198       > 2026-10-15T09:22:17.093937496Z ERR unable to parse packages error="error occurred when loading packages" version=v0.0.0-dev199       > 2026-10-15T09:22:17.093964216Z FTL app failed error="error occurred when loading packages" version=v0.0.0-dev200       > exit status 1201       > 2026-10-15T09:22:18.594962349Z ERR encountered error when loading package error="/build/source/internal/fixtures/constraint_ifaces/constraint_interfaces.go:3:8: could not import golang.org/x/exp/constraints (reading /build/go-cache/1a/1a3dcbf550ee23d61ef37b4fe10f07f168d92a0a0466829b4495ff7668f10b66-d: internal error in importing \"golang.org/x/exp/constraints\" (cannot decode \"golang.org/x/exp/constraints\", export data version 5 is greater than maximum supported version 4); please report an issue)" version=v0.0.0-dev202       > 2026-10-15T09:22:18.595098759Z ERR unable to parse packages error="error occurred when loading packages" version=v0.0.0-dev203       > 2026-10-15T09:22:18.595119249Z FTL app failed error="error occurred when loading packages" version=v0.0.0-dev204       > exit status 1205       > task: Failed to run task "test.ci": task: Failed to run task "mocks": task: Failed to run task "mocks.generate": task: Failed to run task "mocks.generate.matryer": exit status 1206       For full logs, run:207         nix log /nix/store/gkqgcnhs8mhk2iph8z1gv8gkm6s8c8p2-go-mockery-3.8.0.drv208error: Cannot build '/nix/store/5blymz8vn1vs1g9ajhfd431n9m17vkh4-sesh-2.32.0.drv'.209       Reason: 1 dependency failed.210       Output paths:211         /nix/store/slrxxr0bjf6zgkb4znqvbr9fwkjmfcrz-sesh-2.32.0