failed attributes
| status |
attribute |
duration |
| failed |
checks.x86_64-linux.nixos-eve
- A legacy Nextcloud install (from before NixOS 26.11) may be installed.
After nextcloud34 is installed successfully, you can safely upgrade
to 35. The latest version available is Nextcloud35.
Please note that Nextcloud doesn't support upgrades across multiple major versions
(i.e. an upgrade from 16 is possible to 17, but not 16 to 18).
The package can be upgraded by explicitly declaring the service-option
`services.nextcloud.package`.
|
8m 0s |
lldap-0.6.3:
Compiling bstr v1.12.1
Compiling serial_test_derive v2.0.0
Compiling diff v0.1.13
Compiling nix v0.31.2
Compiling predicates-tree v1 …
lldap-0.6.3:
Compiling bstr v1.12.1
Compiling serial_test_derive v2.0.0
Compiling diff v0.1.13
Compiling nix v0.31.2
Compiling predicates-tree v1.0.13
Compiling pretty_assertions v1.4.1
Compiling predicates v3.1.4
tribuchet: remote build failed: no connected worker builds for system x86_64-linux
… and 1 more failed derivation
|
| failed |
checks.aarch64-darwin.darwin-evo
|
6m 13s |
nix-store-2.36.0pre:
../include/nix/store/sqlite.hh:173:16: warning: private field 'extendedErrNo' is not used [-Wunused-private-field]
173 | int errNo, e …
nix-store-2.36.0pre:
../include/nix/store/sqlite.hh:173:16: warning: private field 'extendedErrNo' is not used [-Wunused-private-field]
173 | int errNo, extendedErrNo, offset;
| ^
../include/nix/store/sqlite.hh:173:31: warning: private field 'offset' is not used [-Wunused-private-field]
173 | int errNo, extendedErrNo, offset;
| ^
3 warnings and 2 errors generated.
ninja: build stopped: subcommand failed.
|
| failed |
checks.aarch64-darwin.home-manager-common
|
6m 12s |
nix-store-2.36.0pre:
../include/nix/store/sqlite.hh:173:16: warning: private field 'extendedErrNo' is not used [-Wunused-private-field]
173 | int errNo, e …
nix-store-2.36.0pre:
../include/nix/store/sqlite.hh:173:16: warning: private field 'extendedErrNo' is not used [-Wunused-private-field]
173 | int errNo, extendedErrNo, offset;
| ^
../include/nix/store/sqlite.hh:173:31: warning: private field 'offset' is not used [-Wunused-private-field]
173 | int errNo, extendedErrNo, offset;
| ^
3 warnings and 2 errors generated.
ninja: build stopped: subcommand failed.
|
| failed |
checks.aarch64-darwin.home-manager-macos
|
6m 18s |
tuicr-0.27.0:
patching file src/config/mod.rs
Hunk #1 FAILED at 134.
Hunk #2 succeeded at 264 with fuzz 2 (offset 56 lines).
Hunk #3 FAILED at 454.
Hunk #4 succ …
tuicr-0.27.0:
patching file src/config/mod.rs
Hunk #1 FAILED at 134.
Hunk #2 succeeded at 264 with fuzz 2 (offset 56 lines).
Hunk #3 FAILED at 454.
Hunk #4 succeeded at 1280 (offset 162 lines).
2 out of 4 hunks FAILED -- saving rejects to file src/config/mod.rs.rej
patching file src/main.rs
Hunk #1 succeeded at 400 (offset 15 lines).
nix-store-2.36.0pre:
../include/nix/store/sqlite.hh:173:16: warning: private field 'extendedErrNo' is not used [-Wunused-private-field]
173 | int errNo, extendedErrNo, offset;
| ^
../include/nix/store/sqlite.hh:173:31: warning: private field 'offset' is not used [-Wunused-private-field]
173 | int errNo, extendedErrNo, offset;
| ^
3 warnings and 2 errors generated.
ninja: build stopped: subcommand failed.
|
| failed |
checks.aarch64-darwin.home-manager-utm-vm
|
6m 15s |
tuicr-0.27.0:
patching file src/config/mod.rs
Hunk #1 FAILED at 134.
Hunk #2 succeeded at 264 with fuzz 2 (offset 56 lines).
Hunk #3 FAILED at 454.
Hunk #4 succ …
tuicr-0.27.0:
patching file src/config/mod.rs
Hunk #1 FAILED at 134.
Hunk #2 succeeded at 264 with fuzz 2 (offset 56 lines).
Hunk #3 FAILED at 454.
Hunk #4 succeeded at 1280 (offset 162 lines).
2 out of 4 hunks FAILED -- saving rejects to file src/config/mod.rs.rej
patching file src/main.rs
Hunk #1 succeeded at 400 (offset 15 lines).
nix-store-2.36.0pre:
../include/nix/store/sqlite.hh:173:16: warning: private field 'extendedErrNo' is not used [-Wunused-private-field]
173 | int errNo, extendedErrNo, offset;
| ^
../include/nix/store/sqlite.hh:173:31: warning: private field 'offset' is not used [-Wunused-private-field]
173 | int errNo, extendedErrNo, offset;
| ^
3 warnings and 2 errors generated.
ninja: build stopped: subcommand failed.
|
| failed |
checks.aarch64-linux.home-manager-common
|
8m 56s |
nix-store-2.36.0pre:
/build/source/src/libstore/build/derivation-building-goal.cc: In member function 'nix::Goal::Co<std::variant<std::variant<nix::BuildResult: …
nix-store-2.36.0pre:
/build/source/src/libstore/build/derivation-building-goal.cc: In member function 'nix::Goal::Co<std::variant<std::variant<nix::BuildResult::Success, nix::BuildError>, nix::DerivationBuildingGoal::NeedsSlot> > nix::DerivationBuildingGoal::buildLocally(LocalBuildCapability, const nix::StorePathSet&, std::map<std::__cxx11::basic_string<char>, nix::InitialOutput>&, nix::DerivationOptions<nix::StorePath>&, nix::PathLocks)':
/build/source/src/libstore/build/derivation-building-goal.cc:1101:30: error: cannot bind non-const lvalue reference of type 'std::map<std::__cxx11::basic_string<char>, nix::InitialOutput>&' to an rvalue of type 'std::remove_reference<std::map<std::__cxx11::basic_string<char>, nix::InitialOutput>&>::type' {aka 'std::map<std::__cxx11::basic_string<char>, nix::InitialOutput>'}
1101 | std::move(initialOutputs),
| ~~~~~~~~~^~~~~~~~~~~~~~~~
/build/source/src/libstore/build/derivation-building-goal.cc:839:44: note: initializing argument 3 of 'nix::Goal::Co<std::variant<std::variant<nix::BuildResult::Success, nix::BuildError>, nix::DerivationBuildingGoal::NeedsSlot> > nix::DerivationBuildingGoal::buildLocally(LocalBuildCapability, const nix::StorePathSet&, std::map<std::__cxx11::basic_string<char>, nix::InitialOutput>&, nix::DerivationOptions<nix::StorePath>&, nix::PathLocks)'
839 | std::map<std::string, InitialOutput> & initialOutputs,
| ~~~~~~~~~~~~~~~~~~~~~~~~~~~~~~~~~~~~~~~^~~~~~~~~~~~~~
ninja: build stopped: subcommand failed.
|
| failed |
checks.aarch64-linux.home-manager-utm-vm
|
8m 53s |
tuicr-0.27.0:
patching file src/config/mod.rs
Hunk #1 FAILED at 134.
Hunk #2 succeeded at 264 with fuzz 2 (offset 56 lines).
Hunk #3 FAILED at 454.
Hunk #4 succ …
tuicr-0.27.0:
patching file src/config/mod.rs
Hunk #1 FAILED at 134.
Hunk #2 succeeded at 264 with fuzz 2 (offset 56 lines).
Hunk #3 FAILED at 454.
Hunk #4 succeeded at 1280 (offset 162 lines).
2 out of 4 hunks FAILED -- saving rejects to file src/config/mod.rs.rej
patching file src/main.rs
Hunk #1 succeeded at 400 (offset 15 lines).
nix-store-2.36.0pre:
/build/source/src/libstore/build/derivation-building-goal.cc: In member function 'nix::Goal::Co<std::variant<std::variant<nix::BuildResult::Success, nix::BuildError>, nix::DerivationBuildingGoal::NeedsSlot> > nix::DerivationBuildingGoal::buildLocally(LocalBuildCapability, const nix::StorePathSet&, std::map<std::__cxx11::basic_string<char>, nix::InitialOutput>&, nix::DerivationOptions<nix::StorePath>&, nix::PathLocks)':
/build/source/src/libstore/build/derivation-building-goal.cc:1101:30: error: cannot bind non-const lvalue reference of type 'std::map<std::__cxx11::basic_string<char>, nix::InitialOutput>&' to an rvalue of type 'std::remove_reference<std::map<std::__cxx11::basic_string<char>, nix::InitialOutput>&>::type' {aka 'std::map<std::__cxx11::basic_string<char>, nix::InitialOutput>'}
1101 | std::move(initialOutputs),
| ~~~~~~~~~^~~~~~~~~~~~~~~~
/build/source/src/libstore/build/derivation-building-goal.cc:839:44: note: initializing argument 3 of 'nix::Goal::Co<std::variant<std::variant<nix::BuildResult::Success, nix::BuildError>, nix::DerivationBuildingGoal::NeedsSlot> > nix::DerivationBuildingGoal::buildLocally(LocalBuildCapability, const nix::StorePathSet&, std::map<std::__cxx11::basic_string<char>, nix::InitialOutput>&, nix::DerivationOptions<nix::StorePath>&, nix::PathLocks)'
839 | std::map<std::string, InitialOutput> & initialOutputs,
| ~~~~~~~~~~~~~~~~~~~~~~~~~~~~~~~~~~~~~~~^~~~~~~~~~~~~~
ninja: build stopped: subcommand failed.
|
| failed |
checks.aarch64-linux.nixos-blob64
|
6m 31s |
nix-store-2.36.0pre:
/build/source/src/libstore/build/derivation-building-goal.cc: In member function 'nix::Goal::Co<std::variant<std::variant<nix::BuildResult: …
nix-store-2.36.0pre:
/build/source/src/libstore/build/derivation-building-goal.cc: In member function 'nix::Goal::Co<std::variant<std::variant<nix::BuildResult::Success, nix::BuildError>, nix::DerivationBuildingGoal::NeedsSlot> > nix::DerivationBuildingGoal::buildLocally(LocalBuildCapability, const nix::StorePathSet&, std::map<std::__cxx11::basic_string<char>, nix::InitialOutput>&, nix::DerivationOptions<nix::StorePath>&, nix::PathLocks)':
/build/source/src/libstore/build/derivation-building-goal.cc:1101:30: error: cannot bind non-const lvalue reference of type 'std::map<std::__cxx11::basic_string<char>, nix::InitialOutput>&' to an rvalue of type 'std::remove_reference<std::map<std::__cxx11::basic_string<char>, nix::InitialOutput>&>::type' {aka 'std::map<std::__cxx11::basic_string<char>, nix::InitialOutput>'}
1101 | std::move(initialOutputs),
| ~~~~~~~~~^~~~~~~~~~~~~~~~
/build/source/src/libstore/build/derivation-building-goal.cc:839:44: note: initializing argument 3 of 'nix::Goal::Co<std::variant<std::variant<nix::BuildResult::Success, nix::BuildError>, nix::DerivationBuildingGoal::NeedsSlot> > nix::DerivationBuildingGoal::buildLocally(LocalBuildCapability, const nix::StorePathSet&, std::map<std::__cxx11::basic_string<char>, nix::InitialOutput>&, nix::DerivationOptions<nix::StorePath>&, nix::PathLocks)'
839 | std::map<std::string, InitialOutput> & initialOutputs,
| ~~~~~~~~~~~~~~~~~~~~~~~~~~~~~~~~~~~~~~~^~~~~~~~~~~~~~
ninja: build stopped: subcommand failed.
|
| failed |
checks.x86_64-linux.home-manager-bernie
|
3m 10s |
nix-store-2.36.0pre:
/build/source/src/libstore/build/derivation-building-goal.cc: In member function 'nix::Goal::Co<std::variant<std::variant<nix::BuildResult: …
nix-store-2.36.0pre:
/build/source/src/libstore/build/derivation-building-goal.cc: In member function 'nix::Goal::Co<std::variant<std::variant<nix::BuildResult::Success, nix::BuildError>, nix::DerivationBuildingGoal::NeedsSlot> > nix::DerivationBuildingGoal::buildLocally(LocalBuildCapability, const nix::StorePathSet&, std::map<std::__cxx11::basic_string<char>, nix::InitialOutput>&, nix::DerivationOptions<nix::StorePath>&, nix::PathLocks)':
/build/source/src/libstore/build/derivation-building-goal.cc:1101:30: error: cannot bind non-const lvalue reference of type 'std::map<std::__cxx11::basic_string<char>, nix::InitialOutput>&' to an rvalue of type 'std::remove_reference<std::map<std::__cxx11::basic_string<char>, nix::InitialOutput>&>::type' {aka 'std::map<std::__cxx11::basic_string<char>, nix::InitialOutput>'}
1101 | std::move(initialOutputs),
| ~~~~~~~~~^~~~~~~~~~~~~~~~
/build/source/src/libstore/build/derivation-building-goal.cc:839:44: note: initializing argument 3 of 'nix::Goal::Co<std::variant<std::variant<nix::BuildResult::Success, nix::BuildError>, nix::DerivationBuildingGoal::NeedsSlot> > nix::DerivationBuildingGoal::buildLocally(LocalBuildCapability, const nix::StorePathSet&, std::map<std::__cxx11::basic_string<char>, nix::InitialOutput>&, nix::DerivationOptions<nix::StorePath>&, nix::PathLocks)'
839 | std::map<std::string, InitialOutput> & initialOutputs,
| ~~~~~~~~~~~~~~~~~~~~~~~~~~~~~~~~~~~~~~~^~~~~~~~~~~~~~
ninja: build stopped: subcommand failed.
|
| failed |
checks.x86_64-linux.home-manager-coder
|
3m 12s |
tuicr-0.27.0:
patching file src/config/mod.rs
Hunk #1 FAILED at 134.
Hunk #2 succeeded at 264 with fuzz 2 (offset 56 lines).
Hunk #3 FAILED at 454.
Hunk #4 succ …
tuicr-0.27.0:
patching file src/config/mod.rs
Hunk #1 FAILED at 134.
Hunk #2 succeeded at 264 with fuzz 2 (offset 56 lines).
Hunk #3 FAILED at 454.
Hunk #4 succeeded at 1280 (offset 162 lines).
2 out of 4 hunks FAILED -- saving rejects to file src/config/mod.rs.rej
patching file src/main.rs
Hunk #1 succeeded at 400 (offset 15 lines).
nix-store-2.36.0pre:
/build/source/src/libstore/build/derivation-building-goal.cc: In member function 'nix::Goal::Co<std::variant<std::variant<nix::BuildResult::Success, nix::BuildError>, nix::DerivationBuildingGoal::NeedsSlot> > nix::DerivationBuildingGoal::buildLocally(LocalBuildCapability, const nix::StorePathSet&, std::map<std::__cxx11::basic_string<char>, nix::InitialOutput>&, nix::DerivationOptions<nix::StorePath>&, nix::PathLocks)':
/build/source/src/libstore/build/derivation-building-goal.cc:1101:30: error: cannot bind non-const lvalue reference of type 'std::map<std::__cxx11::basic_string<char>, nix::InitialOutput>&' to an rvalue of type 'std::remove_reference<std::map<std::__cxx11::basic_string<char>, nix::InitialOutput>&>::type' {aka 'std::map<std::__cxx11::basic_string<char>, nix::InitialOutput>'}
1101 | std::move(initialOutputs),
| ~~~~~~~~~^~~~~~~~~~~~~~~~
/build/source/src/libstore/build/derivation-building-goal.cc:839:44: note: initializing argument 3 of 'nix::Goal::Co<std::variant<std::variant<nix::BuildResult::Success, nix::BuildError>, nix::DerivationBuildingGoal::NeedsSlot> > nix::DerivationBuildingGoal::buildLocally(LocalBuildCapability, const nix::StorePathSet&, std::map<std::__cxx11::basic_string<char>, nix::InitialOutput>&, nix::DerivationOptions<nix::StorePath>&, nix::PathLocks)'
839 | std::map<std::string, InitialOutput> & initialOutputs,
| ~~~~~~~~~~~~~~~~~~~~~~~~~~~~~~~~~~~~~~~^~~~~~~~~~~~~~
ninja: build stopped: subcommand failed.
|
| failed |
checks.x86_64-linux.home-manager-common
|
3m 21s |
nix-store-2.36.0pre:
/build/source/src/libstore/build/derivation-building-goal.cc: In member function 'nix::Goal::Co<std::variant<std::variant<nix::BuildResult: …
nix-store-2.36.0pre:
/build/source/src/libstore/build/derivation-building-goal.cc: In member function 'nix::Goal::Co<std::variant<std::variant<nix::BuildResult::Success, nix::BuildError>, nix::DerivationBuildingGoal::NeedsSlot> > nix::DerivationBuildingGoal::buildLocally(LocalBuildCapability, const nix::StorePathSet&, std::map<std::__cxx11::basic_string<char>, nix::InitialOutput>&, nix::DerivationOptions<nix::StorePath>&, nix::PathLocks)':
/build/source/src/libstore/build/derivation-building-goal.cc:1101:30: error: cannot bind non-const lvalue reference of type 'std::map<std::__cxx11::basic_string<char>, nix::InitialOutput>&' to an rvalue of type 'std::remove_reference<std::map<std::__cxx11::basic_string<char>, nix::InitialOutput>&>::type' {aka 'std::map<std::__cxx11::basic_string<char>, nix::InitialOutput>'}
1101 | std::move(initialOutputs),
| ~~~~~~~~~^~~~~~~~~~~~~~~~
/build/source/src/libstore/build/derivation-building-goal.cc:839:44: note: initializing argument 3 of 'nix::Goal::Co<std::variant<std::variant<nix::BuildResult::Success, nix::BuildError>, nix::DerivationBuildingGoal::NeedsSlot> > nix::DerivationBuildingGoal::buildLocally(LocalBuildCapability, const nix::StorePathSet&, std::map<std::__cxx11::basic_string<char>, nix::InitialOutput>&, nix::DerivationOptions<nix::StorePath>&, nix::PathLocks)'
839 | std::map<std::string, InitialOutput> & initialOutputs,
| ~~~~~~~~~~~~~~~~~~~~~~~~~~~~~~~~~~~~~~~^~~~~~~~~~~~~~
ninja: build stopped: subcommand failed.
|
| failed |
checks.x86_64-linux.home-manager-desktop
|
8m 4s |
radicle-desktop-0.17.0:
Compiling dprint-swc-ext v0.26.0
Compiling deno_ast v0.53.3
Compiling gdk-pixbuf v0.18.5
Compiling pango v0.18.3
Compilin …
radicle-desktop-0.17.0:
Compiling dprint-swc-ext v0.26.0
Compiling deno_ast v0.53.3
Compiling gdk-pixbuf v0.18.5
Compiling pango v0.18.3
Compiling soup3 v0.5.0
Compiling dprint-plugin-typescript v0.95.15
Compiling gdk v0.18.2
tribuchet: remote build failed: no connected worker builds for system x86_64-linux
tuicr-0.27.0:
patching file src/config/mod.rs
Hunk #1 FAILED at 134.
Hunk #2 succeeded at 264 with fuzz 2 (offset 56 lines).
Hunk #3 FAILED at 454.
Hunk #4 succeeded at 1280 (offset 162 lines).
2 out of 4 hunks FAILED -- saving rejects to file src/config/mod.rs.rej
patching file src/main.rs
Hunk #1 succeeded at 400 (offset 15 lines).
nix-store-2.36.0pre:
/build/source/src/libstore/build/derivation-building-goal.cc: In member function 'nix::Goal::Co<std::variant<std::variant<nix::BuildResult::Success, nix::BuildError>, nix::DerivationBuildingGoal::NeedsSlot> > nix::DerivationBuildingGoal::buildLocally(LocalBuildCapability, const nix::StorePathSet&, std::map<std::__cxx11::basic_string<char>, nix::InitialOutput>&, nix::DerivationOptions<nix::StorePath>&, nix::PathLocks)':
/build/source/src/libstore/build/derivation-building-goal.cc:1101:30: error: cannot bind non-const lvalue reference of type 'std::map<std::__cxx11::basic_string<char>, nix::InitialOutput>&' to an rvalue of type 'std::remove_reference<std::map<std::__cxx11::basic_string<char>, nix::InitialOutput>&>::type' {aka 'std::map<std::__cxx11::basic_string<char>, nix::InitialOutput>'}
1101 | std::move(initialOutputs),
| ~~~~~~~~~^~~~~~~~~~~~~~~~
/build/source/src/libstore/build/derivation-building-goal.cc:839:44: note: initializing argument 3 of 'nix::Goal::Co<std::variant<std::variant<nix::BuildResult::Success, nix::BuildError>, nix::DerivationBuildingGoal::NeedsSlot> > nix::DerivationBuildingGoal::buildLocally(LocalBuildCapability, const nix::StorePathSet&, std::map<std::__cxx11::basic_string<char>, nix::InitialOutput>&, nix::DerivationOptions<nix::StorePath>&, nix::PathLocks)'
839 | std::map<std::string, InitialOutput> & initialOutputs,
| ~~~~~~~~~~~~~~~~~~~~~~~~~~~~~~~~~~~~~~~^~~~~~~~~~~~~~
ninja: build stopped: subcommand failed.
|
| failed |
checks.x86_64-linux.home-manager-eve
|
8m 6s |
tuicr-0.27.0:
patching file src/config/mod.rs
Hunk #1 FAILED at 134.
Hunk #2 succeeded at 264 with fuzz 2 (offset 56 lines).
Hunk #3 FAILED at 454.
Hunk #4 succ …
tuicr-0.27.0:
patching file src/config/mod.rs
Hunk #1 FAILED at 134.
Hunk #2 succeeded at 264 with fuzz 2 (offset 56 lines).
Hunk #3 FAILED at 454.
Hunk #4 succeeded at 1280 (offset 162 lines).
2 out of 4 hunks FAILED -- saving rejects to file src/config/mod.rs.rej
patching file src/main.rs
Hunk #1 succeeded at 400 (offset 15 lines).
nix-store-2.36.0pre:
seccomp-sandboxing : enabled
unity : on
unity_size : 8192
wrap_mode : nodownload
Found ninja-1.13.2 at /nix/store/4nsdla28c4177ssp0hlyv5l2yzj8wcba-ninja-1.13.2/bin/ninja
Running postconf script '/nix/store/lb41b0anx1f98y9y5s9mdv97gjgsq740-python3-3.14.7/bin/python3.14 /build/source/src/libstore/nix-meson-build-support/common/clang-tidy/clean_compdb.py /build/source/src/libstore/meson-build-dir/compile_commands.json /build/source/src/libstore/meson-build-dir/nix-meson-build-support/common/clang-tidy/compile_commands.json'
build flags: -j24
tribuchet: remote build failed: no connected worker builds for system x86_64-linux
|
| failed |
checks.x86_64-linux.home-manager-mic92
|
4m 35s |
nix-store-2.36.0pre:
/build/source/src/libstore/build/derivation-building-goal.cc: In member function 'nix::Goal::Co<std::variant<std::variant<nix::BuildResult: …
nix-store-2.36.0pre:
/build/source/src/libstore/build/derivation-building-goal.cc: In member function 'nix::Goal::Co<std::variant<std::variant<nix::BuildResult::Success, nix::BuildError>, nix::DerivationBuildingGoal::NeedsSlot> > nix::DerivationBuildingGoal::buildLocally(LocalBuildCapability, const nix::StorePathSet&, std::map<std::__cxx11::basic_string<char>, nix::InitialOutput>&, nix::DerivationOptions<nix::StorePath>&, nix::PathLocks)':
/build/source/src/libstore/build/derivation-building-goal.cc:1101:30: error: cannot bind non-const lvalue reference of type 'std::map<std::__cxx11::basic_string<char>, nix::InitialOutput>&' to an rvalue of type 'std::remove_reference<std::map<std::__cxx11::basic_string<char>, nix::InitialOutput>&>::type' {aka 'std::map<std::__cxx11::basic_string<char>, nix::InitialOutput>'}
1101 | std::move(initialOutputs),
| ~~~~~~~~~^~~~~~~~~~~~~~~~
/build/source/src/libstore/build/derivation-building-goal.cc:839:44: note: initializing argument 3 of 'nix::Goal::Co<std::variant<std::variant<nix::BuildResult::Success, nix::BuildError>, nix::DerivationBuildingGoal::NeedsSlot> > nix::DerivationBuildingGoal::buildLocally(LocalBuildCapability, const nix::StorePathSet&, std::map<std::__cxx11::basic_string<char>, nix::InitialOutput>&, nix::DerivationOptions<nix::StorePath>&, nix::PathLocks)'
839 | std::map<std::string, InitialOutput> & initialOutputs,
| ~~~~~~~~~~~~~~~~~~~~~~~~~~~~~~~~~~~~~~~^~~~~~~~~~~~~~
ninja: build stopped: subcommand failed.
|
| failed |
checks.x86_64-linux.home-manager-utm-vm
|
5m 31s |
tuicr-0.27.0:
patching file src/config/mod.rs
Hunk #1 FAILED at 134.
Hunk #2 succeeded at 264 with fuzz 2 (offset 56 lines).
Hunk #3 FAILED at 454.
Hunk #4 succ …
tuicr-0.27.0:
patching file src/config/mod.rs
Hunk #1 FAILED at 134.
Hunk #2 succeeded at 264 with fuzz 2 (offset 56 lines).
Hunk #3 FAILED at 454.
Hunk #4 succeeded at 1280 (offset 162 lines).
2 out of 4 hunks FAILED -- saving rejects to file src/config/mod.rs.rej
patching file src/main.rs
Hunk #1 succeeded at 400 (offset 15 lines).
nix-store-2.36.0pre:
/build/source/src/libstore/build/derivation-building-goal.cc: In member function 'nix::Goal::Co<std::variant<std::variant<nix::BuildResult::Success, nix::BuildError>, nix::DerivationBuildingGoal::NeedsSlot> > nix::DerivationBuildingGoal::buildLocally(LocalBuildCapability, const nix::StorePathSet&, std::map<std::__cxx11::basic_string<char>, nix::InitialOutput>&, nix::DerivationOptions<nix::StorePath>&, nix::PathLocks)':
/build/source/src/libstore/build/derivation-building-goal.cc:1101:30: error: cannot bind non-const lvalue reference of type 'std::map<std::__cxx11::basic_string<char>, nix::InitialOutput>&' to an rvalue of type 'std::remove_reference<std::map<std::__cxx11::basic_string<char>, nix::InitialOutput>&>::type' {aka 'std::map<std::__cxx11::basic_string<char>, nix::InitialOutput>'}
1101 | std::move(initialOutputs),
| ~~~~~~~~~^~~~~~~~~~~~~~~~
/build/source/src/libstore/build/derivation-building-goal.cc:839:44: note: initializing argument 3 of 'nix::Goal::Co<std::variant<std::variant<nix::BuildResult::Success, nix::BuildError>, nix::DerivationBuildingGoal::NeedsSlot> > nix::DerivationBuildingGoal::buildLocally(LocalBuildCapability, const nix::StorePathSet&, std::map<std::__cxx11::basic_string<char>, nix::InitialOutput>&, nix::DerivationOptions<nix::StorePath>&, nix::PathLocks)'
839 | std::map<std::string, InitialOutput> & initialOutputs,
| ~~~~~~~~~~~~~~~~~~~~~~~~~~~~~~~~~~~~~~~^~~~~~~~~~~~~~
ninja: build stopped: subcommand failed.
|
| failed |
checks.x86_64-linux.nixos-bernie
|
2m 57s |
nix-store-2.36.0pre:
/build/source/src/libstore/build/derivation-building-goal.cc: In member function 'nix::Goal::Co<std::variant<std::variant<nix::BuildResult: …
nix-store-2.36.0pre:
/build/source/src/libstore/build/derivation-building-goal.cc: In member function 'nix::Goal::Co<std::variant<std::variant<nix::BuildResult::Success, nix::BuildError>, nix::DerivationBuildingGoal::NeedsSlot> > nix::DerivationBuildingGoal::buildLocally(LocalBuildCapability, const nix::StorePathSet&, std::map<std::__cxx11::basic_string<char>, nix::InitialOutput>&, nix::DerivationOptions<nix::StorePath>&, nix::PathLocks)':
/build/source/src/libstore/build/derivation-building-goal.cc:1101:30: error: cannot bind non-const lvalue reference of type 'std::map<std::__cxx11::basic_string<char>, nix::InitialOutput>&' to an rvalue of type 'std::remove_reference<std::map<std::__cxx11::basic_string<char>, nix::InitialOutput>&>::type' {aka 'std::map<std::__cxx11::basic_string<char>, nix::InitialOutput>'}
1101 | std::move(initialOutputs),
| ~~~~~~~~~^~~~~~~~~~~~~~~~
/build/source/src/libstore/build/derivation-building-goal.cc:839:44: note: initializing argument 3 of 'nix::Goal::Co<std::variant<std::variant<nix::BuildResult::Success, nix::BuildError>, nix::DerivationBuildingGoal::NeedsSlot> > nix::DerivationBuildingGoal::buildLocally(LocalBuildCapability, const nix::StorePathSet&, std::map<std::__cxx11::basic_string<char>, nix::InitialOutput>&, nix::DerivationOptions<nix::StorePath>&, nix::PathLocks)'
839 | std::map<std::string, InitialOutput> & initialOutputs,
| ~~~~~~~~~~~~~~~~~~~~~~~~~~~~~~~~~~~~~~~^~~~~~~~~~~~~~
ninja: build stopped: subcommand failed.
|
| failed |
checks.x86_64-linux.nixos-dorits-laptop
|
7m 14s |
nix-store-2.36.0pre:
/build/source/src/libstore/build/derivation-building-goal.cc: In member function 'nix::Goal::Co<std::variant<std::variant<nix::BuildResult: …
nix-store-2.36.0pre:
/build/source/src/libstore/build/derivation-building-goal.cc: In member function 'nix::Goal::Co<std::variant<std::variant<nix::BuildResult::Success, nix::BuildError>, nix::DerivationBuildingGoal::NeedsSlot> > nix::DerivationBuildingGoal::buildLocally(LocalBuildCapability, const nix::StorePathSet&, std::map<std::__cxx11::basic_string<char>, nix::InitialOutput>&, nix::DerivationOptions<nix::StorePath>&, nix::PathLocks)':
/build/source/src/libstore/build/derivation-building-goal.cc:1101:30: error: cannot bind non-const lvalue reference of type 'std::map<std::__cxx11::basic_string<char>, nix::InitialOutput>&' to an rvalue of type 'std::remove_reference<std::map<std::__cxx11::basic_string<char>, nix::InitialOutput>&>::type' {aka 'std::map<std::__cxx11::basic_string<char>, nix::InitialOutput>'}
1101 | std::move(initialOutputs),
| ~~~~~~~~~^~~~~~~~~~~~~~~~
/build/source/src/libstore/build/derivation-building-goal.cc:839:44: note: initializing argument 3 of 'nix::Goal::Co<std::variant<std::variant<nix::BuildResult::Success, nix::BuildError>, nix::DerivationBuildingGoal::NeedsSlot> > nix::DerivationBuildingGoal::buildLocally(LocalBuildCapability, const nix::StorePathSet&, std::map<std::__cxx11::basic_string<char>, nix::InitialOutput>&, nix::DerivationOptions<nix::StorePath>&, nix::PathLocks)'
839 | std::map<std::string, InitialOutput> & initialOutputs,
| ~~~~~~~~~~~~~~~~~~~~~~~~~~~~~~~~~~~~~~~^~~~~~~~~~~~~~
ninja: build stopped: subcommand failed.
|
| failed |
checks.x86_64-linux.nixos-eva
|
19m 49s |
nix-store-2.36.0pre:
/build/source/src/libstore/build/derivation-building-goal.cc: In member function 'nix::Goal::Co<std::variant<std::variant<nix::BuildResult: …
nix-store-2.36.0pre:
/build/source/src/libstore/build/derivation-building-goal.cc: In member function 'nix::Goal::Co<std::variant<std::variant<nix::BuildResult::Success, nix::BuildError>, nix::DerivationBuildingGoal::NeedsSlot> > nix::DerivationBuildingGoal::buildLocally(LocalBuildCapability, const nix::StorePathSet&, std::map<std::__cxx11::basic_string<char>, nix::InitialOutput>&, nix::DerivationOptions<nix::StorePath>&, nix::PathLocks)':
/build/source/src/libstore/build/derivation-building-goal.cc:1101:30: error: cannot bind non-const lvalue reference of type 'std::map<std::__cxx11::basic_string<char>, nix::InitialOutput>&' to an rvalue of type 'std::remove_reference<std::map<std::__cxx11::basic_string<char>, nix::InitialOutput>&>::type' {aka 'std::map<std::__cxx11::basic_string<char>, nix::InitialOutput>'}
1101 | std::move(initialOutputs),
| ~~~~~~~~~^~~~~~~~~~~~~~~~
/build/source/src/libstore/build/derivation-building-goal.cc:839:44: note: initializing argument 3 of 'nix::Goal::Co<std::variant<std::variant<nix::BuildResult::Success, nix::BuildError>, nix::DerivationBuildingGoal::NeedsSlot> > nix::DerivationBuildingGoal::buildLocally(LocalBuildCapability, const nix::StorePathSet&, std::map<std::__cxx11::basic_string<char>, nix::InitialOutput>&, nix::DerivationOptions<nix::StorePath>&, nix::PathLocks)'
839 | std::map<std::string, InitialOutput> & initialOutputs,
| ~~~~~~~~~~~~~~~~~~~~~~~~~~~~~~~~~~~~~~~^~~~~~~~~~~~~~
ninja: build stopped: subcommand failed.
|
| failed |
checks.x86_64-linux.nixos-jacquardmachine
|
3m 22s |
nix-store-2.36.0pre:
/build/source/src/libstore/build/derivation-building-goal.cc: In member function 'nix::Goal::Co<std::variant<std::variant<nix::BuildResult: …
nix-store-2.36.0pre:
/build/source/src/libstore/build/derivation-building-goal.cc: In member function 'nix::Goal::Co<std::variant<std::variant<nix::BuildResult::Success, nix::BuildError>, nix::DerivationBuildingGoal::NeedsSlot> > nix::DerivationBuildingGoal::buildLocally(LocalBuildCapability, const nix::StorePathSet&, std::map<std::__cxx11::basic_string<char>, nix::InitialOutput>&, nix::DerivationOptions<nix::StorePath>&, nix::PathLocks)':
/build/source/src/libstore/build/derivation-building-goal.cc:1101:30: error: cannot bind non-const lvalue reference of type 'std::map<std::__cxx11::basic_string<char>, nix::InitialOutput>&' to an rvalue of type 'std::remove_reference<std::map<std::__cxx11::basic_string<char>, nix::InitialOutput>&>::type' {aka 'std::map<std::__cxx11::basic_string<char>, nix::InitialOutput>'}
1101 | std::move(initialOutputs),
| ~~~~~~~~~^~~~~~~~~~~~~~~~
/build/source/src/libstore/build/derivation-building-goal.cc:839:44: note: initializing argument 3 of 'nix::Goal::Co<std::variant<std::variant<nix::BuildResult::Success, nix::BuildError>, nix::DerivationBuildingGoal::NeedsSlot> > nix::DerivationBuildingGoal::buildLocally(LocalBuildCapability, const nix::StorePathSet&, std::map<std::__cxx11::basic_string<char>, nix::InitialOutput>&, nix::DerivationOptions<nix::StorePath>&, nix::PathLocks)'
839 | std::map<std::string, InitialOutput> & initialOutputs,
| ~~~~~~~~~~~~~~~~~~~~~~~~~~~~~~~~~~~~~~~^~~~~~~~~~~~~~
ninja: build stopped: subcommand failed.
|
| failed |
checks.x86_64-linux.nixos-matchbox
|
5m 43s |
nix-store-2.36.0pre:
/build/source/src/libstore/build/derivation-building-goal.cc: In member function 'nix::Goal::Co<std::variant<std::variant<nix::BuildResult: …
nix-store-2.36.0pre:
/build/source/src/libstore/build/derivation-building-goal.cc: In member function 'nix::Goal::Co<std::variant<std::variant<nix::BuildResult::Success, nix::BuildError>, nix::DerivationBuildingGoal::NeedsSlot> > nix::DerivationBuildingGoal::buildLocally(LocalBuildCapability, const nix::StorePathSet&, std::map<std::__cxx11::basic_string<char>, nix::InitialOutput>&, nix::DerivationOptions<nix::StorePath>&, nix::PathLocks)':
/build/source/src/libstore/build/derivation-building-goal.cc:1101:30: error: cannot bind non-const lvalue reference of type 'std::map<std::__cxx11::basic_string<char>, nix::InitialOutput>&' to an rvalue of type 'std::remove_reference<std::map<std::__cxx11::basic_string<char>, nix::InitialOutput>&>::type' {aka 'std::map<std::__cxx11::basic_string<char>, nix::InitialOutput>'}
1101 | std::move(initialOutputs),
| ~~~~~~~~~^~~~~~~~~~~~~~~~
/build/source/src/libstore/build/derivation-building-goal.cc:839:44: note: initializing argument 3 of 'nix::Goal::Co<std::variant<std::variant<nix::BuildResult::Success, nix::BuildError>, nix::DerivationBuildingGoal::NeedsSlot> > nix::DerivationBuildingGoal::buildLocally(LocalBuildCapability, const nix::StorePathSet&, std::map<std::__cxx11::basic_string<char>, nix::InitialOutput>&, nix::DerivationOptions<nix::StorePath>&, nix::PathLocks)'
839 | std::map<std::string, InitialOutput> & initialOutputs,
| ~~~~~~~~~~~~~~~~~~~~~~~~~~~~~~~~~~~~~~~^~~~~~~~~~~~~~
ninja: build stopped: subcommand failed.
|
| failed |
checks.x86_64-linux.nixos-turingmachine
|
6m 21s |
nix-store-2.36.0pre:
/build/source/src/libstore/build/derivation-building-goal.cc: In member function 'nix::Goal::Co<std::variant<std::variant<nix::BuildResult: …
nix-store-2.36.0pre:
/build/source/src/libstore/build/derivation-building-goal.cc: In member function 'nix::Goal::Co<std::variant<std::variant<nix::BuildResult::Success, nix::BuildError>, nix::DerivationBuildingGoal::NeedsSlot> > nix::DerivationBuildingGoal::buildLocally(LocalBuildCapability, const nix::StorePathSet&, std::map<std::__cxx11::basic_string<char>, nix::InitialOutput>&, nix::DerivationOptions<nix::StorePath>&, nix::PathLocks)':
/build/source/src/libstore/build/derivation-building-goal.cc:1101:30: error: cannot bind non-const lvalue reference of type 'std::map<std::__cxx11::basic_string<char>, nix::InitialOutput>&' to an rvalue of type 'std::remove_reference<std::map<std::__cxx11::basic_string<char>, nix::InitialOutput>&>::type' {aka 'std::map<std::__cxx11::basic_string<char>, nix::InitialOutput>'}
1101 | std::move(initialOutputs),
| ~~~~~~~~~^~~~~~~~~~~~~~~~
/build/source/src/libstore/build/derivation-building-goal.cc:839:44: note: initializing argument 3 of 'nix::Goal::Co<std::variant<std::variant<nix::BuildResult::Success, nix::BuildError>, nix::DerivationBuildingGoal::NeedsSlot> > nix::DerivationBuildingGoal::buildLocally(LocalBuildCapability, const nix::StorePathSet&, std::map<std::__cxx11::basic_string<char>, nix::InitialOutput>&, nix::DerivationOptions<nix::StorePath>&, nix::PathLocks)'
839 | std::map<std::string, InitialOutput> & initialOutputs,
| ~~~~~~~~~~~~~~~~~~~~~~~~~~~~~~~~~~~~~~~^~~~~~~~~~~~~~
ninja: build stopped: subcommand failed.
|