nixbot

builds

cancelled checks.aarch64-darwin.home-manager-utm-vm build #811 · raw · eval 11.3 s · 1.5 GiB allocated · ·

1these 34 derivations will be built:2  /nix/store/60cxrp932pjfm9i9gmp33b2r2hp7ali7-nix-store-2.36.0pre.drv3  /nix/store/4jnnfmjyrb8ka0p11106hgq1jqxgvvw6-nix-fetchers-2.36.0pre.drv4  /nix/store/19yza9fy1z51a8i2hsnp34sdy7sp5lh3-nix-expr-2.36.0pre.drv5  /nix/store/rbkyq87kjivk4m9qwlyxzbr1zq6l66ba-nix-store-c-2.36.0pre.drv6  /nix/store/6z4xiqn6xv4f6ik6qsixibxfvhcqjrjv-nix-expr-c-2.36.0pre.drv7  /nix/store/9barg160v8nh66x192s3d87j01gbzvh7-nix-fetchers-c-2.36.0pre.drv8  /nix/store/l32n7d5yywwiwvm2c1acr32sb7i520q2-nix-store-test-support-2.36.0pre.drv9  /nix/store/097l548jh46j2fwx1cdzc6xvlvcakmb0-nix-fetchers-tests-2.36.0pre.drv10  /nix/store/8aalvfc2bdfnssm95ks41zrqlvvagcl1-nix-flake-2.36.0pre.drv11  /nix/store/chdd5xfgbdqrlvqp0fch7058avhpi2qx-nix-main-2.36.0pre.drv12  /nix/store/4i4bl5l8s50v404ca62g97b7inn90k9a-nix-cmd-2.36.0pre.drv13  /nix/store/9r1wb55g8z4p5vdggl12mjz1gzqdd0iz-nix-main-c-2.36.0pre.drv14  /nix/store/a1dyx61vbgiiachx0grnr8534z4pyhac-nix-fetchers-tests-run.drv15  /nix/store/hlaqm6ss2kibvnrakywf97xx2aazfwng-nix-store-tests-2.36.0pre.drv16  /nix/store/a6sy5vkyk9134lp2hxi5f3mfy6h95yy0-nix-store-tests-run.drv17  /nix/store/y7agx3w1vy1grf22nh2ix2xdcyqfgpwg-nix-flake-c-2.36.0pre.drv18  /nix/store/h9yk9pwjndx6hdla9rbhbd1812x417gr-nix-2.36.0pre20261015_25c5d13.drv19  /nix/store/a8kry6ln5ccwfkfcqyyvywa47j6i5nl2-nix-manual-2.36.0pre20261015_25c5d13.drv20  /nix/store/aihfi7mpg0lr4siw30icvvnx65la6vms-nix-functional-tests-2.36.0pre20261015_25c5d13.drv21  /nix/store/4bvcds13d8ly72has7pa4hxv328ihx18-nix-util-test-support-2.36.0pre.drv22  /nix/store/a1jj281j2sjp1iwbygzw37vf3kz9h1bm-nix-flake-tests-2.36.0pre.drv23  /nix/store/bmi4l0rcpr2ahmpmn57w74zcz3dg22nh-nix-flake-tests-run.drv24  /nix/store/szqmh0md1mcfwfm09v2mxcsdd0jkbw13-nix-expr-tests-2.36.0pre.drv25  /nix/store/w60crr8gm1ygyhcbrpkc35a1gcn53qwx-nix-expr-tests-run.drv26  /nix/store/5jqd0zhfn2cfscg043ad5j7z3dikaqcn-nix-2.36.0pre20261015_25c5d13.drv27  /nix/store/ysvgx94p3qx5cibkxvjh14rmdxk6i4lb-tuicr-0.27.0.drv28  /nix/store/0vmfzrs77393ws037k60rxh7w2919g95-home-manager-path.drv29  /nix/store/kqpsipxvc9yavcyv97cfmw35yp3nwhml-home-manager-fonts.drv30  /nix/store/gg71v7px83fjgli0ylkk3z1k6c3bdis6-hm_LibraryFonts.homemanagerfontsversion.drv31  /nix/store/j2053k89ylzrx1hp6j15vpkd3mls3w53-home-manager-applications.drv32  /nix/store/hq9gvhk20q93lhp6njsnp1xdi5v27s4f-home-manager-files.drv33  /nix/store/7n7plqy7kwm533qadwbqcqirqrrn7xxg-hm-putter.json.drv34  /nix/store/w5dsrf1lsfd3w1y6b6kk5c13v9qp3a3s-activation-script.drv35  /nix/store/0ip49ixz5wl95xv0w059zgz1lvfwfadp-home-manager-generation.drv36building '/nix/store/ysvgx94p3qx5cibkxvjh14rmdxk6i4lb-tuicr-0.27.0.drv'37tuicr-0.27.0> tribuchet: building on mac0238tuicr-0.27.0> Using versionCheckHook39tuicr-0.27.0> Running phase: unpackPhase40tuicr-0.27.0> unpacking source archive /nix/store/v5pn269cn1kr1zh9f66lglgda4k2bzh8-source41tuicr-0.27.0> source root is source42tuicr-0.27.0> Executing cargoSetupPostUnpackHook43tuicr-0.27.0> Finished cargoSetupPostUnpackHook44tuicr-0.27.0> Running phase: patchPhase45tuicr-0.27.0> applying patch /nix/store/y3fxdgcz596dly20sysgkz9vi20hdxv2-0001-config-add-initial_focus.patch46tuicr-0.27.0> patching file docs/CONFIG.md47tuicr-0.27.0> Hunk #1 succeeded at 28 with fuzz 1.48tuicr-0.27.0> Hunk #2 FAILED at 87.49tuicr-0.27.0> 1 out of 2 hunks FAILED -- saving rejects to file docs/CONFIG.md.rej50tuicr-0.27.0> patching file src/config/mod.rs51tuicr-0.27.0> Hunk #1 FAILED at 134.52tuicr-0.27.0> Hunk #2 succeeded at 264 with fuzz 2 (offset 56 lines).53tuicr-0.27.0> Hunk #3 FAILED at 454.54tuicr-0.27.0> Hunk #4 succeeded at 1280 (offset 162 lines).55tuicr-0.27.0> 2 out of 4 hunks FAILED -- saving rejects to file src/config/mod.rs.rej56tuicr-0.27.0> patching file src/main.rs57tuicr-0.27.0> Hunk #1 succeeded at 400 (offset 15 lines).58error: Cannot build '/nix/store/ysvgx94p3qx5cibkxvjh14rmdxk6i4lb-tuicr-0.27.0.drv'.59       Reason: builder failed with exit code 1.60       Output paths:61         /nix/store/k5zm1vnii6aqim0ik1sjqjq2q2m7anp9-tuicr-0.27.062       Last 21 log lines:63       > tribuchet: building on mac0264       > Using versionCheckHook65       > Running phase: unpackPhase66       > unpacking source archive /nix/store/v5pn269cn1kr1zh9f66lglgda4k2bzh8-source67       > source root is source68       > Executing cargoSetupPostUnpackHook69       > Finished cargoSetupPostUnpackHook70       > Running phase: patchPhase71       > applying patch /nix/store/y3fxdgcz596dly20sysgkz9vi20hdxv2-0001-config-add-initial_focus.patch72       > patching file docs/CONFIG.md73       > Hunk #1 succeeded at 28 with fuzz 1.74       > Hunk #2 FAILED at 87.75       > 1 out of 2 hunks FAILED -- saving rejects to file docs/CONFIG.md.rej76       > patching file src/config/mod.rs77       > Hunk #1 FAILED at 134.78       > Hunk #2 succeeded at 264 with fuzz 2 (offset 56 lines).79       > Hunk #3 FAILED at 454.80       > Hunk #4 succeeded at 1280 (offset 162 lines).81       > 2 out of 4 hunks FAILED -- saving rejects to file src/config/mod.rs.rej82       > patching file src/main.rs83       > Hunk #1 succeeded at 400 (offset 15 lines).84       For full logs, run:85         nix log /nix/store/ysvgx94p3qx5cibkxvjh14rmdxk6i4lb-tuicr-0.27.0.drv