nixbot

builds

cancelled checks.aarch64-linux.home-manager-utm-vm build #811 · raw · eval 10.4 s · 1.3 GiB allocated · ·

1these 29 derivations will be built:2  /nix/store/6zck699zpvjg80j0hks4k43kkggvw73g-nix-store-2.36.0pre.drv3  /nix/store/z8g9gaf42p3vqgikxf63kmbdwi8nqx10-nix-fetchers-2.36.0pre.drv4  /nix/store/6pzqvb1lc27gwm4l9mzyvzf8y4mpklk1-nix-expr-2.36.0pre.drv5  /nix/store/rq8b20ds59v876xs31w504bk8rd9cnb5-nix-store-c-2.36.0pre.drv6  /nix/store/9wzsxsrn230w79p6v6bacdnrq5fn4wci-nix-expr-c-2.36.0pre.drv7  /nix/store/5bim3czlmna9ml5n8fdzak9l4pmjlj1a-nix-store-test-support-2.36.0pre.drv8  /nix/store/njy9ybnvh33im6jnbiaili12llbzfa82-nix-util-test-support-2.36.0pre.drv9  /nix/store/41m0c0k4jclx3zkc3rk65p3g9krlc9qv-nix-expr-tests-2.36.0pre.drv10  /nix/store/2l2xhv45chvw60hfd91afdy8n8fhj077-nix-expr-tests-run.drv11  /nix/store/a2b3gjpvhx6q82r7ghx646fqcczq00rj-nix-fetchers-c-2.36.0pre.drv12  /nix/store/d3v60ckmwqxblb2sddgnv8nrs78di84n-nix-fetchers-tests-2.36.0pre.drv13  /nix/store/3bmr9vk4pvkf8vrj9vq0q2crfsl75zhm-nix-fetchers-tests-run.drv14  /nix/store/mvn37dq1gnq4qb286drjcyzfkh8a5vk4-nix-flake-2.36.0pre.drv15  /nix/store/y4ld34q934smwiz3z5j34cpcqq51pq8m-nix-main-2.36.0pre.drv16  /nix/store/41qw9pqmbx1bw82vki7spajmyvkqamxx-nix-cmd-2.36.0pre.drv17  /nix/store/qfsifpkgjv7xn8h0zfsmh2l33h0a4fnf-nix-store-tests-2.36.0pre.drv18  /nix/store/6jiqfisdvldyrn87p38mfzf6ypbag46i-nix-store-tests-run.drv19  /nix/store/v54axch19kag65w6qy9xq3kc50wqich7-nix-flake-c-2.36.0pre.drv20  /nix/store/wyh1whsd6w89z8b4iqbbvl47ax4y7iwx-nix-main-c-2.36.0pre.drv21  /nix/store/7d3chry5n6x3ambcqdbpl92h5jh6fxna-nix-2.36.0pre20261015_25c5d13.drv22  /nix/store/b7mbr0cliqw58q00ycnn9v1xrxrqia91-nix-manual-2.36.0pre20261015_25c5d13.drv23  /nix/store/jm8nvric4dqydizg9h9yz9v75jip8zmi-nix-functional-tests-2.36.0pre20261015_25c5d13.drv24  /nix/store/c6z2bad51dbmbcvhs9vasg1nhp0wjm25-nix-flake-tests-2.36.0pre.drv25  /nix/store/w1gy29s6jp75ql7xq92c4cwspwlz9fw9-nix-flake-tests-run.drv26  /nix/store/15lvfplic9sa06zanzmy0i198cl9kyx7-nix-2.36.0pre20261015_25c5d13.drv27  /nix/store/xl9adzf8fn0snkvhicnzap5id600b143-tuicr-0.27.0.drv28  /nix/store/f11mf3cjlry023wvpkj2s105v7bkxalz-home-manager-path.drv29  /nix/store/0n3hgirr9668gnq4vz4pg7dd8z5c9w59-activation-script.drv30  /nix/store/6c6dgszmj96lnv5jgs821y8b536spsp8-home-manager-generation.drv31building '/nix/store/xl9adzf8fn0snkvhicnzap5id600b143-tuicr-0.27.0.drv'32tuicr-0.27.0> tribuchet: building on eliza33tuicr-0.27.0> Using versionCheckHook34tuicr-0.27.0> Running phase: unpackPhase35tuicr-0.27.0> unpacking source archive /nix/store/v5pn269cn1kr1zh9f66lglgda4k2bzh8-source36tuicr-0.27.0> source root is source37tuicr-0.27.0> Executing cargoSetupPostUnpackHook38tuicr-0.27.0> Finished cargoSetupPostUnpackHook39tuicr-0.27.0> Running phase: patchPhase40tuicr-0.27.0> applying patch /nix/store/y3fxdgcz596dly20sysgkz9vi20hdxv2-0001-config-add-initial_focus.patch41tuicr-0.27.0> patching file docs/CONFIG.md42tuicr-0.27.0> Hunk #1 succeeded at 28 with fuzz 1.43tuicr-0.27.0> Hunk #2 FAILED at 87.44tuicr-0.27.0> 1 out of 2 hunks FAILED -- saving rejects to file docs/CONFIG.md.rej45tuicr-0.27.0> patching file src/config/mod.rs46tuicr-0.27.0> Hunk #1 FAILED at 134.47tuicr-0.27.0> Hunk #2 succeeded at 264 with fuzz 2 (offset 56 lines).48tuicr-0.27.0> Hunk #3 FAILED at 454.49tuicr-0.27.0> Hunk #4 succeeded at 1280 (offset 162 lines).50tuicr-0.27.0> 2 out of 4 hunks FAILED -- saving rejects to file src/config/mod.rs.rej51tuicr-0.27.0> patching file src/main.rs52tuicr-0.27.0> Hunk #1 succeeded at 400 (offset 15 lines).