nixbot

builds

Mic92/dotfiles build #829 failed

branch main · PR #6032 · commit 6fd682ecad · · took 22m 46s · eval 3m 18s

eval warnings 4 kinds · 8 occurrences
  • error ×3
  • error Refusing to evaluate package 'pinchflat-2025.9.26' in /nix/store/…-source/pkgs/by-name/pi/pinchflat/package.nix:85 because it is marked as insecure ×1
  • warn The option `services.avahi.publish.enable` is obsolete. Use ×2
  • warn The option `services.avahi.publish.userServices` is obsolete. Use ×2

30 failed ⚠ 2
failed attributes
status attribute duration
failed checks.x86_64-linux.nixos-bernie
  • The option `services.avahi.publish.enable` is obsolete. Use `services.avahi.settings.publish."disable-publishing" = false;` instead.
  • The option `services.avahi.publish.userServices` is obsolete. Use `services.avahi.settings.publish.disable-user-service-publishing = false;` and `services.avahi.settings.publish.publish-addresses = true;` instead.
11m 49s
python3.14-pyopenjtalk-plus-0.4.1-post9: E AssertionError: Regex pattern did not match. E Expected regex: 'must be str' E Actual message: …
python3.14-pyopenjtalk-plus-0.4.1-post9:
E       AssertionError: Regex pattern did not match.
E         Expected regex: 'must be str'
E         Actual message: 'Expected str, got int'
tests/test_frontend.py:775: AssertionError
=========================== short test summary info ============================
FAILED tests/test_frontend.py::test_run_njd_from_mecab_invalid_input_should_not_break_next_call
================= 1 failed, 1678 passed, 16 skipped in 14.38s ==================
done!

zfstools-0.1.0:
264 _callImplicitHook /nix/store/an9g93vg5b02j74y38zfajswa0f10p2z-stdenv-linux/setup
281 _eval /nix/store/an9g93vg5b02j74y38zfajswa0f10p2z-stdenv-linux/setup
220 runHook /nix/store/an9g93vg5b02j74y38zfajswa0f10p2z-stdenv-linux/setup
1666 fixupPhase /nix/store/an9g93vg5b02j74y38zfajswa0f10p2z-stdenv-linux/setup
1771 runPhase /nix/store/an9g93vg5b02j74y38zfajswa0f10p2z-stdenv-linux/setup
1826 genericBuild /nix/store/an9g93vg5b02j74y38zfajswa0f10p2z-stdenv-linux/setup
1 source /nix/store/shkw4qm9qcw5sc5n1k5jznc83ny02r39-default-builder.sh
3 main /nix/store/l622p70vy8k5sh7y5wizi5f2mic6ynpg-source-stdenv.sh

linux-7.2.11-modules:
tribuchet: building on jamie
structuredAttrs is enabled
created 346 symlinks in user environment
structuredAttrs is enabled
kernel version is 7.2.11
cat: updates/scap.ko.cer: No such file or directory
failed checks.x86_64-linux.nixos-matchbox
  • The option `services.avahi.publish.enable` is obsolete. Use `services.avahi.settings.publish."disable-publishing" = false;` instead.
  • The option `services.avahi.publish.userServices` is obsolete. Use `services.avahi.settings.publish.disable-user-service-publishing = false;` and `services.avahi.settings.publish.publish-addresses = true;` instead.
11m 43s
zfstools-0.1.0: 264 _callImplicitHook /nix/store/an9g93vg5b02j74y38zfajswa0f10p2z-stdenv-linux/setup 281 _eval /nix/store/an9g93vg5b02j74y38zfajswa0f10p2z-stden …
zfstools-0.1.0:
264 _callImplicitHook /nix/store/an9g93vg5b02j74y38zfajswa0f10p2z-stdenv-linux/setup
281 _eval /nix/store/an9g93vg5b02j74y38zfajswa0f10p2z-stdenv-linux/setup
220 runHook /nix/store/an9g93vg5b02j74y38zfajswa0f10p2z-stdenv-linux/setup
1666 fixupPhase /nix/store/an9g93vg5b02j74y38zfajswa0f10p2z-stdenv-linux/setup
1771 runPhase /nix/store/an9g93vg5b02j74y38zfajswa0f10p2z-stdenv-linux/setup
1826 genericBuild /nix/store/an9g93vg5b02j74y38zfajswa0f10p2z-stdenv-linux/setup
1 source /nix/store/shkw4qm9qcw5sc5n1k5jznc83ny02r39-default-builder.sh
3 main /nix/store/l622p70vy8k5sh7y5wizi5f2mic6ynpg-source-stdenv.sh
failed checks.aarch64-darwin.devShell-default 3m 30s
clan-cli: 272 _callImplicitHook /nix/store/4gqzn5ia76rp74p8fb6nvry3arbn3l7j-stdenv-darwin/setup 289 _eval /nix/store/4gqzn5ia76rp74p8fb6nvry3arbn3l7j-stdenv-dar …
clan-cli:
272 _callImplicitHook /nix/store/4gqzn5ia76rp74p8fb6nvry3arbn3l7j-stdenv-darwin/setup
289 _eval /nix/store/4gqzn5ia76rp74p8fb6nvry3arbn3l7j-stdenv-darwin/setup
228 runHook /nix/store/4gqzn5ia76rp74p8fb6nvry3arbn3l7j-stdenv-darwin/setup
1674 fixupPhase /nix/store/4gqzn5ia76rp74p8fb6nvry3arbn3l7j-stdenv-darwin/setup
1779 runPhase /nix/store/4gqzn5ia76rp74p8fb6nvry3arbn3l7j-stdenv-darwin/setup
1834 genericBuild /nix/store/4gqzn5ia76rp74p8fb6nvry3arbn3l7j-stdenv-darwin/setup
1 source /nix/store/shkw4qm9qcw5sc5n1k5jznc83ny02r39-default-builder.sh
3 main /nix/store/l622p70vy8k5sh7y5wizi5f2mic6ynpg-source-stdenv.sh
dependency failed checks.aarch64-darwin.home-manager-macos —
dependency failed checks.aarch64-darwin.home-manager-utm-vm —
failed checks.aarch64-darwin.package-email-sync 2m 6s
afew-4.0.2: 272 _callImplicitHook /nix/store/4gqzn5ia76rp74p8fb6nvry3arbn3l7j-stdenv-darwin/setup 289 _eval /nix/store/4gqzn5ia76rp74p8fb6nvry3arbn3l7j-stdenv-d …
afew-4.0.2:
272 _callImplicitHook /nix/store/4gqzn5ia76rp74p8fb6nvry3arbn3l7j-stdenv-darwin/setup
289 _eval /nix/store/4gqzn5ia76rp74p8fb6nvry3arbn3l7j-stdenv-darwin/setup
228 runHook /nix/store/4gqzn5ia76rp74p8fb6nvry3arbn3l7j-stdenv-darwin/setup
1674 fixupPhase /nix/store/4gqzn5ia76rp74p8fb6nvry3arbn3l7j-stdenv-darwin/setup
1779 runPhase /nix/store/4gqzn5ia76rp74p8fb6nvry3arbn3l7j-stdenv-darwin/setup
1834 genericBuild /nix/store/4gqzn5ia76rp74p8fb6nvry3arbn3l7j-stdenv-darwin/setup
1 source /nix/store/shkw4qm9qcw5sc5n1k5jznc83ny02r39-default-builder.sh
3 main /nix/store/l622p70vy8k5sh7y5wizi5f2mic6ynpg-source-stdenv.sh
dependency failed checks.aarch64-darwin.package-pim —
failed checks.aarch64-linux.devShell-default 41s
clan-cli: 264 _callImplicitHook /nix/store/49cnv1lz3hiybz55z8lm8i401iqrpqyw-stdenv-linux/setup 281 _eval /nix/store/49cnv1lz3hiybz55z8lm8i401iqrpqyw-stdenv-linu …
clan-cli:
264 _callImplicitHook /nix/store/49cnv1lz3hiybz55z8lm8i401iqrpqyw-stdenv-linux/setup
281 _eval /nix/store/49cnv1lz3hiybz55z8lm8i401iqrpqyw-stdenv-linux/setup
220 runHook /nix/store/49cnv1lz3hiybz55z8lm8i401iqrpqyw-stdenv-linux/setup
1666 fixupPhase /nix/store/49cnv1lz3hiybz55z8lm8i401iqrpqyw-stdenv-linux/setup
1771 runPhase /nix/store/49cnv1lz3hiybz55z8lm8i401iqrpqyw-stdenv-linux/setup
1826 genericBuild /nix/store/49cnv1lz3hiybz55z8lm8i401iqrpqyw-stdenv-linux/setup
1 source /nix/store/shkw4qm9qcw5sc5n1k5jznc83ny02r39-default-builder.sh
3 main /nix/store/l622p70vy8k5sh7y5wizi5f2mic6ynpg-source-stdenv.sh
dependency failed checks.aarch64-linux.home-manager-common —
dependency failed checks.aarch64-linux.home-manager-utm-vm —
failed eval checks.aarch64-linux.nixos-blob64 —
error: … while evaluating a branch condition at «string»:25:5: 24| v: 25| if !builtins.isAttrs v || isDrv v then …
error:
       … while evaluating a branch condition
         at «string»:25:5:
           24|     v:
           25|     if !builtins.isAttrs v || isDrv v then
             |     ^
           26|       v

       … in the left operand of the OR (||) operator
         at «string»:25:28:
           24|     v:
           25|     if !builtins.isAttrs v || isDrv v then
             |                            ^
           26|       v

       … while evaluating the option `system.build.toplevel':

       … while evaluating definitions from `/nix/store/8ak04fk7vigs495sxhxshyf7b9mlcmgb-source/nixos/modules/system/activation/top-level.nix':

       … while evaluating the option `warnings':

       … while evaluating definitions from `/nix/store/8ak04fk7vigs495sxhxshyf7b9mlcmgb-source/nixos/modules/system/boot/systemd.nix':

       … while evaluating the option `systemd.services.pinchflat.serviceConfig':

       … while evaluating definitions from `/nix/store/8ak04fk7vigs495sxhxshyf7b9mlcmgb-source/nixos/modules/services/misc/pinchflat.nix':

       (stack trace truncated; use '--show-trace' to show the full, detailed trace)

       error: Refusing to evaluate package 'pinchflat-2025.9.26' in /nix/store/8ak04fk7vigs495sxhxshyf7b9mlcmgb-source/pkgs/by-name/pi/pinchflat/package.nix:85 because it is marked as insecure

       Known issues:
        - multiple CVEs in dependencies. consider `pinchflat-ngx` fork as an alternative

       You can install it anyway by allowing this package, using the
       following methods:

       a) To temporarily allow all insecure packages, you can use an environment
          variable for a single invocation of the nix tools:

            $ export NIXPKGS_ALLOW_INSECURE=1

          Note: When using `nix shell`, `nix build`, `nix develop`, etc with a flake,
                then pass `--impure` in order to allow use of environment variables.

       b) for `nixos-rebuild` you can add ‘pinchflat-2025.9.26’ to
          `nixpkgs.config.permittedInsecurePackages` in the configuration.nix,
          like so:

            {
              nixpkgs.config.permittedInsecurePackages = [
                "pinchflat-2025.9.26"
              ];
            }

       c) For `nix-env`, `nix-build`, `nix-shell` or any other Nix command you can add
          ‘pinchflat-2025.9.26’ to `permittedInsecurePackages` in
          ~/.config/nixpkgs/config.nix, like so:

            {
              permittedInsecurePackages = [
                "pinchflat-2025.9.26"
              ];
            }
failed checks.aarch64-linux.package-email-sync 5m 53s
afew-4.0.2: 264 _callImplicitHook /nix/store/49cnv1lz3hiybz55z8lm8i401iqrpqyw-stdenv-linux/setup 281 _eval /nix/store/49cnv1lz3hiybz55z8lm8i401iqrpqyw-stdenv-li …
afew-4.0.2:
264 _callImplicitHook /nix/store/49cnv1lz3hiybz55z8lm8i401iqrpqyw-stdenv-linux/setup
281 _eval /nix/store/49cnv1lz3hiybz55z8lm8i401iqrpqyw-stdenv-linux/setup
220 runHook /nix/store/49cnv1lz3hiybz55z8lm8i401iqrpqyw-stdenv-linux/setup
1666 fixupPhase /nix/store/49cnv1lz3hiybz55z8lm8i401iqrpqyw-stdenv-linux/setup
1771 runPhase /nix/store/49cnv1lz3hiybz55z8lm8i401iqrpqyw-stdenv-linux/setup
1826 genericBuild /nix/store/49cnv1lz3hiybz55z8lm8i401iqrpqyw-stdenv-linux/setup
1 source /nix/store/shkw4qm9qcw5sc5n1k5jznc83ny02r39-default-builder.sh
3 main /nix/store/l622p70vy8k5sh7y5wizi5f2mic6ynpg-source-stdenv.sh
failed checks.aarch64-linux.package-merge-when-green 42s
flake-fmt-1.0.0: | ^^^^^^^^^^^^^^^^^^^^^^^^^^^^^^^^^^^^^^^^^^^^^^^^^^^^^^^^^^^^^^^^^^^^^^^^^^^^^^^^^^^^^^ | = note: expected `unsafe extern "C" …
flake-fmt-1.0.0:
    |     ^^^^^^^^^^^^^^^^^^^^^^^^^^^^^^^^^^^^^^^^^^^^^^^^^^^^^^^^^^^^^^^^^^^^^^^^^^^^^^^^^^^^^^
    |
    = note: expected `unsafe extern "C" fn(*const u8, i32, ...) -> i32` (for the current target)
            found    `unsafe extern "C" fn(*const u8, i32, i32) -> i32`
    = help: either fix the signature or remove any attributes like `#[unsafe(no_mangle)]`, `#[unsafe(export_name = "open")]`, or `#[link_name = "open"]`
    = note: `#[deny(invalid_runtime_symbol_definitions)]` on by default
error: could not compile `flake-fmt-trace` (lib) due to 1 previous error
warning: build failed, waiting for other jobs to finish...
dependency failed checks.aarch64-linux.package-pim —
failed checks.x86_64-linux.devShell-default 49s
clan-cli: 264 _callImplicitHook /nix/store/an9g93vg5b02j74y38zfajswa0f10p2z-stdenv-linux/setup 281 _eval /nix/store/an9g93vg5b02j74y38zfajswa0f10p2z-stdenv-linu …
clan-cli:
264 _callImplicitHook /nix/store/an9g93vg5b02j74y38zfajswa0f10p2z-stdenv-linux/setup
281 _eval /nix/store/an9g93vg5b02j74y38zfajswa0f10p2z-stdenv-linux/setup
220 runHook /nix/store/an9g93vg5b02j74y38zfajswa0f10p2z-stdenv-linux/setup
1666 fixupPhase /nix/store/an9g93vg5b02j74y38zfajswa0f10p2z-stdenv-linux/setup
1771 runPhase /nix/store/an9g93vg5b02j74y38zfajswa0f10p2z-stdenv-linux/setup
1826 genericBuild /nix/store/an9g93vg5b02j74y38zfajswa0f10p2z-stdenv-linux/setup
1 source /nix/store/shkw4qm9qcw5sc5n1k5jznc83ny02r39-default-builder.sh
3 main /nix/store/l622p70vy8k5sh7y5wizi5f2mic6ynpg-source-stdenv.sh
failed checks.x86_64-linux.home-manager-bernie 13m 25s
flake-fmt-1.0.0: | ^^^^^^^^^^^^^^^^^^^^^^^^^^^^^^^^^^^^^^^^^^^^^^^^^^^^^^^^^^^^^^^^^^^^^^^^^^^^^^^^^^^^^^ | = note: expected `unsafe extern "C" …
flake-fmt-1.0.0:
    |     ^^^^^^^^^^^^^^^^^^^^^^^^^^^^^^^^^^^^^^^^^^^^^^^^^^^^^^^^^^^^^^^^^^^^^^^^^^^^^^^^^^^^^^
    |
    = note: expected `unsafe extern "C" fn(*const i8, i32, ...) -> i32` (for the current target)
            found    `unsafe extern "C" fn(*const i8, i32, i32) -> i32`
    = help: either fix the signature or remove any attributes like `#[unsafe(no_mangle)]`, `#[unsafe(export_name = "open")]`, or `#[link_name = "open"]`
    = note: `#[deny(invalid_runtime_symbol_definitions)]` on by default
error: could not compile `flake-fmt-trace` (lib) due to 1 previous error
warning: build failed, waiting for other jobs to finish...
failed checks.x86_64-linux.home-manager-coder 13m 23s
todoman-4.7.0: copying static files: done copying extra files... copying extra files: done dumping object inventory... done build succeeded, 2 warnings. The HT …
todoman-4.7.0:
copying static files: done
copying extra files... 
copying extra files: done
dumping object inventory... done
build succeeded, 2 warnings.
The HTML page is in .sphinx/singlehtml/singlehtml.
Executing installSphinxPhase
rm: cannot remove '.sphinx/man/man/_static/jquery.js': No such file or directory

flake-fmt-1.0.0:
    |     ^^^^^^^^^^^^^^^^^^^^^^^^^^^^^^^^^^^^^^^^^^^^^^^^^^^^^^^^^^^^^^^^^^^^^^^^^^^^^^^^^^^^^^
    |
    = note: expected `unsafe extern "C" fn(*const i8, i32, ...) -> i32` (for the current target)
            found    `unsafe extern "C" fn(*const i8, i32, i32) -> i32`
    = help: either fix the signature or remove any attributes like `#[unsafe(no_mangle)]`, `#[unsafe(export_name = "open")]`, or `#[link_name = "open"]`
    = note: `#[deny(invalid_runtime_symbol_definitions)]` on by default
error: could not compile `flake-fmt-trace` (lib) due to 1 previous error
warning: build failed, waiting for other jobs to finish...

herdr-0.9.5:
          @compileError(std.fmt.comptimePrint(
          ^~~~~~~~~~~~~
  build.zig:16:24: note: called at comptime here
      buildpkg.requireZig(minimum_zig_version);
      ~~~~~~~~~~~~~~~~~~~^~~~~~~~~~~~~~~~~~~~~
  thread 'main' (1899) panicked at crates/ghostty-vt/build.rs:112:5:
  zig build for vendored libghostty-vt failed: exit status: 1. Building Herdr requires Zig 0.16.0; check `zig version` or set ZIG to the path of a Zig 0.16.0 binary, then retry
  note: run with `RUST_BACKTRACE=1` environment variable to display a backtrace

… and 3 more failed derivations
failed checks.x86_64-linux.home-manager-common 13m 15s
flake-fmt-1.0.0: | ^^^^^^^^^^^^^^^^^^^^^^^^^^^^^^^^^^^^^^^^^^^^^^^^^^^^^^^^^^^^^^^^^^^^^^^^^^^^^^^^^^^^^^ | = note: expected `unsafe extern "C" …
flake-fmt-1.0.0:
    |     ^^^^^^^^^^^^^^^^^^^^^^^^^^^^^^^^^^^^^^^^^^^^^^^^^^^^^^^^^^^^^^^^^^^^^^^^^^^^^^^^^^^^^^
    |
    = note: expected `unsafe extern "C" fn(*const i8, i32, ...) -> i32` (for the current target)
            found    `unsafe extern "C" fn(*const i8, i32, i32) -> i32`
    = help: either fix the signature or remove any attributes like `#[unsafe(no_mangle)]`, `#[unsafe(export_name = "open")]`, or `#[link_name = "open"]`
    = note: `#[deny(invalid_runtime_symbol_definitions)]` on by default
error: could not compile `flake-fmt-trace` (lib) due to 1 previous error
warning: build failed, waiting for other jobs to finish...
failed checks.x86_64-linux.home-manager-desktop 13m 20s
todoman-4.7.0: copying static files: done copying extra files... copying extra files: done dumping object inventory... done build succeeded, 2 warnings. The HT …
todoman-4.7.0:
copying static files: done
copying extra files... 
copying extra files: done
dumping object inventory... done
build succeeded, 2 warnings.
The HTML page is in .sphinx/singlehtml/singlehtml.
Executing installSphinxPhase
rm: cannot remove '.sphinx/man/man/_static/jquery.js': No such file or directory

radicle-node-1.10.3:
1792585599 control            control: Shutdown requested..
1792585599 service            reactor: Shutdown
1792585599 runtime               pool: Worker pool shutting down..
1792585599 runtime               node: Node shutdown completed for z6MknSLrJoTcukLrE435hVNQT4JUhbvWLX4kUzqkEStBU8Vi
failures:
    commands::id::rad_id_threshold
test result: FAILED. 120 passed; 1 failed; 3 ignored; 0 measured; 2 filtered out; finished in 119.83s
error: test failed, to rerun pass `-p radicle-cli --test commands`

flake-fmt-1.0.0:
    |     ^^^^^^^^^^^^^^^^^^^^^^^^^^^^^^^^^^^^^^^^^^^^^^^^^^^^^^^^^^^^^^^^^^^^^^^^^^^^^^^^^^^^^^
    |
    = note: expected `unsafe extern "C" fn(*const i8, i32, ...) -> i32` (for the current target)
            found    `unsafe extern "C" fn(*const i8, i32, i32) -> i32`
    = help: either fix the signature or remove any attributes like `#[unsafe(no_mangle)]`, `#[unsafe(export_name = "open")]`, or `#[link_name = "open"]`
    = note: `#[deny(invalid_runtime_symbol_definitions)]` on by default
error: could not compile `flake-fmt-trace` (lib) due to 1 previous error
warning: build failed, waiting for other jobs to finish...

… and 5 more failed derivations
failed checks.x86_64-linux.home-manager-eve 13m 5s
python3.14-nixbot-cli: 264 _callImplicitHook /nix/store/an9g93vg5b02j74y38zfajswa0f10p2z-stdenv-linux/setup 281 _eval /nix/store/an9g93vg5b02j74y38zfajswa0f10p2 …
python3.14-nixbot-cli:
264 _callImplicitHook /nix/store/an9g93vg5b02j74y38zfajswa0f10p2z-stdenv-linux/setup
281 _eval /nix/store/an9g93vg5b02j74y38zfajswa0f10p2z-stdenv-linux/setup
220 runHook /nix/store/an9g93vg5b02j74y38zfajswa0f10p2z-stdenv-linux/setup
1666 fixupPhase /nix/store/an9g93vg5b02j74y38zfajswa0f10p2z-stdenv-linux/setup
1771 runPhase /nix/store/an9g93vg5b02j74y38zfajswa0f10p2z-stdenv-linux/setup
1826 genericBuild /nix/store/an9g93vg5b02j74y38zfajswa0f10p2z-stdenv-linux/setup
1 source /nix/store/shkw4qm9qcw5sc5n1k5jznc83ny02r39-default-builder.sh
3 main /nix/store/l622p70vy8k5sh7y5wizi5f2mic6ynpg-source-stdenv.sh

calendar-cli-1.0.0:
264 _callImplicitHook /nix/store/an9g93vg5b02j74y38zfajswa0f10p2z-stdenv-linux/setup
281 _eval /nix/store/an9g93vg5b02j74y38zfajswa0f10p2z-stdenv-linux/setup
220 runHook /nix/store/an9g93vg5b02j74y38zfajswa0f10p2z-stdenv-linux/setup
1666 fixupPhase /nix/store/an9g93vg5b02j74y38zfajswa0f10p2z-stdenv-linux/setup
1771 runPhase /nix/store/an9g93vg5b02j74y38zfajswa0f10p2z-stdenv-linux/setup
1826 genericBuild /nix/store/an9g93vg5b02j74y38zfajswa0f10p2z-stdenv-linux/setup
1 source /nix/store/shkw4qm9qcw5sc5n1k5jznc83ny02r39-default-builder.sh
3 main /nix/store/l622p70vy8k5sh7y5wizi5f2mic6ynpg-source-stdenv.sh

flake-fmt-1.0.0:
    |     ^^^^^^^^^^^^^^^^^^^^^^^^^^^^^^^^^^^^^^^^^^^^^^^^^^^^^^^^^^^^^^^^^^^^^^^^^^^^^^^^^^^^^^
    |
    = note: expected `unsafe extern "C" fn(*const i8, i32, ...) -> i32` (for the current target)
            found    `unsafe extern "C" fn(*const i8, i32, i32) -> i32`
    = help: either fix the signature or remove any attributes like `#[unsafe(no_mangle)]`, `#[unsafe(export_name = "open")]`, or `#[link_name = "open"]`
    = note: `#[deny(invalid_runtime_symbol_definitions)]` on by default
error: could not compile `flake-fmt-trace` (lib) due to 1 previous error
warning: build failed, waiting for other jobs to finish...

… and 3 more failed derivations
failed checks.x86_64-linux.home-manager-mic92 12m 56s
flake-fmt-1.0.0: | ^^^^^^^^^^^^^^^^^^^^^^^^^^^^^^^^^^^^^^^^^^^^^^^^^^^^^^^^^^^^^^^^^^^^^^^^^^^^^^^^^^^^^^ | = note: expected `unsafe extern "C" …
flake-fmt-1.0.0:
    |     ^^^^^^^^^^^^^^^^^^^^^^^^^^^^^^^^^^^^^^^^^^^^^^^^^^^^^^^^^^^^^^^^^^^^^^^^^^^^^^^^^^^^^^
    |
    = note: expected `unsafe extern "C" fn(*const i8, i32, ...) -> i32` (for the current target)
            found    `unsafe extern "C" fn(*const i8, i32, i32) -> i32`
    = help: either fix the signature or remove any attributes like `#[unsafe(no_mangle)]`, `#[unsafe(export_name = "open")]`, or `#[link_name = "open"]`
    = note: `#[deny(invalid_runtime_symbol_definitions)]` on by default
error: could not compile `flake-fmt-trace` (lib) due to 1 previous error
warning: build failed, waiting for other jobs to finish...
failed checks.x86_64-linux.home-manager-utm-vm 12m 49s
todoman-4.7.0: copying static files: done copying extra files... copying extra files: done dumping object inventory... done build succeeded, 2 warnings. The HT …
todoman-4.7.0:
copying static files: done
copying extra files... 
copying extra files: done
dumping object inventory... done
build succeeded, 2 warnings.
The HTML page is in .sphinx/singlehtml/singlehtml.
Executing installSphinxPhase
rm: cannot remove '.sphinx/man/man/_static/jquery.js': No such file or directory

flake-fmt-1.0.0:
    |     ^^^^^^^^^^^^^^^^^^^^^^^^^^^^^^^^^^^^^^^^^^^^^^^^^^^^^^^^^^^^^^^^^^^^^^^^^^^^^^^^^^^^^^
    |
    = note: expected `unsafe extern "C" fn(*const i8, i32, ...) -> i32` (for the current target)
            found    `unsafe extern "C" fn(*const i8, i32, i32) -> i32`
    = help: either fix the signature or remove any attributes like `#[unsafe(no_mangle)]`, `#[unsafe(export_name = "open")]`, or `#[link_name = "open"]`
    = note: `#[deny(invalid_runtime_symbol_definitions)]` on by default
error: could not compile `flake-fmt-trace` (lib) due to 1 previous error
warning: build failed, waiting for other jobs to finish...

herdr-0.9.5:
          @compileError(std.fmt.comptimePrint(
          ^~~~~~~~~~~~~
  build.zig:16:24: note: called at comptime here
      buildpkg.requireZig(minimum_zig_version);
      ~~~~~~~~~~~~~~~~~~~^~~~~~~~~~~~~~~~~~~~~
  thread 'main' (1858) panicked at crates/ghostty-vt/build.rs:112:5:
  zig build for vendored libghostty-vt failed: exit status: 1. Building Herdr requires Zig 0.16.0; check `zig version` or set ZIG to the path of a Zig 0.16.0 binary, then retry
  note: run with `RUST_BACKTRACE=1` environment variable to display a backtrace

… and 3 more failed derivations
failed checks.x86_64-linux.nixos-dorits-laptop 11m 49s
zfstools-0.1.0: 264 _callImplicitHook /nix/store/an9g93vg5b02j74y38zfajswa0f10p2z-stdenv-linux/setup 281 _eval /nix/store/an9g93vg5b02j74y38zfajswa0f10p2z-stden …
zfstools-0.1.0:
264 _callImplicitHook /nix/store/an9g93vg5b02j74y38zfajswa0f10p2z-stdenv-linux/setup
281 _eval /nix/store/an9g93vg5b02j74y38zfajswa0f10p2z-stdenv-linux/setup
220 runHook /nix/store/an9g93vg5b02j74y38zfajswa0f10p2z-stdenv-linux/setup
1666 fixupPhase /nix/store/an9g93vg5b02j74y38zfajswa0f10p2z-stdenv-linux/setup
1771 runPhase /nix/store/an9g93vg5b02j74y38zfajswa0f10p2z-stdenv-linux/setup
1826 genericBuild /nix/store/an9g93vg5b02j74y38zfajswa0f10p2z-stdenv-linux/setup
1 source /nix/store/shkw4qm9qcw5sc5n1k5jznc83ny02r39-default-builder.sh
3 main /nix/store/l622p70vy8k5sh7y5wizi5f2mic6ynpg-source-stdenv.sh

linux-7.2.11-modules:
tribuchet: building on jamie
structuredAttrs is enabled
created 350 symlinks in user environment
structuredAttrs is enabled
kernel version is 7.2.11
cat: updates/scap.ko.cer: No such file or directory
cat: extra/framework_laptop.ko.cer: No such file or directory
failed checks.x86_64-linux.nixos-eva 19m 39s
zfstools-0.1.0: 264 _callImplicitHook /nix/store/49cnv1lz3hiybz55z8lm8i401iqrpqyw-stdenv-linux/setup 281 _eval /nix/store/49cnv1lz3hiybz55z8lm8i401iqrpqyw-stden …
zfstools-0.1.0:
264 _callImplicitHook /nix/store/49cnv1lz3hiybz55z8lm8i401iqrpqyw-stdenv-linux/setup
281 _eval /nix/store/49cnv1lz3hiybz55z8lm8i401iqrpqyw-stdenv-linux/setup
220 runHook /nix/store/49cnv1lz3hiybz55z8lm8i401iqrpqyw-stdenv-linux/setup
1666 fixupPhase /nix/store/49cnv1lz3hiybz55z8lm8i401iqrpqyw-stdenv-linux/setup
1771 runPhase /nix/store/49cnv1lz3hiybz55z8lm8i401iqrpqyw-stdenv-linux/setup
1826 genericBuild /nix/store/49cnv1lz3hiybz55z8lm8i401iqrpqyw-stdenv-linux/setup
1 source /nix/store/shkw4qm9qcw5sc5n1k5jznc83ny02r39-default-builder.sh
3 main /nix/store/l622p70vy8k5sh7y5wizi5f2mic6ynpg-source-stdenv.sh
failed eval checks.x86_64-linux.nixos-eve —
error: … while evaluating a branch condition at «string»:25:5: 24| v: 25| if !builtins.isAttrs v || isDrv v then …
error:
       … while evaluating a branch condition
         at «string»:25:5:
           24|     v:
           25|     if !builtins.isAttrs v || isDrv v then
             |     ^
           26|       v

       … in the left operand of the OR (||) operator
         at «string»:25:28:
           24|     v:
           25|     if !builtins.isAttrs v || isDrv v then
             |                            ^
           26|       v

       … while evaluating the option `system.build.toplevel':

       … while evaluating definitions from `/nix/store/8ak04fk7vigs495sxhxshyf7b9mlcmgb-source/nixos/modules/system/activation/top-level.nix':

       (stack trace truncated; use '--show-trace' to show the full, detailed trace)

       error:
       Failed assertions:
       - The option definition `services.nextcloud.config.adminpassFile' in `/nix/store/6s5m3g2lqnww44sxk8hy05cq6cip9nap-source/machines/eve/modules/nextcloud.nix' no longer has any effect; please remove it.
       To create an admin user after the installation, use nextcloud-occ user:add <username> and nextcloud-occ group:adduser admin <username>.


       - The option definition `services.nextcloud.config.adminuser' in `/nix/store/6s5m3g2lqnww44sxk8hy05cq6cip9nap-source/machines/eve/modules/nextcloud.nix' no longer has any effect; please remove it.
       To create an admin user after the installation, use nextcloud-occ user:add <username> and nextcloud-occ group:adduser admin <username>.
failed checks.x86_64-linux.nixos-jacquardmachine 11m 33s
zfstools-0.1.0: 264 _callImplicitHook /nix/store/an9g93vg5b02j74y38zfajswa0f10p2z-stdenv-linux/setup 281 _eval /nix/store/an9g93vg5b02j74y38zfajswa0f10p2z-stden …
zfstools-0.1.0:
264 _callImplicitHook /nix/store/an9g93vg5b02j74y38zfajswa0f10p2z-stdenv-linux/setup
281 _eval /nix/store/an9g93vg5b02j74y38zfajswa0f10p2z-stdenv-linux/setup
220 runHook /nix/store/an9g93vg5b02j74y38zfajswa0f10p2z-stdenv-linux/setup
1666 fixupPhase /nix/store/an9g93vg5b02j74y38zfajswa0f10p2z-stdenv-linux/setup
1771 runPhase /nix/store/an9g93vg5b02j74y38zfajswa0f10p2z-stdenv-linux/setup
1826 genericBuild /nix/store/an9g93vg5b02j74y38zfajswa0f10p2z-stdenv-linux/setup
1 source /nix/store/shkw4qm9qcw5sc5n1k5jznc83ny02r39-default-builder.sh
3 main /nix/store/l622p70vy8k5sh7y5wizi5f2mic6ynpg-source-stdenv.sh

linux-7.2.11-modules:
tribuchet: building on jamie
structuredAttrs is enabled
created 489 symlinks in user environment
structuredAttrs is enabled
kernel version is 7.2.11
cat: updates/scap.ko.cer: No such file or directory
cat: extra/framework_laptop.ko.cer: No such file or directory
failed checks.x86_64-linux.nixos-turingmachine 9m 25s
noctalia-qs-0.0.12: [890/1392] Building CXX object src/wayland/background_effect/CMakeFiles/quickshell-wayland-background-effect.dir/qml.cpp.o [891/1392] Buildi …
noctalia-qs-0.0.12:
[890/1392] Building CXX object src/wayland/background_effect/CMakeFiles/quickshell-wayland-background-effect.dir/qml.cpp.o
[891/1392] Building CXX object src/wayland/dwl/CMakeFiles/quickshell-dwl.dir/qml.cpp.o
[892/1392] Building CXX object src/wayland/niri/ipc/CMakeFiles/quickshell-niri-ipc.dir/connection.cpp.o
[893/1392] Building CXX object src/wayland/dwl/CMakeFiles/quickshell-dwl.dir/quickshell-dwl_qmltyperegistrations.cpp.o
[894/1392] Building CXX object src/wayland/dwl/CMakeFiles/quickshell-dwl.dir/manager.cpp.o
[895/1392] Building CXX object src/wayland/hyprland/ipc/CMakeFiles/quickshell-hyprland-ipc.dir/connection.cpp.o
[896/1392] Building CXX object src/wayland/dwl/CMakeFiles/quickshell-dwl.dir/quickshell-dwl_autogen/mocs_compilation.cpp.o
ninja: build stopped: subcommand failed.

zfstools-0.1.0:
264 _callImplicitHook /nix/store/an9g93vg5b02j74y38zfajswa0f10p2z-stdenv-linux/setup
281 _eval /nix/store/an9g93vg5b02j74y38zfajswa0f10p2z-stdenv-linux/setup
220 runHook /nix/store/an9g93vg5b02j74y38zfajswa0f10p2z-stdenv-linux/setup
1666 fixupPhase /nix/store/an9g93vg5b02j74y38zfajswa0f10p2z-stdenv-linux/setup
1771 runPhase /nix/store/an9g93vg5b02j74y38zfajswa0f10p2z-stdenv-linux/setup
1826 genericBuild /nix/store/an9g93vg5b02j74y38zfajswa0f10p2z-stdenv-linux/setup
1 source /nix/store/shkw4qm9qcw5sc5n1k5jznc83ny02r39-default-builder.sh
3 main /nix/store/l622p70vy8k5sh7y5wizi5f2mic6ynpg-source-stdenv.sh

linux-7.2.11-modules:
tribuchet: building on jamie
structuredAttrs is enabled
created 351 symlinks in user environment
structuredAttrs is enabled
kernel version is 7.2.11
cat: updates/scap.ko.cer: No such file or directory
cat: extra/framework_laptop.ko.cer: No such file or directory
failed checks.x86_64-linux.package-email-sync 2m 34s
afew-4.0.2: 264 _callImplicitHook /nix/store/an9g93vg5b02j74y38zfajswa0f10p2z-stdenv-linux/setup 281 _eval /nix/store/an9g93vg5b02j74y38zfajswa0f10p2z-stdenv-li …
afew-4.0.2:
264 _callImplicitHook /nix/store/an9g93vg5b02j74y38zfajswa0f10p2z-stdenv-linux/setup
281 _eval /nix/store/an9g93vg5b02j74y38zfajswa0f10p2z-stdenv-linux/setup
220 runHook /nix/store/an9g93vg5b02j74y38zfajswa0f10p2z-stdenv-linux/setup
1666 fixupPhase /nix/store/an9g93vg5b02j74y38zfajswa0f10p2z-stdenv-linux/setup
1771 runPhase /nix/store/an9g93vg5b02j74y38zfajswa0f10p2z-stdenv-linux/setup
1826 genericBuild /nix/store/an9g93vg5b02j74y38zfajswa0f10p2z-stdenv-linux/setup
1 source /nix/store/shkw4qm9qcw5sc5n1k5jznc83ny02r39-default-builder.sh
3 main /nix/store/l622p70vy8k5sh7y5wizi5f2mic6ynpg-source-stdenv.sh
failed checks.x86_64-linux.package-merge-when-green 2m 54s
flake-fmt-1.0.0: | ^^^^^^^^^^^^^^^^^^^^^^^^^^^^^^^^^^^^^^^^^^^^^^^^^^^^^^^^^^^^^^^^^^^^^^^^^^^^^^^^^^^^^^ | = note: expected `unsafe extern "C" …
flake-fmt-1.0.0:
    |     ^^^^^^^^^^^^^^^^^^^^^^^^^^^^^^^^^^^^^^^^^^^^^^^^^^^^^^^^^^^^^^^^^^^^^^^^^^^^^^^^^^^^^^
    |
    = note: expected `unsafe extern "C" fn(*const i8, i32, ...) -> i32` (for the current target)
            found    `unsafe extern "C" fn(*const i8, i32, i32) -> i32`
    = help: either fix the signature or remove any attributes like `#[unsafe(no_mangle)]`, `#[unsafe(export_name = "open")]`, or `#[link_name = "open"]`
    = note: `#[deny(invalid_runtime_symbol_definitions)]` on by default
error: could not compile `flake-fmt-trace` (lib) due to 1 previous error
warning: build failed, waiting for other jobs to finish...
dependency failed checks.x86_64-linux.package-pim —
232 succeeded
succeeded attributes
status attribute duration
loading…
3 already built
skipped attributes
status attribute duration
loading…