nixbot

builds

Mic92/dotfiles build #831 failed

branch main · PR #6032 · commit 878e16706e · · took 4m 40s · eval 1m 40s

eval warnings 5 kinds · 7 occurrences
  • error ×1
  • error Refusing to evaluate package 'pinchflat-2025.9.26' in /nix/store/…-source/pkgs/by-name/pi/pinchflat/package.nix:85 because it is marked as insecure ×1
  • warn The option `services.avahi.publish.enable` is obsolete. Use ×2
  • warn The option `services.avahi.publish.userServices` is obsolete. Use ×2
  • warn A legacy Nextcloud install (from before NixOS 26.11) may be installed. ×1

17 failed ⚠ 2
failed attributes
status attribute duration
failed checks.x86_64-linux.nixos-bernie
  • The option `services.avahi.publish.enable` is obsolete. Use `services.avahi.settings.publish."disable-publishing" = false;` instead.
  • The option `services.avahi.publish.userServices` is obsolete. Use `services.avahi.settings.publish.disable-user-service-publishing = false;` and `services.avahi.settings.publish.publish-addresses = true;` instead.
1m 52s
linux-7.2.11-modules: tribuchet: building on jamie structuredAttrs is enabled created 346 symlinks in user environment structuredAttrs is enabled kernel version …
linux-7.2.11-modules:
tribuchet: building on jamie
structuredAttrs is enabled
created 346 symlinks in user environment
structuredAttrs is enabled
kernel version is 7.2.11
cat: updates/scap.ko.cer: No such file or directory

zfstools-0.1.0:
264 _callImplicitHook /nix/store/an9g93vg5b02j74y38zfajswa0f10p2z-stdenv-linux/setup
281 _eval /nix/store/an9g93vg5b02j74y38zfajswa0f10p2z-stdenv-linux/setup
220 runHook /nix/store/an9g93vg5b02j74y38zfajswa0f10p2z-stdenv-linux/setup
1666 fixupPhase /nix/store/an9g93vg5b02j74y38zfajswa0f10p2z-stdenv-linux/setup
1771 runPhase /nix/store/an9g93vg5b02j74y38zfajswa0f10p2z-stdenv-linux/setup
1826 genericBuild /nix/store/an9g93vg5b02j74y38zfajswa0f10p2z-stdenv-linux/setup
1 source /nix/store/shkw4qm9qcw5sc5n1k5jznc83ny02r39-default-builder.sh
3 main /nix/store/l622p70vy8k5sh7y5wizi5f2mic6ynpg-source-stdenv.sh

python3.14-pyopenjtalk-plus-0.4.1-post9:
E       AssertionError: Regex pattern did not match.
E         Expected regex: 'must be str'
E         Actual message: 'Expected str, got int'
tests/test_frontend.py:775: AssertionError
=========================== short test summary info ============================
FAILED tests/test_frontend.py::test_run_njd_from_mecab_invalid_input_should_not_break_next_call
================= 1 failed, 1678 passed, 16 skipped in 10.89s ==================
done!
failed checks.x86_64-linux.nixos-matchbox
  • The option `services.avahi.publish.enable` is obsolete. Use `services.avahi.settings.publish."disable-publishing" = false;` instead.
  • The option `services.avahi.publish.userServices` is obsolete. Use `services.avahi.settings.publish.disable-user-service-publishing = false;` and `services.avahi.settings.publish.publish-addresses = true;` instead.
11s
zfstools-0.1.0: 264 _callImplicitHook /nix/store/an9g93vg5b02j74y38zfajswa0f10p2z-stdenv-linux/setup 281 _eval /nix/store/an9g93vg5b02j74y38zfajswa0f10p2z-stden …
zfstools-0.1.0:
264 _callImplicitHook /nix/store/an9g93vg5b02j74y38zfajswa0f10p2z-stdenv-linux/setup
281 _eval /nix/store/an9g93vg5b02j74y38zfajswa0f10p2z-stdenv-linux/setup
220 runHook /nix/store/an9g93vg5b02j74y38zfajswa0f10p2z-stdenv-linux/setup
1666 fixupPhase /nix/store/an9g93vg5b02j74y38zfajswa0f10p2z-stdenv-linux/setup
1771 runPhase /nix/store/an9g93vg5b02j74y38zfajswa0f10p2z-stdenv-linux/setup
1826 genericBuild /nix/store/an9g93vg5b02j74y38zfajswa0f10p2z-stdenv-linux/setup
1 source /nix/store/shkw4qm9qcw5sc5n1k5jznc83ny02r39-default-builder.sh
3 main /nix/store/l622p70vy8k5sh7y5wizi5f2mic6ynpg-source-stdenv.sh
dependency failed checks.aarch64-darwin.home-manager-macos —
dependency failed checks.aarch64-darwin.home-manager-utm-vm —
failed checks.aarch64-darwin.package-email-sync 5s
afew-4.0.2: collected 13 items afew/tests/test_dkimvalidityfilter.py ...... [ 46%] afew/tests/test_headermatchingfilter.py .. …
afew-4.0.2:
collected 13 items
afew/tests/test_dkimvalidityfilter.py ......                             [ 46%]
afew/tests/test_headermatchingfilter.py ..                               [ 61%]
afew/tests/test_mailmover.py ..                                          [ 76%]
afew/tests/test_settings.py ...                                          [100%]
============================== 13 passed in 0.36s ==============================
Finished executing pytestCheckPhase
tribuchet worker error: builder did not produce output /nix/store/c41rrp8y9im6zkwz61v8b108rfkk149n-afew-4.0.2-man
dependency failed checks.aarch64-darwin.package-pim —
dependency failed checks.aarch64-linux.home-manager-utm-vm —
failed eval checks.aarch64-linux.nixos-blob64 —
error: … while evaluating a branch condition at «string»:25:5: 24| v: 25| if !builtins.isAttrs v || isDrv v then …
error:
       … while evaluating a branch condition
         at «string»:25:5:
           24|     v:
           25|     if !builtins.isAttrs v || isDrv v then
             |     ^
           26|       v

       … in the left operand of the OR (||) operator
         at «string»:25:28:
           24|     v:
           25|     if !builtins.isAttrs v || isDrv v then
             |                            ^
           26|       v

       … while evaluating the option `system.build.toplevel':

       … while evaluating definitions from `/nix/store/xfl6rbzawl0idk3dqa6bycmz8qz545y8-source/nixos/modules/system/activation/top-level.nix':

       … while evaluating the option `warnings':

       … while evaluating definitions from `/nix/store/xfl6rbzawl0idk3dqa6bycmz8qz545y8-source/nixos/modules/system/boot/systemd.nix':

       … while evaluating the option `systemd.services.pinchflat.serviceConfig':

       … while evaluating definitions from `/nix/store/xfl6rbzawl0idk3dqa6bycmz8qz545y8-source/nixos/modules/services/misc/pinchflat.nix':

       (stack trace truncated; use '--show-trace' to show the full, detailed trace)

       error: Refusing to evaluate package 'pinchflat-2025.9.26' in /nix/store/xfl6rbzawl0idk3dqa6bycmz8qz545y8-source/pkgs/by-name/pi/pinchflat/package.nix:85 because it is marked as insecure

       Known issues:
        - multiple CVEs in dependencies. consider `pinchflat-ngx` fork as an alternative

       You can install it anyway by allowing this package, using the
       following methods:

       a) To temporarily allow all insecure packages, you can use an environment
          variable for a single invocation of the nix tools:

            $ export NIXPKGS_ALLOW_INSECURE=1

          Note: When using `nix shell`, `nix build`, `nix develop`, etc with a flake,
                then pass `--impure` in order to allow use of environment variables.

       b) for `nixos-rebuild` you can add ‘pinchflat-2025.9.26’ to
          `nixpkgs.config.permittedInsecurePackages` in the configuration.nix,
          like so:

            {
              nixpkgs.config.permittedInsecurePackages = [
                "pinchflat-2025.9.26"
              ];
            }

       c) For `nix-env`, `nix-build`, `nix-shell` or any other Nix command you can add
          ‘pinchflat-2025.9.26’ to `permittedInsecurePackages` in
          ~/.config/nixpkgs/config.nix, like so:

            {
              permittedInsecurePackages = [
                "pinchflat-2025.9.26"
              ];
            }
failed checks.aarch64-linux.package-email-sync 27s
afew-4.0.2: collected 13 items afew/tests/test_dkimvalidityfilter.py ...... [ 46%] afew/tests/test_headermatchingfilter.py .. …
afew-4.0.2:
collected 13 items
afew/tests/test_dkimvalidityfilter.py ......                             [ 46%]
afew/tests/test_headermatchingfilter.py ..                               [ 61%]
afew/tests/test_mailmover.py ..                                          [ 76%]
afew/tests/test_settings.py ...                                          [100%]
============================== 13 passed in 1.29s ==============================
Finished executing pytestCheckPhase
tribuchet worker error: builder did not produce output /nix/store/593aizfbvj4jzyymcvwkdailbydizgkf-afew-4.0.2-man
dependency failed checks.aarch64-linux.package-pim —
failed checks.x86_64-linux.home-manager-eve 1m 45s
calendar-cli-1.0.0: 264 _callImplicitHook /nix/store/an9g93vg5b02j74y38zfajswa0f10p2z-stdenv-linux/setup 281 _eval /nix/store/an9g93vg5b02j74y38zfajswa0f10p2z-s …
calendar-cli-1.0.0:
264 _callImplicitHook /nix/store/an9g93vg5b02j74y38zfajswa0f10p2z-stdenv-linux/setup
281 _eval /nix/store/an9g93vg5b02j74y38zfajswa0f10p2z-stdenv-linux/setup
220 runHook /nix/store/an9g93vg5b02j74y38zfajswa0f10p2z-stdenv-linux/setup
1666 fixupPhase /nix/store/an9g93vg5b02j74y38zfajswa0f10p2z-stdenv-linux/setup
1771 runPhase /nix/store/an9g93vg5b02j74y38zfajswa0f10p2z-stdenv-linux/setup
1826 genericBuild /nix/store/an9g93vg5b02j74y38zfajswa0f10p2z-stdenv-linux/setup
1 source /nix/store/shkw4qm9qcw5sc5n1k5jznc83ny02r39-default-builder.sh
3 main /nix/store/l622p70vy8k5sh7y5wizi5f2mic6ynpg-source-stdenv.sh

todoman-4.7.0:
copying static files: done
copying extra files... 
copying extra files: done
dumping object inventory... done
build succeeded, 2 warnings.
The HTML page is in .sphinx/singlehtml/singlehtml.
Executing installSphinxPhase
rm: cannot remove '.sphinx/man/man/_static/jquery.js': No such file or directory

afew-4.0.2:
collected 13 items
afew/tests/test_dkimvalidityfilter.py ......                             [ 46%]
afew/tests/test_headermatchingfilter.py ..                               [ 61%]
afew/tests/test_mailmover.py ..                                          [ 76%]
afew/tests/test_settings.py ...                                          [100%]
============================== 13 passed in 0.39s ==============================
Finished executing pytestCheckPhase
tribuchet worker error: builder did not produce output /nix/store/khymi59iybqp49s8xwv8ms497k93qfaw-afew-4.0.2-man

… and 2 more failed derivations
failed checks.x86_64-linux.nixos-dorits-laptop 8s
linux-7.2.11-modules: tribuchet: building on jamie structuredAttrs is enabled created 350 symlinks in user environment structuredAttrs is enabled kernel version …
linux-7.2.11-modules:
tribuchet: building on jamie
structuredAttrs is enabled
created 350 symlinks in user environment
structuredAttrs is enabled
kernel version is 7.2.11
cat: updates/scap.ko.cer: No such file or directory
cat: extra/framework_laptop.ko.cer: No such file or directory

zfstools-0.1.0:
264 _callImplicitHook /nix/store/an9g93vg5b02j74y38zfajswa0f10p2z-stdenv-linux/setup
281 _eval /nix/store/an9g93vg5b02j74y38zfajswa0f10p2z-stdenv-linux/setup
220 runHook /nix/store/an9g93vg5b02j74y38zfajswa0f10p2z-stdenv-linux/setup
1666 fixupPhase /nix/store/an9g93vg5b02j74y38zfajswa0f10p2z-stdenv-linux/setup
1771 runPhase /nix/store/an9g93vg5b02j74y38zfajswa0f10p2z-stdenv-linux/setup
1826 genericBuild /nix/store/an9g93vg5b02j74y38zfajswa0f10p2z-stdenv-linux/setup
1 source /nix/store/shkw4qm9qcw5sc5n1k5jznc83ny02r39-default-builder.sh
3 main /nix/store/l622p70vy8k5sh7y5wizi5f2mic6ynpg-source-stdenv.sh
failed checks.x86_64-linux.nixos-eva 5s
zfstools-0.1.0: 264 _callImplicitHook /nix/store/49cnv1lz3hiybz55z8lm8i401iqrpqyw-stdenv-linux/setup 281 _eval /nix/store/49cnv1lz3hiybz55z8lm8i401iqrpqyw-stden …
zfstools-0.1.0:
264 _callImplicitHook /nix/store/49cnv1lz3hiybz55z8lm8i401iqrpqyw-stdenv-linux/setup
281 _eval /nix/store/49cnv1lz3hiybz55z8lm8i401iqrpqyw-stdenv-linux/setup
220 runHook /nix/store/49cnv1lz3hiybz55z8lm8i401iqrpqyw-stdenv-linux/setup
1666 fixupPhase /nix/store/49cnv1lz3hiybz55z8lm8i401iqrpqyw-stdenv-linux/setup
1771 runPhase /nix/store/49cnv1lz3hiybz55z8lm8i401iqrpqyw-stdenv-linux/setup
1826 genericBuild /nix/store/49cnv1lz3hiybz55z8lm8i401iqrpqyw-stdenv-linux/setup
1 source /nix/store/shkw4qm9qcw5sc5n1k5jznc83ny02r39-default-builder.sh
3 main /nix/store/l622p70vy8k5sh7y5wizi5f2mic6ynpg-source-stdenv.sh
failed checks.x86_64-linux.nixos-jacquardmachine 9s
linux-7.2.11-modules: tribuchet: building on jamie structuredAttrs is enabled created 489 symlinks in user environment structuredAttrs is enabled kernel version …
linux-7.2.11-modules:
tribuchet: building on jamie
structuredAttrs is enabled
created 489 symlinks in user environment
structuredAttrs is enabled
kernel version is 7.2.11
cat: updates/scap.ko.cer: No such file or directory
cat: extra/framework_laptop.ko.cer: No such file or directory

zfstools-0.1.0:
264 _callImplicitHook /nix/store/an9g93vg5b02j74y38zfajswa0f10p2z-stdenv-linux/setup
281 _eval /nix/store/an9g93vg5b02j74y38zfajswa0f10p2z-stdenv-linux/setup
220 runHook /nix/store/an9g93vg5b02j74y38zfajswa0f10p2z-stdenv-linux/setup
1666 fixupPhase /nix/store/an9g93vg5b02j74y38zfajswa0f10p2z-stdenv-linux/setup
1771 runPhase /nix/store/an9g93vg5b02j74y38zfajswa0f10p2z-stdenv-linux/setup
1826 genericBuild /nix/store/an9g93vg5b02j74y38zfajswa0f10p2z-stdenv-linux/setup
1 source /nix/store/shkw4qm9qcw5sc5n1k5jznc83ny02r39-default-builder.sh
3 main /nix/store/l622p70vy8k5sh7y5wizi5f2mic6ynpg-source-stdenv.sh
failed checks.x86_64-linux.nixos-turingmachine 49s
linux-7.2.11-modules: tribuchet: building on jamie structuredAttrs is enabled created 351 symlinks in user environment structuredAttrs is enabled kernel version …
linux-7.2.11-modules:
tribuchet: building on jamie
structuredAttrs is enabled
created 351 symlinks in user environment
structuredAttrs is enabled
kernel version is 7.2.11
cat: updates/scap.ko.cer: No such file or directory
cat: extra/framework_laptop.ko.cer: No such file or directory

zfstools-0.1.0:
264 _callImplicitHook /nix/store/an9g93vg5b02j74y38zfajswa0f10p2z-stdenv-linux/setup
281 _eval /nix/store/an9g93vg5b02j74y38zfajswa0f10p2z-stdenv-linux/setup
220 runHook /nix/store/an9g93vg5b02j74y38zfajswa0f10p2z-stdenv-linux/setup
1666 fixupPhase /nix/store/an9g93vg5b02j74y38zfajswa0f10p2z-stdenv-linux/setup
1771 runPhase /nix/store/an9g93vg5b02j74y38zfajswa0f10p2z-stdenv-linux/setup
1826 genericBuild /nix/store/an9g93vg5b02j74y38zfajswa0f10p2z-stdenv-linux/setup
1 source /nix/store/shkw4qm9qcw5sc5n1k5jznc83ny02r39-default-builder.sh
3 main /nix/store/l622p70vy8k5sh7y5wizi5f2mic6ynpg-source-stdenv.sh

noctalia-qs-0.0.12:
[941/1392] Building CXX object src/services/status_notifier/CMakeFiles/quickshell-service-statusnotifier.dir/dbus_item_types.cpp.o
[942/1392] Building CXX object src/services/status_notifier/CMakeFiles/quickshell-service-statusnotifier.dir/quickshell-service-statusnotifier_autogen/mocs_compilation.cpp.o
[943/1392] Building CXX object src/services/status_notifier/CMakeFiles/quickshell-service-statusnotifier.dir/dbus_item.cpp.o
[944/1392] Building CXX object src/services/status_notifier/CMakeFiles/quickshell-service-statusnotifier.dir/host.cpp.o
[945/1392] Building CXX object src/x11/i3/ipc/CMakeFiles/quickshell-i3-ipc.dir/controller.cpp.o
[946/1392] Building CXX object src/wayland/hyprland/ipc/CMakeFiles/quickshell-hyprland-ipc.dir/connection.cpp.o
[947/1392] Building CXX object src/services/status_notifier/CMakeFiles/quickshell-service-statusnotifier.dir/item.cpp.o
ninja: build stopped: subcommand failed.
failed checks.x86_64-linux.package-email-sync 14s
afew-4.0.2: collected 13 items afew/tests/test_dkimvalidityfilter.py ...... [ 46%] afew/tests/test_headermatchingfilter.py .. …
afew-4.0.2:
collected 13 items
afew/tests/test_dkimvalidityfilter.py ......                             [ 46%]
afew/tests/test_headermatchingfilter.py ..                               [ 61%]
afew/tests/test_mailmover.py ..                                          [ 76%]
afew/tests/test_settings.py ...                                          [100%]
============================== 13 passed in 0.43s ==============================
Finished executing pytestCheckPhase
tribuchet worker error: builder did not produce output /nix/store/khymi59iybqp49s8xwv8ms497k93qfaw-afew-4.0.2-man
dependency failed checks.x86_64-linux.package-pim —
5 cancelled ⚠ 1
cancelled attributes
status attribute duration
cancelled checks.x86_64-linux.nixos-eve
  • A legacy Nextcloud install (from before NixOS 26.11) may be installed. After nextcloud34 is installed successfully, you can safely upgrade to 35. The latest version available is Nextcloud35. Please note that Nextcloud doesn't support upgrades across multiple major versions (i.e. an upgrade from 16 is possible to 17, but not 16 to 18). The package can be upgraded by explicitly declaring the service-option `services.nextcloud.package`.
3m 11s
cancelled checks.aarch64-linux.home-manager-common 4m 9s
cancelled checks.x86_64-linux.home-manager-coder 3m 42s
cancelled checks.x86_64-linux.home-manager-desktop 3m 41s
cancelled checks.x86_64-linux.home-manager-utm-vm 3m 35s
17 succeeded
succeeded attributes
status attribute duration
loading…
226 already built
skipped attributes
status attribute duration
loading…