nixbot

builds

Mic92/dotfiles build #837 failed

branch main · PR #6032 · commit c000491c5f · · took 3h 2m · eval 1m 41s

19 failed
failed attributes
status attribute duration
dependency failed checks.aarch64-darwin.home-manager-macos —
dependency failed checks.aarch64-darwin.home-manager-utm-vm —
failed checks.aarch64-darwin.package-pim 10m 7s
calendar-cli-1.0.0: 272 _callImplicitHook /nix/store/4gqzn5ia76rp74p8fb6nvry3arbn3l7j-stdenv-darwin/setup 289 _eval /nix/store/4gqzn5ia76rp74p8fb6nvry3arbn3l7j- …
calendar-cli-1.0.0:
272 _callImplicitHook /nix/store/4gqzn5ia76rp74p8fb6nvry3arbn3l7j-stdenv-darwin/setup
289 _eval /nix/store/4gqzn5ia76rp74p8fb6nvry3arbn3l7j-stdenv-darwin/setup
228 runHook /nix/store/4gqzn5ia76rp74p8fb6nvry3arbn3l7j-stdenv-darwin/setup
1674 fixupPhase /nix/store/4gqzn5ia76rp74p8fb6nvry3arbn3l7j-stdenv-darwin/setup
1779 runPhase /nix/store/4gqzn5ia76rp74p8fb6nvry3arbn3l7j-stdenv-darwin/setup
1834 genericBuild /nix/store/4gqzn5ia76rp74p8fb6nvry3arbn3l7j-stdenv-darwin/setup
1 source /nix/store/shkw4qm9qcw5sc5n1k5jznc83ny02r39-default-builder.sh
3 main /nix/store/l622p70vy8k5sh7y5wizi5f2mic6ynpg-source-stdenv.sh
failed checks.aarch64-linux.home-manager-utm-vm 1h 32m
calendar-cli-1.0.0: 264 _callImplicitHook /nix/store/49cnv1lz3hiybz55z8lm8i401iqrpqyw-stdenv-linux/setup 281 _eval /nix/store/49cnv1lz3hiybz55z8lm8i401iqrpqyw-s …
calendar-cli-1.0.0:
264 _callImplicitHook /nix/store/49cnv1lz3hiybz55z8lm8i401iqrpqyw-stdenv-linux/setup
281 _eval /nix/store/49cnv1lz3hiybz55z8lm8i401iqrpqyw-stdenv-linux/setup
220 runHook /nix/store/49cnv1lz3hiybz55z8lm8i401iqrpqyw-stdenv-linux/setup
1666 fixupPhase /nix/store/49cnv1lz3hiybz55z8lm8i401iqrpqyw-stdenv-linux/setup
1771 runPhase /nix/store/49cnv1lz3hiybz55z8lm8i401iqrpqyw-stdenv-linux/setup
1826 genericBuild /nix/store/49cnv1lz3hiybz55z8lm8i401iqrpqyw-stdenv-linux/setup
1 source /nix/store/shkw4qm9qcw5sc5n1k5jznc83ny02r39-default-builder.sh
3 main /nix/store/l622p70vy8k5sh7y5wizi5f2mic6ynpg-source-stdenv.sh

python3.14-nixbot-cli:
264 _callImplicitHook /nix/store/49cnv1lz3hiybz55z8lm8i401iqrpqyw-stdenv-linux/setup
281 _eval /nix/store/49cnv1lz3hiybz55z8lm8i401iqrpqyw-stdenv-linux/setup
220 runHook /nix/store/49cnv1lz3hiybz55z8lm8i401iqrpqyw-stdenv-linux/setup
1666 fixupPhase /nix/store/49cnv1lz3hiybz55z8lm8i401iqrpqyw-stdenv-linux/setup
1771 runPhase /nix/store/49cnv1lz3hiybz55z8lm8i401iqrpqyw-stdenv-linux/setup
1826 genericBuild /nix/store/49cnv1lz3hiybz55z8lm8i401iqrpqyw-stdenv-linux/setup
1 source /nix/store/shkw4qm9qcw5sc5n1k5jznc83ny02r39-default-builder.sh
3 main /nix/store/l622p70vy8k5sh7y5wizi5f2mic6ynpg-source-stdenv.sh

herdr-0.9.5:
          @compileError(std.fmt.comptimePrint(
          ^~~~~~~~~~~~~
  build.zig:16:24: note: called at comptime here
      buildpkg.requireZig(minimum_zig_version);
      ~~~~~~~~~~~~~~~~~~~^~~~~~~~~~~~~~~~~~~~~
  thread 'main' (1846) panicked at crates/ghostty-vt/build.rs:112:5:
  zig build for vendored libghostty-vt failed: exit status: 1. Building Herdr requires Zig 0.16.0; check `zig version` or set ZIG to the path of a Zig 0.16.0 binary, then retry
  note: run with `RUST_BACKTRACE=1` environment variable to display a backtrace
failed checks.aarch64-linux.nixos-blob64 12m 45s
borgbackup-1.4.5: raise SphinxError( ...<5 lines>... ) from exc sphinx.errors.SphinxError: Builder name singlehtml man not registere …
borgbackup-1.4.5:
        raise SphinxError(
        ...<5 lines>...
        ) from exc
    sphinx.errors.SphinxError: Builder name singlehtml man not registered or available through entry point
The full traceback has been saved in:
/build/sphinx-err-kg42wzry.log
To report this error to the developers, please open an issue at <https://github.com/sphinx-doc/sphinx/issues/>. Thanks!
Please also report this if it was a user error, so that a better error message can be provided next time.
failed checks.aarch64-linux.package-pim 9m 9s
calendar-cli-1.0.0: 264 _callImplicitHook /nix/store/49cnv1lz3hiybz55z8lm8i401iqrpqyw-stdenv-linux/setup 281 _eval /nix/store/49cnv1lz3hiybz55z8lm8i401iqrpqyw-s …
calendar-cli-1.0.0:
264 _callImplicitHook /nix/store/49cnv1lz3hiybz55z8lm8i401iqrpqyw-stdenv-linux/setup
281 _eval /nix/store/49cnv1lz3hiybz55z8lm8i401iqrpqyw-stdenv-linux/setup
220 runHook /nix/store/49cnv1lz3hiybz55z8lm8i401iqrpqyw-stdenv-linux/setup
1666 fixupPhase /nix/store/49cnv1lz3hiybz55z8lm8i401iqrpqyw-stdenv-linux/setup
1771 runPhase /nix/store/49cnv1lz3hiybz55z8lm8i401iqrpqyw-stdenv-linux/setup
1826 genericBuild /nix/store/49cnv1lz3hiybz55z8lm8i401iqrpqyw-stdenv-linux/setup
1 source /nix/store/shkw4qm9qcw5sc5n1k5jznc83ny02r39-default-builder.sh
3 main /nix/store/l622p70vy8k5sh7y5wizi5f2mic6ynpg-source-stdenv.sh
failed checks.x86_64-linux.home-manager-coder 23m 20s
calendar-cli-1.0.0: 264 _callImplicitHook /nix/store/an9g93vg5b02j74y38zfajswa0f10p2z-stdenv-linux/setup 281 _eval /nix/store/an9g93vg5b02j74y38zfajswa0f10p2z-s …
calendar-cli-1.0.0:
264 _callImplicitHook /nix/store/an9g93vg5b02j74y38zfajswa0f10p2z-stdenv-linux/setup
281 _eval /nix/store/an9g93vg5b02j74y38zfajswa0f10p2z-stdenv-linux/setup
220 runHook /nix/store/an9g93vg5b02j74y38zfajswa0f10p2z-stdenv-linux/setup
1666 fixupPhase /nix/store/an9g93vg5b02j74y38zfajswa0f10p2z-stdenv-linux/setup
1771 runPhase /nix/store/an9g93vg5b02j74y38zfajswa0f10p2z-stdenv-linux/setup
1826 genericBuild /nix/store/an9g93vg5b02j74y38zfajswa0f10p2z-stdenv-linux/setup
1 source /nix/store/shkw4qm9qcw5sc5n1k5jznc83ny02r39-default-builder.sh
3 main /nix/store/l622p70vy8k5sh7y5wizi5f2mic6ynpg-source-stdenv.sh

python3.14-nixbot-cli:
264 _callImplicitHook /nix/store/an9g93vg5b02j74y38zfajswa0f10p2z-stdenv-linux/setup
281 _eval /nix/store/an9g93vg5b02j74y38zfajswa0f10p2z-stdenv-linux/setup
220 runHook /nix/store/an9g93vg5b02j74y38zfajswa0f10p2z-stdenv-linux/setup
1666 fixupPhase /nix/store/an9g93vg5b02j74y38zfajswa0f10p2z-stdenv-linux/setup
1771 runPhase /nix/store/an9g93vg5b02j74y38zfajswa0f10p2z-stdenv-linux/setup
1826 genericBuild /nix/store/an9g93vg5b02j74y38zfajswa0f10p2z-stdenv-linux/setup
1 source /nix/store/shkw4qm9qcw5sc5n1k5jznc83ny02r39-default-builder.sh
3 main /nix/store/l622p70vy8k5sh7y5wizi5f2mic6ynpg-source-stdenv.sh

onnxruntime-1.27.1:
 1068 | }  // namespace onnxruntime
      | ^
compilation terminated.
make[2]: *** [CMakeFiles/onnxruntime_graph.dir/build.make:499: CMakeFiles/onnxruntime_graph.dir/build/source/onnxruntime/core/graph/model.cc.o] Error 1
make[1]: *** [CMakeFiles/Makefile2:1312: CMakeFiles/onnxruntime_graph.dir/all] Error 2
make[1]: *** [CMakeFiles/Makefile2:1378: CMakeFiles/onnxruntime_framework.dir/all] Error 2
make[1]: *** [CMakeFiles/Makefile2:3153: CMakeFiles/onnxruntime_mlas_test.dir/all] Error 2
make: *** [Makefile:146: all] Error 2

… and 1 more failed derivation
failed checks.x86_64-linux.home-manager-desktop 28m 38s
herdr-0.9.5: @compileError(std.fmt.comptimePrint( ^~~~~~~~~~~~~ build.zig:16:24: note: called at comptime here buildpkg.requireZig(m …
herdr-0.9.5:
          @compileError(std.fmt.comptimePrint(
          ^~~~~~~~~~~~~
  build.zig:16:24: note: called at comptime here
      buildpkg.requireZig(minimum_zig_version);
      ~~~~~~~~~~~~~~~~~~~^~~~~~~~~~~~~~~~~~~~~
  thread 'main' (1800) panicked at crates/ghostty-vt/build.rs:112:5:
  zig build for vendored libghostty-vt failed: exit status: 1. Building Herdr requires Zig 0.16.0; check `zig version` or set ZIG to the path of a Zig 0.16.0 binary, then retry
  note: run with `RUST_BACKTRACE=1` environment variable to display a backtrace

python3.14-afdko-5.0.1:
tribuchet: building on jamie

onnxruntime-1.27.1:
tribuchet: building on jamie
tribuchet worker error: creating /var/lib/tribuchet/worker/builds/7433c884d7cd0c4ea268809e296ffbcf/top/build: No space left on device (os error 28)

… and 5 more failed derivations
failed checks.x86_64-linux.home-manager-eve 28m 36s
python3.14-nixbot-cli: 264 _callImplicitHook /nix/store/an9g93vg5b02j74y38zfajswa0f10p2z-stdenv-linux/setup 281 _eval /nix/store/an9g93vg5b02j74y38zfajswa0f10p2 …
python3.14-nixbot-cli:
264 _callImplicitHook /nix/store/an9g93vg5b02j74y38zfajswa0f10p2z-stdenv-linux/setup
281 _eval /nix/store/an9g93vg5b02j74y38zfajswa0f10p2z-stdenv-linux/setup
220 runHook /nix/store/an9g93vg5b02j74y38zfajswa0f10p2z-stdenv-linux/setup
1666 fixupPhase /nix/store/an9g93vg5b02j74y38zfajswa0f10p2z-stdenv-linux/setup
1771 runPhase /nix/store/an9g93vg5b02j74y38zfajswa0f10p2z-stdenv-linux/setup
1826 genericBuild /nix/store/an9g93vg5b02j74y38zfajswa0f10p2z-stdenv-linux/setup
1 source /nix/store/shkw4qm9qcw5sc5n1k5jznc83ny02r39-default-builder.sh
3 main /nix/store/l622p70vy8k5sh7y5wizi5f2mic6ynpg-source-stdenv.sh

herdr-0.9.5:
          @compileError(std.fmt.comptimePrint(
          ^~~~~~~~~~~~~
  build.zig:16:24: note: called at comptime here
      buildpkg.requireZig(minimum_zig_version);
      ~~~~~~~~~~~~~~~~~~~^~~~~~~~~~~~~~~~~~~~~
  thread 'main' (1837) panicked at crates/ghostty-vt/build.rs:112:5:
  zig build for vendored libghostty-vt failed: exit status: 1. Building Herdr requires Zig 0.16.0; check `zig version` or set ZIG to the path of a Zig 0.16.0 binary, then retry
  note: run with `RUST_BACKTRACE=1` environment variable to display a backtrace

onnxruntime-1.27.1:
tribuchet: building on jamie
tribuchet worker error: creating /var/lib/tribuchet/worker/builds/c8c437d9ee2810edb7b4016afcd5821b/top/build: No space left on device (os error 28)

… and 1 more failed derivation
failed checks.x86_64-linux.home-manager-utm-vm 28m 26s
python3.14-nixbot-cli: 264 _callImplicitHook /nix/store/an9g93vg5b02j74y38zfajswa0f10p2z-stdenv-linux/setup 281 _eval /nix/store/an9g93vg5b02j74y38zfajswa0f10p2 …
python3.14-nixbot-cli:
264 _callImplicitHook /nix/store/an9g93vg5b02j74y38zfajswa0f10p2z-stdenv-linux/setup
281 _eval /nix/store/an9g93vg5b02j74y38zfajswa0f10p2z-stdenv-linux/setup
220 runHook /nix/store/an9g93vg5b02j74y38zfajswa0f10p2z-stdenv-linux/setup
1666 fixupPhase /nix/store/an9g93vg5b02j74y38zfajswa0f10p2z-stdenv-linux/setup
1771 runPhase /nix/store/an9g93vg5b02j74y38zfajswa0f10p2z-stdenv-linux/setup
1826 genericBuild /nix/store/an9g93vg5b02j74y38zfajswa0f10p2z-stdenv-linux/setup
1 source /nix/store/shkw4qm9qcw5sc5n1k5jznc83ny02r39-default-builder.sh
3 main /nix/store/l622p70vy8k5sh7y5wizi5f2mic6ynpg-source-stdenv.sh

herdr-0.9.5:
          @compileError(std.fmt.comptimePrint(
          ^~~~~~~~~~~~~
  build.zig:16:24: note: called at comptime here
      buildpkg.requireZig(minimum_zig_version);
      ~~~~~~~~~~~~~~~~~~~^~~~~~~~~~~~~~~~~~~~~
  thread 'main' (1964) panicked at crates/ghostty-vt/build.rs:112:5:
  zig build for vendored libghostty-vt failed: exit status: 1. Building Herdr requires Zig 0.16.0; check `zig version` or set ZIG to the path of a Zig 0.16.0 binary, then retry
  note: run with `RUST_BACKTRACE=1` environment variable to display a backtrace

onnxruntime-1.27.1:
tribuchet: building on jamie
tribuchet worker error: creating /var/lib/tribuchet/worker/builds/27f0c52203f867fd564a118ba66b7ee3/top/build: No space left on device (os error 28)

… and 1 more failed derivation
failed checks.x86_64-linux.nixos-bernie 42m 43s
electron-unwrapped-44.7.2: ./third_party/icu/source/test/depstest/dependencies.py: interpreter directive changed from "#! /usr/bin/python -B" to "/nix/store/nf9 …
electron-unwrapped-44.7.2:
./third_party/icu/source/test/depstest/dependencies.py: interpreter directive changed from "#! /usr/bin/python -B" to "/nix/store/nf928iyq1ix5fn6xpxzfbkymw7pr8dng-python3-3.14.8-env/bin/python -B"
./third_party/icu/source/install-sh: interpreter directive changed from "#!/bin/sh" to "/nix/store/kwyi4bq5s2qgwbhz6cs4gjy57c2zdxws-bash-interactive-5.3p20/bin/sh"
./third_party/icu/source/configure: interpreter directive changed from "#! /bin/sh" to "/nix/store/kwyi4bq5s2qgwbhz6cs4gjy57c2zdxws-bash-interactive-5.3p20/bin/sh"
./third_party/icu/source/data/unidata/clean.sh: interpreter directive changed from "#!/bin/bash" to "/nix/store/kwyi4bq5s2qgwbhz6cs4gjy57c2zdxws-bash-interactive-5.3p20/bin/bash"
./third_party/icu/source/data/unidata/generate.sh: interpreter directive changed from "#!/bin/bash" to "/nix/store/kwyi4bq5s2qgwbhz6cs4gjy57c2zdxws-bash-interactive-5.3p20/bin/bash"
./third_party/icu/flutter/patch_brkitr.sh: interpreter directive changed from "#!/bin/sh" to "/nix/store/kwyi4bq5s2qgwbhz6cs4gjy57c2zdxws-bash-interactive-5.3p20/bin/sh"
./third_party/icu/scripts/update.sh: interpreter directive changed from "#!/bin/bash" to "/nix/store/kwyi4bq5s2qgwbhz6cs4gjy57c2zdxws-bash-interactive-5.3p20/bin/bash"
./third_party/icu/scripts/eucjp_gen.sh: interpreter directive changed from "#!/bin/sh" to "/nix/store/kwyi4bq5s2qgwbhz6cs4gjy57c2zdxws-bash-interactive-5.3p20/bin/sh"

webkitgtk-2.54.1+abi=4.1:
-- Found LibDRM: /nix/store/bvfayc21wafivfm336sis18p2f5dq1s1-libdrm-2.4.134-dev/include/libdrm (found version "2.4.134")
-- Looking for drmGetFormatModifierVendor
-- Looking for drmGetFormatModifierVendor - found
-- Looking for drmGetFormatModifierName
-- Looking for drmGetFormatModifierName - found
-- Looking for drmModeCreateDumbBuffer
-- Looking for drmModeCreateDumbBuffer - not found
-- Looking for drmModeDestroyDumbBuffer

onnxruntime-1.27.1:
tribuchet: building on jamie
tribuchet worker error: creating /var/lib/tribuchet/worker/builds/53f3717b67b9fde823bd84693b64fe4f/top/build: No space left on device (os error 28)

… and 8 more failed derivations
failed checks.x86_64-linux.nixos-dorits-laptop 28m 54s
onnxruntime-1.27.1: compilation terminated. /nix/store/y6ri2r743ckh5kk160r461czl9n2f2wf-binutils-2.46/bin/ld.bfd: error: lto-wrapper failed collect2: error: ld …
onnxruntime-1.27.1:
compilation terminated.
/nix/store/y6ri2r743ckh5kk160r461czl9n2f2wf-binutils-2.46/bin/ld.bfd: error: lto-wrapper failed
collect2: error: ld returned 1 exit status
make[2]: *** [CMakeFiles/onnxruntime_mlas_test.dir/build.make:827: onnxruntime_mlas_test] Error 1
make[1]: *** [CMakeFiles/Makefile2:3153: CMakeFiles/onnxruntime_mlas_test.dir/all] Error 2
make[1]: *** [CMakeFiles/Makefile2:1378: CMakeFiles/onnxruntime_framework.dir/all] Error 2
make[1]: *** [CMakeFiles/Makefile2:1445: CMakeFiles/onnxruntime_providers.dir/all] Error 2
make: *** [Makefile:146: all] Error 2

chromium-unwrapped-155.0.8059.84:
./third_party/swiftshader/third_party/SPIRV-Tools/utils/check_code_format.sh: interpreter directive changed from "#!/bin/bash" to "/nix/store/kwyi4bq5s2qgwbhz6cs4gjy57c2zdxws-bash-interactive-5.3p20/bin/bash"
./third_party/swiftshader/third_party/SPIRV-Tools/utils/fixup_fuzz_result.py: interpreter directive changed from "#!/usr/bin/env python3" to "/nix/store/nf928iyq1ix5fn6xpxzfbkymw7pr8dng-python3-3.14.8-env/bin/python3"
./third_party/swiftshader/third_party/SPIRV-Tools/utils/ggt.py: interpreter directive changed from "#!/usr/bin/env python3" to "/nix/store/nf928iyq1ix5fn6xpxzfbkymw7pr8dng-python3-3.14.8-env/bin/python3"
./third_party/swiftshader/third_party/SPIRV-Tools/utils/vscode/build_lsp.sh: interpreter directive changed from "#!/usr/bin/env bash" to "/nix/store/kwyi4bq5s2qgwbhz6cs4gjy57c2zdxws-bash-interactive-5.3p20/bin/bash"
./third_party/swiftshader/third_party/SPIRV-Tools/utils/vscode/install_vscode.sh: interpreter directive changed from "#!/usr/bin/env bash" to "/nix/store/kwyi4bq5s2qgwbhz6cs4gjy57c2zdxws-bash-interactive-5.3p20/bin/bash"
./third_party/swiftshader/third_party/SPIRV-Tools/utils/check_copyright.py: interpreter directive changed from "#!/usr/bin/env python3" to "/nix/store/nf928iyq1ix5fn6xpxzfbkymw7pr8dng-python3-3.14.8-env/bin/python3"
./third_party/swiftshader/third_party/SPIRV-Tools/utils/Table/Operand.py: interpreter directive changed from "#!/usr/bin/env python3" to "/nix/store/nf928iyq1ix5fn6xpxzfbkymw7pr8dng-python3-3.14.8-env/bin/python3"
./third_party/swiftshader/third_party/SPIRV-Tools/utils/Table/Operand_test.py: interpreter directive changed from "#!/usr/bin/env python3" to "/nix/store/nf928iyq1ix5fn6xpxzfbkymw7pr8dng-python3-3.14.8-env/bin/python3"

qtwebengine-6.140.0-rc:
tribuchet: building on jamie
tribuchet worker error: creating /var/lib/tribuchet/worker/builds/6a7998446d31ead5d4e2f9eeffce8b32/top/build: No space left on device (os error 28)

… and 3 more failed derivations
failed checks.x86_64-linux.nixos-eva 16m 45s
borgbackup-1.4.5: raise SphinxError( ...<5 lines>... ) from exc sphinx.errors.SphinxError: Builder name singlehtml man not registere …
borgbackup-1.4.5:
        raise SphinxError(
        ...<5 lines>...
        ) from exc
    sphinx.errors.SphinxError: Builder name singlehtml man not registered or available through entry point
The full traceback has been saved in:
/build/sphinx-err-bkeoae__.log
To report this error to the developers, please open an issue at <https://github.com/sphinx-doc/sphinx/issues/>. Thanks!
Please also report this if it was a user error, so that a better error message can be provided next time.
failed checks.x86_64-linux.nixos-eve 1h 31m
borgbackup-1.4.5: raise SphinxError( ...<5 lines>... ) from exc sphinx.errors.SphinxError: Builder name singlehtml man not registere …
borgbackup-1.4.5:
        raise SphinxError(
        ...<5 lines>...
        ) from exc
    sphinx.errors.SphinxError: Builder name singlehtml man not registered or available through entry point
The full traceback has been saved in:
/build/sphinx-err-wo5lrpgn.log
To report this error to the developers, please open an issue at <https://github.com/sphinx-doc/sphinx/issues/>. Thanks!
Please also report this if it was a user error, so that a better error message can be provided next time.

python3.14-duckdb-1.5.5:
tribuchet: building on jamie
tribuchet worker error: creating /var/lib/tribuchet/worker/builds/fe2195388facc1af0fc2f61ffc378168/top/build: No space left on device (os error 28)

onnxruntime-1.27.1:
tribuchet: building on jamie
tribuchet worker error: creating /var/lib/tribuchet/worker/builds/506b00126cd9fe7521c17b7f73349d16/top/build: No space left on device (os error 28)

… and 1 more failed derivation
failed checks.x86_64-linux.nixos-jacquardmachine 3h 0m
python3.14-afdko-5.0.1: tests/checkoutlinesufo_test.py ................. [ 30%] tests/comparefamily_test.py .. …
python3.14-afdko-5.0.1:
tests/checkoutlinesufo_test.py .................                         [ 30%]
tests/comparefamily_test.py ..                                           [ 31%]
tests/convertfonttocid_test.py ....                                      [ 31%]
tests/detype1_test.py ......                                             [ 31%]
tests/differ_test.py ...............................                     [ 33%]
tests/fdkutils_test.py ............................ssss..........        [ 36%]
tests/fontpdf_test.py ..                                                 [ 36%]
tests/invoker_test.py ............

onnxruntime-1.27.1:
tribuchet: building on jamie
tribuchet worker error: creating /var/lib/tribuchet/worker/builds/8d605c8a7f278e114c0302c8a9bb2075/top/build: No space left on device (os error 28)

qtwebengine-6.140.0-rc:
tribuchet: building on jamie
tribuchet worker error: creating /var/lib/tribuchet/worker/builds/be89322a674c83cd9d6caa457f155e92/top/build: No space left on device (os error 28)

… and 2 more failed derivations
failed checks.x86_64-linux.nixos-matchbox 10m 52s
borgbackup-1.4.5: raise SphinxError( ...<5 lines>... ) from exc sphinx.errors.SphinxError: Builder name singlehtml man not registere …
borgbackup-1.4.5:
        raise SphinxError(
        ...<5 lines>...
        ) from exc
    sphinx.errors.SphinxError: Builder name singlehtml man not registered or available through entry point
The full traceback has been saved in:
/build/sphinx-err-bpbff7vx.log
To report this error to the developers, please open an issue at <https://github.com/sphinx-doc/sphinx/issues/>. Thanks!
Please also report this if it was a user error, so that a better error message can be provided next time.
dependency failed checks.x86_64-linux.nixos-turingmachine —
failed checks.x86_64-linux.package-live-text 27m 44s
onnxruntime-1.27.1: /build/source/onnxruntime/test/mlas/unittest/test_halfgemm.cpp:168:3: fatal error: error writing to /build/ccLjxJ5d.s: No space left on devi …
onnxruntime-1.27.1:
/build/source/onnxruntime/test/mlas/unittest/test_halfgemm.cpp:168:3: fatal error: error writing to /build/ccLjxJ5d.s: No space left on device
  168 | });
      |   ^
compilation terminated.
make[2]: *** [CMakeFiles/onnxruntime_mlas_test.dir/build.make:233: CMakeFiles/onnxruntime_mlas_test.dir/build/source/onnxruntime/test/mlas/unittest/test_halfgemm.cpp.o] Error 1
make[1]: *** [CMakeFiles/Makefile2:3153: CMakeFiles/onnxruntime_mlas_test.dir/all] Error 2
[ 50%] Building CXX object CMakeFiles/onnxruntime_optimizer.dir/build/source/onnxruntime/core/optimizer/matmul_activation_fusion.cc.o
[ 50%] Building CXX object CMakeFiles/onnxruntime_optimizer.dir/build/source/onnxruntime/core/optimizer/matmul_add_fusion.cc.o
failed checks.x86_64-linux.package-pim 7s
calendar-cli-1.0.0: 264 _callImplicitHook /nix/store/an9g93vg5b02j74y38zfajswa0f10p2z-stdenv-linux/setup 281 _eval /nix/store/an9g93vg5b02j74y38zfajswa0f10p2z-s …
calendar-cli-1.0.0:
264 _callImplicitHook /nix/store/an9g93vg5b02j74y38zfajswa0f10p2z-stdenv-linux/setup
281 _eval /nix/store/an9g93vg5b02j74y38zfajswa0f10p2z-stdenv-linux/setup
220 runHook /nix/store/an9g93vg5b02j74y38zfajswa0f10p2z-stdenv-linux/setup
1666 fixupPhase /nix/store/an9g93vg5b02j74y38zfajswa0f10p2z-stdenv-linux/setup
1771 runPhase /nix/store/an9g93vg5b02j74y38zfajswa0f10p2z-stdenv-linux/setup
1826 genericBuild /nix/store/an9g93vg5b02j74y38zfajswa0f10p2z-stdenv-linux/setup
1 source /nix/store/shkw4qm9qcw5sc5n1k5jznc83ny02r39-default-builder.sh
3 main /nix/store/l622p70vy8k5sh7y5wizi5f2mic6ynpg-source-stdenv.sh
20 succeeded
succeeded attributes
status attribute duration
loading…
226 already built
skipped attributes
status attribute duration
loading…