nixbot

builds

Mic92/dotfiles build #843 failed

branch main · PR #6032 · commit d31b3782e9 · · took 1h 44m · eval 1m 20s

10 failed
failed attributes
status attribute duration
failed checks.aarch64-darwin.home-manager-macos 2m 25s
herdr-0.9.5: @compileError(std.fmt.comptimePrint( ^~~~~~~~~~~~~ build.zig:16:24: note: called at comptime here buildpkg.requireZig(m …
herdr-0.9.5:
          @compileError(std.fmt.comptimePrint(
          ^~~~~~~~~~~~~
  build.zig:16:24: note: called at comptime here
      buildpkg.requireZig(minimum_zig_version);
      ~~~~~~~~~~~~~~~~~~~^~~~~~~~~~~~~~~~~~~~~
  thread 'main' (69232077) panicked at crates/ghostty-vt/build.rs:112:5:
  zig build for vendored libghostty-vt failed: exit status: 1. Building Herdr requires Zig 0.16.0; check `zig version` or set ZIG to the path of a Zig 0.16.0 binary, then retry
  note: run with `RUST_BACKTRACE=1` environment variable to display a backtrace
failed checks.aarch64-darwin.home-manager-utm-vm 1m 17s
herdr-0.9.5: @compileError(std.fmt.comptimePrint( ^~~~~~~~~~~~~ build.zig:16:24: note: called at comptime here buildpkg.requireZig(m …
herdr-0.9.5:
          @compileError(std.fmt.comptimePrint(
          ^~~~~~~~~~~~~
  build.zig:16:24: note: called at comptime here
      buildpkg.requireZig(minimum_zig_version);
      ~~~~~~~~~~~~~~~~~~~^~~~~~~~~~~~~~~~~~~~~
  thread 'main' (69222374) panicked at crates/ghostty-vt/build.rs:112:5:
  zig build for vendored libghostty-vt failed: exit status: 1. Building Herdr requires Zig 0.16.0; check `zig version` or set ZIG to the path of a Zig 0.16.0 binary, then retry
  note: run with `RUST_BACKTRACE=1` environment variable to display a backtrace
failed checks.aarch64-linux.home-manager-utm-vm 49m 18s
herdr-0.9.5: @compileError(std.fmt.comptimePrint( ^~~~~~~~~~~~~ build.zig:16:24: note: called at comptime here buildpkg.requireZig(m …
herdr-0.9.5:
          @compileError(std.fmt.comptimePrint(
          ^~~~~~~~~~~~~
  build.zig:16:24: note: called at comptime here
      buildpkg.requireZig(minimum_zig_version);
      ~~~~~~~~~~~~~~~~~~~^~~~~~~~~~~~~~~~~~~~~
  thread 'main' (1912) panicked at crates/ghostty-vt/build.rs:112:5:
  zig build for vendored libghostty-vt failed: exit status: 1. Building Herdr requires Zig 0.16.0; check `zig version` or set ZIG to the path of a Zig 0.16.0 binary, then retry
  note: run with `RUST_BACKTRACE=1` environment variable to display a backtrace

python3.14-nixbot-cli:
264 _callImplicitHook /nix/store/49cnv1lz3hiybz55z8lm8i401iqrpqyw-stdenv-linux/setup
281 _eval /nix/store/49cnv1lz3hiybz55z8lm8i401iqrpqyw-stdenv-linux/setup
220 runHook /nix/store/49cnv1lz3hiybz55z8lm8i401iqrpqyw-stdenv-linux/setup
1666 fixupPhase /nix/store/49cnv1lz3hiybz55z8lm8i401iqrpqyw-stdenv-linux/setup
1771 runPhase /nix/store/49cnv1lz3hiybz55z8lm8i401iqrpqyw-stdenv-linux/setup
1826 genericBuild /nix/store/49cnv1lz3hiybz55z8lm8i401iqrpqyw-stdenv-linux/setup
1 source /nix/store/shkw4qm9qcw5sc5n1k5jznc83ny02r39-default-builder.sh
3 main /nix/store/l622p70vy8k5sh7y5wizi5f2mic6ynpg-source-stdenv.sh
failed checks.aarch64-linux.nixos-blob64 1m 14s
borgbackup-1.4.5: raise SphinxError( ...<5 lines>... ) from exc sphinx.errors.SphinxError: Builder name singlehtml man not registere …
borgbackup-1.4.5:
        raise SphinxError(
        ...<5 lines>...
        ) from exc
    sphinx.errors.SphinxError: Builder name singlehtml man not registered or available through entry point
The full traceback has been saved in:
/build/sphinx-err-zkx2ljss.log
To report this error to the developers, please open an issue at <https://github.com/sphinx-doc/sphinx/issues/>. Thanks!
Please also report this if it was a user error, so that a better error message can be provided next time.
failed checks.x86_64-linux.home-manager-coder 1h 36m
python3.14-nixbot-cli: 264 _callImplicitHook /nix/store/an9g93vg5b02j74y38zfajswa0f10p2z-stdenv-linux/setup 281 _eval /nix/store/an9g93vg5b02j74y38zfajswa0f10p2 …
python3.14-nixbot-cli:
264 _callImplicitHook /nix/store/an9g93vg5b02j74y38zfajswa0f10p2z-stdenv-linux/setup
281 _eval /nix/store/an9g93vg5b02j74y38zfajswa0f10p2z-stdenv-linux/setup
220 runHook /nix/store/an9g93vg5b02j74y38zfajswa0f10p2z-stdenv-linux/setup
1666 fixupPhase /nix/store/an9g93vg5b02j74y38zfajswa0f10p2z-stdenv-linux/setup
1771 runPhase /nix/store/an9g93vg5b02j74y38zfajswa0f10p2z-stdenv-linux/setup
1826 genericBuild /nix/store/an9g93vg5b02j74y38zfajswa0f10p2z-stdenv-linux/setup
1 source /nix/store/shkw4qm9qcw5sc5n1k5jznc83ny02r39-default-builder.sh
3 main /nix/store/l622p70vy8k5sh7y5wizi5f2mic6ynpg-source-stdenv.sh

herdr-0.9.5:
          @compileError(std.fmt.comptimePrint(
          ^~~~~~~~~~~~~
  build.zig:16:24: note: called at comptime here
      buildpkg.requireZig(minimum_zig_version);
      ~~~~~~~~~~~~~~~~~~~^~~~~~~~~~~~~~~~~~~~~
  thread 'main' (1905) panicked at crates/ghostty-vt/build.rs:112:5:
  zig build for vendored libghostty-vt failed: exit status: 1. Building Herdr requires Zig 0.16.0; check `zig version` or set ZIG to the path of a Zig 0.16.0 binary, then retry
  note: run with `RUST_BACKTRACE=1` environment variable to display a backtrace
failed checks.x86_64-linux.home-manager-eve 1h 36m
herdr-0.9.5: @compileError(std.fmt.comptimePrint( ^~~~~~~~~~~~~ build.zig:16:24: note: called at comptime here buildpkg.requireZig(m …
herdr-0.9.5:
          @compileError(std.fmt.comptimePrint(
          ^~~~~~~~~~~~~
  build.zig:16:24: note: called at comptime here
      buildpkg.requireZig(minimum_zig_version);
      ~~~~~~~~~~~~~~~~~~~^~~~~~~~~~~~~~~~~~~~~
  thread 'main' (1871) panicked at crates/ghostty-vt/build.rs:112:5:
  zig build for vendored libghostty-vt failed: exit status: 1. Building Herdr requires Zig 0.16.0; check `zig version` or set ZIG to the path of a Zig 0.16.0 binary, then retry
  note: run with `RUST_BACKTRACE=1` environment variable to display a backtrace

python3.14-nixbot-cli:
264 _callImplicitHook /nix/store/an9g93vg5b02j74y38zfajswa0f10p2z-stdenv-linux/setup
281 _eval /nix/store/an9g93vg5b02j74y38zfajswa0f10p2z-stdenv-linux/setup
220 runHook /nix/store/an9g93vg5b02j74y38zfajswa0f10p2z-stdenv-linux/setup
1666 fixupPhase /nix/store/an9g93vg5b02j74y38zfajswa0f10p2z-stdenv-linux/setup
1771 runPhase /nix/store/an9g93vg5b02j74y38zfajswa0f10p2z-stdenv-linux/setup
1826 genericBuild /nix/store/an9g93vg5b02j74y38zfajswa0f10p2z-stdenv-linux/setup
1 source /nix/store/shkw4qm9qcw5sc5n1k5jznc83ny02r39-default-builder.sh
3 main /nix/store/l622p70vy8k5sh7y5wizi5f2mic6ynpg-source-stdenv.sh
failed checks.x86_64-linux.home-manager-utm-vm 1h 36m
python3.14-nixbot-cli: 264 _callImplicitHook /nix/store/an9g93vg5b02j74y38zfajswa0f10p2z-stdenv-linux/setup 281 _eval /nix/store/an9g93vg5b02j74y38zfajswa0f10p2 …
python3.14-nixbot-cli:
264 _callImplicitHook /nix/store/an9g93vg5b02j74y38zfajswa0f10p2z-stdenv-linux/setup
281 _eval /nix/store/an9g93vg5b02j74y38zfajswa0f10p2z-stdenv-linux/setup
220 runHook /nix/store/an9g93vg5b02j74y38zfajswa0f10p2z-stdenv-linux/setup
1666 fixupPhase /nix/store/an9g93vg5b02j74y38zfajswa0f10p2z-stdenv-linux/setup
1771 runPhase /nix/store/an9g93vg5b02j74y38zfajswa0f10p2z-stdenv-linux/setup
1826 genericBuild /nix/store/an9g93vg5b02j74y38zfajswa0f10p2z-stdenv-linux/setup
1 source /nix/store/shkw4qm9qcw5sc5n1k5jznc83ny02r39-default-builder.sh
3 main /nix/store/l622p70vy8k5sh7y5wizi5f2mic6ynpg-source-stdenv.sh

herdr-0.9.5:
          @compileError(std.fmt.comptimePrint(
          ^~~~~~~~~~~~~
  build.zig:16:24: note: called at comptime here
      buildpkg.requireZig(minimum_zig_version);
      ~~~~~~~~~~~~~~~~~~~^~~~~~~~~~~~~~~~~~~~~
  thread 'main' (1863) panicked at crates/ghostty-vt/build.rs:112:5:
  zig build for vendored libghostty-vt failed: exit status: 1. Building Herdr requires Zig 0.16.0; check `zig version` or set ZIG to the path of a Zig 0.16.0 binary, then retry
  note: run with `RUST_BACKTRACE=1` environment variable to display a backtrace
failed checks.x86_64-linux.nixos-eva 2m 0s
borgbackup-1.4.5: raise SphinxError( ...<5 lines>... ) from exc sphinx.errors.SphinxError: Builder name singlehtml man not registere …
borgbackup-1.4.5:
        raise SphinxError(
        ...<5 lines>...
        ) from exc
    sphinx.errors.SphinxError: Builder name singlehtml man not registered or available through entry point
The full traceback has been saved in:
/build/sphinx-err-74ky5z3d.log
To report this error to the developers, please open an issue at <https://github.com/sphinx-doc/sphinx/issues/>. Thanks!
Please also report this if it was a user error, so that a better error message can be provided next time.
failed checks.x86_64-linux.nixos-eve 1h 3m
linux-7.2.11-modules: tribuchet: building on jamie structuredAttrs is enabled created 346 symlinks in user environment structuredAttrs is enabled kernel version …
linux-7.2.11-modules:
tribuchet: building on jamie
structuredAttrs is enabled
created 346 symlinks in user environment
structuredAttrs is enabled
kernel version is 7.2.11
cat: updates/scap.ko.cer: No such file or directory

borgbackup-1.4.5:
        raise SphinxError(
        ...<5 lines>...
        ) from exc
    sphinx.errors.SphinxError: Builder name singlehtml man not registered or available through entry point
The full traceback has been saved in:
/build/sphinx-err-dxp85ww7.log
To report this error to the developers, please open an issue at <https://github.com/sphinx-doc/sphinx/issues/>. Thanks!
Please also report this if it was a user error, so that a better error message can be provided next time.
failed checks.x86_64-linux.nixos-matchbox 1m 47s
borgbackup-1.4.5: raise SphinxError( ...<5 lines>... ) from exc sphinx.errors.SphinxError: Builder name singlehtml man not registere …
borgbackup-1.4.5:
        raise SphinxError(
        ...<5 lines>...
        ) from exc
    sphinx.errors.SphinxError: Builder name singlehtml man not registered or available through entry point
The full traceback has been saved in:
/build/sphinx-err-azrqxrmp.log
To report this error to the developers, please open an issue at <https://github.com/sphinx-doc/sphinx/issues/>. Thanks!
Please also report this if it was a user error, so that a better error message can be provided next time.
5 cancelled
cancelled attributes
status attribute duration
loading…
19 succeeded
succeeded attributes
status attribute duration
loading…
231 already built
skipped attributes
status attribute duration
loading…