nixbot

builds

Mic92/mics-n8n-nodes build #28 failed

branch main · PR #56 · commit b8a6fba3b1 · · took 38s · eval 7s

eval warnings 1 kind · 5 occurrences
  • warn Nixpkgs 26.05 will be the last release to support x86_64-darwin; see https://nixos.org/… ×5

18 failed
failed attributes
status attribute duration
failed checks.aarch64-darwin.n8n-nodes-caldav 26s
n8n-nodes-caldav-1.0.0: tsconfig.json(3,3): error TS5108: Option 'moduleResolution=node10' has been removed. Please remove it from your configuration. npm error …
n8n-nodes-caldav-1.0.0:
tsconfig.json(3,3): error TS5108: Option 'moduleResolution=node10' has been removed. Please remove it from your configuration.
npm error Lifecycle script `build` failed with error:
npm error code 2
npm error path /private/var/tb/1/scratch/b67f96e12b4c9239/build/source/packages/n8n-nodes-caldav
npm error workspace n8n-nodes-caldav@1.0.0
npm error location /private/var/tb/1/scratch/b67f96e12b4c9239/build/source/packages/n8n-nodes-caldav
npm error command failed
npm error command sh -c tsc && find nodes -name '*.svg' -o -name '*.node.json' | while read f; do cp "$f" "dist/$f"; done
failed checks.aarch64-darwin.n8n-nodes-github-notifications 26s
n8n-nodes-github-notifications-1.0.0: tsconfig.json(3,3): error TS5108: Option 'moduleResolution=node10' has been removed. Please remove it from your configurat …
n8n-nodes-github-notifications-1.0.0:
tsconfig.json(3,3): error TS5108: Option 'moduleResolution=node10' has been removed. Please remove it from your configuration.
npm error Lifecycle script `build` failed with error:
npm error code 2
npm error path /private/var/tb/6/scratch/b9cf93d1c66bb6d1/build/source/packages/n8n-nodes-github-notifications
npm error workspace n8n-nodes-github-notifications@1.0.0
npm error location /private/var/tb/6/scratch/b9cf93d1c66bb6d1/build/source/packages/n8n-nodes-github-notifications
npm error command failed
npm error command sh -c tsc && find nodes -name '*.svg' -o -name '*.node.json' | while read f; do cp "$f" "dist/$f"; done
failed checks.aarch64-darwin.n8n-nodes-imap 27s
n8n-nodes-imap-1.0.0: tsconfig.json(3,3): error TS5108: Option 'moduleResolution=node10' has been removed. Please remove it from your configuration. npm error L …
n8n-nodes-imap-1.0.0:
tsconfig.json(3,3): error TS5108: Option 'moduleResolution=node10' has been removed. Please remove it from your configuration.
npm error Lifecycle script `build` failed with error:
npm error code 2
npm error path /private/var/tb/8/scratch/29d1d64c6bd3809b/build/source/packages/n8n-nodes-imap
npm error workspace n8n-nodes-imap@1.0.0
npm error location /private/var/tb/8/scratch/29d1d64c6bd3809b/build/source/packages/n8n-nodes-imap
npm error command failed
npm error command sh -c tsc && find nodes -name '*.svg' -o -name '*.node.json' | while read f; do cp "$f" "dist/$f"; done
failed checks.aarch64-darwin.n8n-nodes-kagi 27s
n8n-nodes-kagi-1.0.0: tsconfig.json(3,3): error TS5108: Option 'moduleResolution=node10' has been removed. Please remove it from your configuration. npm error L …
n8n-nodes-kagi-1.0.0:
tsconfig.json(3,3): error TS5108: Option 'moduleResolution=node10' has been removed. Please remove it from your configuration.
npm error Lifecycle script `build` failed with error:
npm error code 2
npm error path /private/var/tb/3/scratch/2fdc24579bbd47e5/build/source/packages/n8n-nodes-kagi
npm error workspace n8n-nodes-kagi@1.0.0
npm error location /private/var/tb/3/scratch/2fdc24579bbd47e5/build/source/packages/n8n-nodes-kagi
npm error command failed
npm error command sh -c tsc && find nodes -name '*.svg' -o -name '*.node.json' | while read f; do cp "$f" "dist/$f"; done
failed checks.aarch64-darwin.n8n-nodes-nostr 25s
n8n-nodes-nostr-1.0.0: tsconfig.json(3,3): error TS5108: Option 'moduleResolution=node10' has been removed. Please remove it from your configuration. npm error …
n8n-nodes-nostr-1.0.0:
tsconfig.json(3,3): error TS5108: Option 'moduleResolution=node10' has been removed. Please remove it from your configuration.
npm error Lifecycle script `build` failed with error:
npm error code 2
npm error path /private/var/tb/4/scratch/5215ea9447705c2b/build/source/packages/n8n-nodes-nostr
npm error workspace n8n-nodes-nostr@1.0.0
npm error location /private/var/tb/4/scratch/5215ea9447705c2b/build/source/packages/n8n-nodes-nostr
npm error command failed
npm error command sh -c tsc && find nodes -name '*.svg' -o -name '*.node.json' | while read f; do cp "$f" "dist/$f"; done
failed checks.aarch64-darwin.n8n-nodes-opencrow 26s
n8n-nodes-opencrow-1.0.0: tsconfig.json(3,3): error TS5108: Option 'moduleResolution=node10' has been removed. Please remove it from your configuration. npm err …
n8n-nodes-opencrow-1.0.0:
tsconfig.json(3,3): error TS5108: Option 'moduleResolution=node10' has been removed. Please remove it from your configuration.
npm error Lifecycle script `build` failed with error:
npm error code 2
npm error path /private/var/tb/2/scratch/988a038da89b4420/build/source/packages/n8n-nodes-opencrow
npm error workspace n8n-nodes-opencrow@1.0.0
npm error location /private/var/tb/2/scratch/988a038da89b4420/build/source/packages/n8n-nodes-opencrow
npm error command failed
npm error command sh -c tsc && find nodes -name '*.svg' -o -name '*.node.json' | while read f; do cp "$f" "dist/$f"; done
failed checks.aarch64-linux.n8n-nodes-caldav 29s
n8n-nodes-caldav-1.0.0: tsconfig.json(3,3): error TS5108: Option 'moduleResolution=node10' has been removed. Please remove it from your configuration. npm error …
n8n-nodes-caldav-1.0.0:
tsconfig.json(3,3): error TS5108: Option 'moduleResolution=node10' has been removed. Please remove it from your configuration.
npm error Lifecycle script `build` failed with error:
npm error code 2
npm error path /build/source/packages/n8n-nodes-caldav
npm error workspace n8n-nodes-caldav@1.0.0
npm error location /build/source/packages/n8n-nodes-caldav
npm error command failed
npm error command sh -c tsc && find nodes -name '*.svg' -o -name '*.node.json' | while read f; do cp "$f" "dist/$f"; done
failed checks.aarch64-linux.n8n-nodes-github-notifications 29s
n8n-nodes-github-notifications-1.0.0: tsconfig.json(3,3): error TS5108: Option 'moduleResolution=node10' has been removed. Please remove it from your configurat …
n8n-nodes-github-notifications-1.0.0:
tsconfig.json(3,3): error TS5108: Option 'moduleResolution=node10' has been removed. Please remove it from your configuration.
npm error Lifecycle script `build` failed with error:
npm error code 2
npm error path /build/source/packages/n8n-nodes-github-notifications
npm error workspace n8n-nodes-github-notifications@1.0.0
npm error location /build/source/packages/n8n-nodes-github-notifications
npm error command failed
npm error command sh -c tsc && find nodes -name '*.svg' -o -name '*.node.json' | while read f; do cp "$f" "dist/$f"; done
failed checks.aarch64-linux.n8n-nodes-imap 29s
n8n-nodes-imap-1.0.0: tsconfig.json(3,3): error TS5108: Option 'moduleResolution=node10' has been removed. Please remove it from your configuration. npm error L …
n8n-nodes-imap-1.0.0:
tsconfig.json(3,3): error TS5108: Option 'moduleResolution=node10' has been removed. Please remove it from your configuration.
npm error Lifecycle script `build` failed with error:
npm error code 2
npm error path /build/source/packages/n8n-nodes-imap
npm error workspace n8n-nodes-imap@1.0.0
npm error location /build/source/packages/n8n-nodes-imap
npm error command failed
npm error command sh -c tsc && find nodes -name '*.svg' -o -name '*.node.json' | while read f; do cp "$f" "dist/$f"; done
failed checks.aarch64-linux.n8n-nodes-kagi 29s
n8n-nodes-kagi-1.0.0: tsconfig.json(3,3): error TS5108: Option 'moduleResolution=node10' has been removed. Please remove it from your configuration. npm error L …
n8n-nodes-kagi-1.0.0:
tsconfig.json(3,3): error TS5108: Option 'moduleResolution=node10' has been removed. Please remove it from your configuration.
npm error Lifecycle script `build` failed with error:
npm error code 2
npm error path /build/source/packages/n8n-nodes-kagi
npm error workspace n8n-nodes-kagi@1.0.0
npm error location /build/source/packages/n8n-nodes-kagi
npm error command failed
npm error command sh -c tsc && find nodes -name '*.svg' -o -name '*.node.json' | while read f; do cp "$f" "dist/$f"; done
failed checks.aarch64-linux.n8n-nodes-nostr 29s
n8n-nodes-nostr-1.0.0: tsconfig.json(3,3): error TS5108: Option 'moduleResolution=node10' has been removed. Please remove it from your configuration. npm error …
n8n-nodes-nostr-1.0.0:
tsconfig.json(3,3): error TS5108: Option 'moduleResolution=node10' has been removed. Please remove it from your configuration.
npm error Lifecycle script `build` failed with error:
npm error code 2
npm error path /build/source/packages/n8n-nodes-nostr
npm error workspace n8n-nodes-nostr@1.0.0
npm error location /build/source/packages/n8n-nodes-nostr
npm error command failed
npm error command sh -c tsc && find nodes -name '*.svg' -o -name '*.node.json' | while read f; do cp "$f" "dist/$f"; done
failed checks.aarch64-linux.n8n-nodes-opencrow 27s
n8n-nodes-opencrow-1.0.0: tsconfig.json(3,3): error TS5108: Option 'moduleResolution=node10' has been removed. Please remove it from your configuration. npm err …
n8n-nodes-opencrow-1.0.0:
tsconfig.json(3,3): error TS5108: Option 'moduleResolution=node10' has been removed. Please remove it from your configuration.
npm error Lifecycle script `build` failed with error:
npm error code 2
npm error path /build/source/packages/n8n-nodes-opencrow
npm error workspace n8n-nodes-opencrow@1.0.0
npm error location /build/source/packages/n8n-nodes-opencrow
npm error command failed
npm error command sh -c tsc && find nodes -name '*.svg' -o -name '*.node.json' | while read f; do cp "$f" "dist/$f"; done
failed checks.x86_64-linux.n8n-nodes-caldav 26s
n8n-nodes-caldav-1.0.0: tsconfig.json(3,3): error TS5108: Option 'moduleResolution=node10' has been removed. Please remove it from your configuration. npm error …
n8n-nodes-caldav-1.0.0:
tsconfig.json(3,3): error TS5108: Option 'moduleResolution=node10' has been removed. Please remove it from your configuration.
npm error Lifecycle script `build` failed with error:
npm error code 2
npm error path /build/source/packages/n8n-nodes-caldav
npm error workspace n8n-nodes-caldav@1.0.0
npm error location /build/source/packages/n8n-nodes-caldav
npm error command failed
npm error command sh -c tsc && find nodes -name '*.svg' -o -name '*.node.json' | while read f; do cp "$f" "dist/$f"; done
failed checks.x86_64-linux.n8n-nodes-github-notifications 26s
n8n-nodes-github-notifications-1.0.0: tsconfig.json(3,3): error TS5108: Option 'moduleResolution=node10' has been removed. Please remove it from your configurat …
n8n-nodes-github-notifications-1.0.0:
tsconfig.json(3,3): error TS5108: Option 'moduleResolution=node10' has been removed. Please remove it from your configuration.
npm error Lifecycle script `build` failed with error:
npm error code 2
npm error path /build/source/packages/n8n-nodes-github-notifications
npm error workspace n8n-nodes-github-notifications@1.0.0
npm error location /build/source/packages/n8n-nodes-github-notifications
npm error command failed
npm error command sh -c tsc && find nodes -name '*.svg' -o -name '*.node.json' | while read f; do cp "$f" "dist/$f"; done
failed checks.x86_64-linux.n8n-nodes-imap 21s
n8n-nodes-imap-1.0.0: tsconfig.json(3,3): error TS5108: Option 'moduleResolution=node10' has been removed. Please remove it from your configuration. npm error L …
n8n-nodes-imap-1.0.0:
tsconfig.json(3,3): error TS5108: Option 'moduleResolution=node10' has been removed. Please remove it from your configuration.
npm error Lifecycle script `build` failed with error:
npm error code 2
npm error path /build/source/packages/n8n-nodes-imap
npm error workspace n8n-nodes-imap@1.0.0
npm error location /build/source/packages/n8n-nodes-imap
npm error command failed
npm error command sh -c tsc && find nodes -name '*.svg' -o -name '*.node.json' | while read f; do cp "$f" "dist/$f"; done
failed checks.x86_64-linux.n8n-nodes-kagi 26s
n8n-nodes-kagi-1.0.0: tsconfig.json(3,3): error TS5108: Option 'moduleResolution=node10' has been removed. Please remove it from your configuration. npm error L …
n8n-nodes-kagi-1.0.0:
tsconfig.json(3,3): error TS5108: Option 'moduleResolution=node10' has been removed. Please remove it from your configuration.
npm error Lifecycle script `build` failed with error:
npm error code 2
npm error path /build/source/packages/n8n-nodes-kagi
npm error workspace n8n-nodes-kagi@1.0.0
npm error location /build/source/packages/n8n-nodes-kagi
npm error command failed
npm error command sh -c tsc && find nodes -name '*.svg' -o -name '*.node.json' | while read f; do cp "$f" "dist/$f"; done
failed checks.x86_64-linux.n8n-nodes-nostr 26s
n8n-nodes-nostr-1.0.0: tsconfig.json(3,3): error TS5108: Option 'moduleResolution=node10' has been removed. Please remove it from your configuration. npm error …
n8n-nodes-nostr-1.0.0:
tsconfig.json(3,3): error TS5108: Option 'moduleResolution=node10' has been removed. Please remove it from your configuration.
npm error Lifecycle script `build` failed with error:
npm error code 2
npm error path /build/source/packages/n8n-nodes-nostr
npm error workspace n8n-nodes-nostr@1.0.0
npm error location /build/source/packages/n8n-nodes-nostr
npm error command failed
npm error command sh -c tsc && find nodes -name '*.svg' -o -name '*.node.json' | while read f; do cp "$f" "dist/$f"; done
failed checks.x86_64-linux.n8n-nodes-opencrow 31s
n8n-nodes-opencrow-1.0.0: tsconfig.json(3,3): error TS5108: Option 'moduleResolution=node10' has been removed. Please remove it from your configuration. npm err …
n8n-nodes-opencrow-1.0.0:
tsconfig.json(3,3): error TS5108: Option 'moduleResolution=node10' has been removed. Please remove it from your configuration.
npm error Lifecycle script `build` failed with error:
npm error code 2
npm error path /build/source/packages/n8n-nodes-opencrow
npm error workspace n8n-nodes-opencrow@1.0.0
npm error location /build/source/packages/n8n-nodes-opencrow
npm error command failed
npm error command sh -c tsc && find nodes -name '*.svg' -o -name '*.node.json' | while read f; do cp "$f" "dist/$f"; done
3 succeeded
succeeded attributes
status attribute duration
loading…
3 already built
skipped attributes
status attribute duration
loading…