this derivation will be built: /nix/store/7kd676hfgnyq63sqjfnk68jwiidjd1sj-queue-0.1.0.drv error: build of '/nix/store/7kd676hfgnyq63sqjfnk68jwiidjd1sj-queue-0.1.0.drv' on 'ssh-ng://customer@mac02' failed: Cannot build '/nix/store/7kd676hfgnyq63sqjfnk68jwiidjd1sj-queue-0.1.0.drv'. Reason: builder failed with exit code 101. Output paths: /nix/store/24xdjaycw8bjsgxsrwd6rzkk2ys84lyq-queue-0.1.0 Last 25 log lines: > test task_ids_are_not_reused ... FAILED > > failures: > > ---- old_delivered_tasks_are_cleaned stdout ---- > > thread 'old_delivered_tasks_are_cleaned' (126981378) panicked at tests/ids.rs:50:9: > queue run failed: queue: pueue daemon did not come up within 5s > > note: run with `RUST_BACKTRACE=1` environment variable to display a backtrace > > ---- task_ids_are_not_reused stdout ---- > > thread 'task_ids_are_not_reused' (126981379) panicked at tests/ids.rs:50:9: > queue run failed: queue: pueue daemon did not come up within 5s > > > > failures: > old_delivered_tasks_are_cleaned > task_ids_are_not_reused > > test result: FAILED. 0 passed; 2 failed; 0 ignored; 0 measured; 0 filtered out; finished in 10.89s > > error: test failed, to rerun pass `--test ids` For full logs, run: nix log /nix/store/7kd676hfgnyq63sqjfnk68jwiidjd1sj-queue-0.1.0.drv error: Cannot build '/nix/store/7kd676hfgnyq63sqjfnk68jwiidjd1sj-queue-0.1.0.drv'. Reason: builder failed with exit code 1. Output paths: /nix/store/24xdjaycw8bjsgxsrwd6rzkk2ys84lyq-queue-0.1.0