nixbot

builds
unpackPhase
1unpacking source archive /nix/store/k0l72jazfli0kdzlm0j3jy7gff9276hj-source2source root is source3Executing cargoSetupPostUnpackHook4Finished cargoSetupPostUnpackHook
patchPhase
5Executing cargoSetupPostPatchHook6Validating consistency between /nix/var/nix/builds/nix-14113-2297095387/source/Cargo.lock and /nix/var/nix/builds/nix-14113-2297095387/cargo-vendor-dir/Cargo.lock7Finished cargoSetupPostPatchHook
buildPhase
8Executing cargoBuildHook9cargoBuildHook flags: -j 10 --target aarch64-apple-darwin --offline --profile release10 Compiling proc-macro2 v1.0.10711 Compiling quote v1.0.4712 Compiling unicode-ident v1.0.2413 Compiling libc v0.2.18914 Compiling cfg-if v1.0.415 Compiling shlex v2.0.116 Compiling find-msvc-tools v0.1.1017 Compiling serde_core v1.0.22918 Compiling serde v1.0.22919 Compiling zerocopy v0.8.5620 Compiling autocfg v1.5.121 Compiling cc v1.4.222 Compiling untrusted v0.9.023 Compiling zeroize v1.9.024 Compiling once_cell v1.21.425 Compiling rustls-pki-types v1.15.126 Compiling num-traits v0.2.1927 Compiling rustls v0.23.4328 Compiling getrandom v0.4.329 Compiling rand_core v0.10.130 Compiling zmij v1.0.2331 Compiling bitflags v2.13.132 Compiling option-ext v0.2.033 Compiling objc2-core-foundation v0.3.234 Compiling ring v0.17.1435 Compiling getrandom v0.2.1736 Compiling dirs-sys v0.5.037 Compiling hashbrown v0.17.138 Compiling heck v0.5.039 Compiling core-foundation-sys v0.8.740 Compiling equivalent v1.0.241 Compiling ciborium-io v0.2.242 Compiling thiserror v2.0.2043 Compiling serde_json v1.0.15144 Compiling log v0.4.3345 Compiling itoa v1.0.1846 Compiling subtle v2.6.147 Compiling indexmap v2.14.048 Compiling iana-time-zone v0.1.6549 Compiling objc2-system-configuration v0.3.250 Compiling dirs v6.0.051 Compiling chacha20 v0.10.152 Compiling tracing-core v0.1.3653 Compiling syn v2.0.11954 Compiling syn v3.0.355 Compiling pin-project-lite v0.2.1756 Compiling ryu v1.0.2357 Compiling memchr v2.8.358 Compiling unsafe-libyaml v0.2.1159 Compiling rand v0.10.260 Compiling shellexpand v3.1.261 Compiling whoami v2.1.262 Compiling byteorder v1.5.063 Compiling lexopt v0.3.264 Compiling serde_derive v1.0.22965 Compiling thiserror-impl v2.0.2066 Compiling zerocopy-derive v0.8.5667 Compiling tracing-attributes v0.1.3168 Compiling strum_macros v0.28.069 Compiling tracing v0.1.4470 Compiling strum v0.28.071 Compiling serde_yaml v0.9.34+deprecated72 Compiling chrono v0.4.4573 Compiling half v2.7.174 Compiling ciborium-ll v0.2.275 Compiling ciborium v0.2.276 Compiling rustls-webpki v0.103.1377 Compiling rustls-connector v0.22.278 Compiling pueue-lib v0.31.179 Compiling queue v0.1.0 (/nix/var/nix/builds/nix-14113-2297095387/source)80 Finished `release` profile [optimized] target(s) in 14.52s81Executing cargoInstallPostBuildHook82Finished cargoInstallPostBuildHook83Finished cargoBuildHook
checkPhase
84Executing cargoCheckHook85cargoCheckHook flags: -j 10 --profile release --target aarch64-apple-darwin --offline --86 Compiling queue v0.1.0 (/nix/var/nix/builds/nix-14113-2297095387/source)87 Finished `release` profile [optimized] target(s) in 0.30s88 Running unittests src/main.rs (target/aarch64-apple-darwin/release/deps/queue-efa4cf5dd634ac0c)8990running 0 tests9192test result: ok. 0 passed; 0 failed; 0 ignored; 0 measured; 0 filtered out; finished in 0.00s9394 Running tests/ids.rs (target/aarch64-apple-darwin/release/deps/ids-2238528106e8d178)9596running 2 tests97test old_delivered_tasks_are_cleaned ... FAILED98test task_ids_are_not_reused ... FAILED99100failures:101102---- old_delivered_tasks_are_cleaned stdout ----103104thread 'old_delivered_tasks_are_cleaned' (126981378) panicked at tests/ids.rs:50:9:105queue run failed: queue: pueue daemon did not come up within 5s106107note: run with `RUST_BACKTRACE=1` environment variable to display a backtrace108109---- task_ids_are_not_reused stdout ----110111thread 'task_ids_are_not_reused' (126981379) panicked at tests/ids.rs:50:9:112queue run failed: queue: pueue daemon did not come up within 5s113114115116failures:117 old_delivered_tasks_are_cleaned118 task_ids_are_not_reused119120test result: FAILED. 0 passed; 2 failed; 0 ignored; 0 measured; 0 filtered out; finished in 10.89s121122error: test failed, to rerun pass `--test ids`