nixbot

builds

Mic92/niks3 build #263 failed

branch maiao.I5f3871678e2523ab374244d3f085f83fcdb8249b · PR #527 · commit f10685141c · · took 2m 12s · eval 18s

2 failed
failed attributes
status attribute duration
failed checks.aarch64-darwin.go-unit-tests 2s
niks3-go-unit-tests: --- PASS: TestCaseHackSuffix (0.05s) --- PASS: TestDumpPathMatchesNix (0.08s) === NAME TestStreamPushBatchesUnderLoad streampush_test. …
niks3-go-unit-tests:
--- PASS: TestCaseHackSuffix (0.05s)
--- PASS: TestDumpPathMatchesNix (0.08s)
=== NAME  TestStreamPushBatchesUnderLoad
    streampush_test.go:170: batches = [[/nix/store/first] [/nix/store/x] [/nix/store/y /nix/store/z]], want [first] then [x y z]
--- FAIL: TestStreamPushBatchesUnderLoad (0.10s)
--- PASS: TestUploadMultipart_PartsInParallel (0.61s)
--- PASS: TestRateLimiterFeedback_400DoesNotCountAsSuccess (1.00s)
FAIL
failed checks.x86_64-linux.go-unit-tests 33s
niks3-go-unit-tests: --- FAIL: TestStreamPushBatchesUnderLoad (0.10s) --- PASS: TestRegisterUploadedObjectReusesConnections (0.03s) --- PASS: TestCaseHackSuffix …
niks3-go-unit-tests:
--- FAIL: TestStreamPushBatchesUnderLoad (0.10s)
--- PASS: TestRegisterUploadedObjectReusesConnections (0.03s)
--- PASS: TestCaseHackSuffix (0.10s)
--- PASS: TestDumpPathWriterError (0.11s)
--- PASS: TestDumpPathMatchesNix (0.16s)
--- PASS: TestUploadMultipart_PartsInParallel (0.69s)
--- PASS: TestRateLimiterFeedback_400DoesNotCountAsSuccess (1.00s)
FAIL
24 succeeded
succeeded attributes
status attribute duration
loading…
21 already built
skipped attributes
status attribute duration
loading…