nixbot

builds

Mic92/nix-grpc-store build #121 failed

branch farm/robustness · PR #48 · commit a1ca74768d · · took 4m 16s · eval 22s

eval warnings 1 kind · 4 occurrences
  • warn getExe: Package "niks3-1.10.1" does not have the meta.mainProgram attribute. We'll assume that the main program has the same name for now, but this behavior is deprecated, because it leads to surprising errors when the assumption does not hold. If the package has a main program, please set `meta.mainProgram` in its definition to make this warning go away. Otherwise, if the package does not have a main program, or if you don't control its definition, use getExe' to specify the name to the progra… ×4

3 failed
failed attributes
status attribute duration
failed checks.aarch64-darwin.clang-tidy 2m 26s
nix-grpc-store-clang-tidy-0.1.0: 76 | if (pos < value.size() && value[pos] == ',') { | ^~~~~ ../src/xfcc …
nix-grpc-store-clang-tidy-0.1.0:
   76 |         if (pos < value.size() && value[pos] == ',') {
      |                                        ^~~~~
../src/xfcc.hh:116:9: error: replace loop by 'std::ranges::any_of()' [readability-use-anyofallof,-warnings-as-errors]
  116 |         for (const auto & pattern : patterns) {
      |         ^
FAILED: [code=1] meson-internal__clang-tidy 
/nix/store/735yy09gy9j1wzwrsd1v1xrgf6izyr5d-meson-1.10.2/bin/meson --internal clangtidy /nix/var/nix/builds/nix-74558-3314372736/source /nix/var/nix/builds/nix-74558-3314372736/source/build --color always
ninja: build stopped: subcommand failed.
failed checks.aarch64-linux.clang-tidy 1m 28s
nix-grpc-store-clang-tidy-0.1.0: 76 | if (pos < value.size() && value[pos] == ',') { | ^~~~~ ../src/xfcc …
nix-grpc-store-clang-tidy-0.1.0:
   76 |         if (pos < value.size() && value[pos] == ',') {
      |                                        ^~~~~
../src/xfcc.hh:116:9: error: replace loop by 'std::ranges::any_of()' [readability-use-anyofallof,-warnings-as-errors]
  116 |         for (const auto & pattern : patterns) {
      |         ^
FAILED: [code=1] meson-internal__clang-tidy 
/nix/store/4nhp26ss88i238s986fx3jcqcw4si9ly-meson-1.10.2/bin/meson --internal clangtidy /build/source /build/source/build --color always
ninja: build stopped: subcommand failed.
failed checks.x86_64-linux.clang-tidy 51s
nix-grpc-store-clang-tidy-0.1.0: 76 | if (pos < value.size() && value[pos] == ',') { | ^~~~~ ../src/xfcc …
nix-grpc-store-clang-tidy-0.1.0:
   76 |         if (pos < value.size() && value[pos] == ',') {
      |                                        ^~~~~
../src/xfcc.hh:116:9: error: replace loop by 'std::ranges::any_of()' [readability-use-anyofallof,-warnings-as-errors]
  116 |         for (const auto & pattern : patterns) {
      |         ^
FAILED: [code=1] meson-internal__clang-tidy 
/nix/store/azf6s3lpx8f53si93y8135mpyykjj72b-meson-1.10.2/bin/meson --internal clangtidy /build/source /build/source/build --color always
ninja: build stopped: subcommand failed.
21 succeeded ⚠ 1
succeeded attributes
status attribute duration
succeeded checks.aarch64-linux.farm
  • getExe: Package "niks3-1.10.1" does not have the meta.mainProgram attribute. We'll assume that the main program has the same name for now, but this behavior is deprecated, because it leads to surprising errors when the assumption does not hold. If the package has a main program, please set `meta.mainProgram` in its definition to make this warning go away. Otherwise, if the package does not have a main program, or if you don't control its definition, use getExe' to specify the name to the program, such as lib.getExe' foo "bar".
  • getExe: Package "niks3-1.10.1" does not have the meta.mainProgram attribute. We'll assume that the main program has the same name for now, but this behavior is deprecated, because it leads to surprising errors when the assumption does not hold. If the package has a main program, please set `meta.mainProgram` in its definition to make this warning go away. Otherwise, if the package does not have a main program, or if you don't control its definition, use getExe' to specify the name to the program, such as lib.getExe' foo "bar".
2m 3s
succeeded checks.aarch64-darwin.claims-spec 1m 17s
succeeded checks.aarch64-darwin.exit-stress 3m 12s
succeeded checks.aarch64-darwin.plugin-dispatcher 1s
succeeded checks.aarch64-darwin.plugin-nix_2_31 1m 45s
succeeded checks.aarch64-darwin.plugin-nix_2_34 1m 48s
succeeded checks.aarch64-darwin.plugin-nix_2_35 1m 50s
succeeded checks.aarch64-linux.acme-vm 1m 7s
succeeded checks.aarch64-linux.claims-spec 43s
succeeded checks.aarch64-linux.exit-stress 2m 33s
succeeded checks.aarch64-linux.fuzz 49s
succeeded checks.aarch64-linux.plugin-dispatcher 4s
succeeded checks.aarch64-linux.plugin-nix_2_31 1m 47s
succeeded checks.aarch64-linux.plugin-nix_2_34 1m 48s
succeeded checks.aarch64-linux.plugin-nix_2_35 1m 49s
succeeded checks.aarch64-linux.sanitize-smoke 1m 48s
succeeded checks.aarch64-linux.vm 1m 56s
succeeded checks.x86_64-linux.acme-vm 56s
succeeded checks.x86_64-linux.claims-spec 18s
succeeded checks.x86_64-linux.exit-stress 40s
succeeded checks.x86_64-linux.fuzz 29s
7 already built ⚠ 1
skipped attributes
status attribute duration
skipped local checks.x86_64-linux.farm
  • getExe: Package "niks3-1.10.1" does not have the meta.mainProgram attribute. We'll assume that the main program has the same name for now, but this behavior is deprecated, because it leads to surprising errors when the assumption does not hold. If the package has a main program, please set `meta.mainProgram` in its definition to make this warning go away. Otherwise, if the package does not have a main program, or if you don't control its definition, use getExe' to specify the name to the program, such as lib.getExe' foo "bar".
  • getExe: Package "niks3-1.10.1" does not have the meta.mainProgram attribute. We'll assume that the main program has the same name for now, but this behavior is deprecated, because it leads to surprising errors when the assumption does not hold. If the package has a main program, please set `meta.mainProgram` in its definition to make this warning go away. Otherwise, if the package does not have a main program, or if you don't control its definition, use getExe' to specify the name to the program, such as lib.getExe' foo "bar".
skipped local checks.x86_64-linux.plugin-dispatcher
skipped local checks.x86_64-linux.plugin-nix_2_31
skipped local checks.x86_64-linux.plugin-nix_2_34
skipped local checks.x86_64-linux.plugin-nix_2_35
skipped local checks.x86_64-linux.sanitize-smoke
skipped local checks.x86_64-linux.vm