nixbot

builds

Mic92/nix-grpc-store build #145 failed

branch farm/oidc · PR #50 · commit d09599da8c · · took 3m 34s · eval 18s

eval warnings 1 kind · 4 occurrences
  • warn getExe: Package "niks3-1.10.1" does not have the meta.mainProgram attribute. We'll assume that the main program has the same name for now, but this behavior is deprecated, because it leads to surprising errors when the assumption does not hold. If the package has a main program, please set `meta.mainProgram` in its definition to make this warning go away. Otherwise, if the package does not have a main program, or if you don't control its definition, use getExe' to specify the name to the progra… ×4

3 failed
failed attributes
status attribute duration
failed checks.aarch64-darwin.clang-tidy 1m 42s
nix-grpc-store-clang-tidy-0.1.0: 14 | builder.AddChannelArgument(GRPC_ARG_KEEPALIVE_PERMIT_WITHOUT_CALLS, 1); | ^ .. …
nix-grpc-store-clang-tidy-0.1.0:
   14 |     builder.AddChannelArgument(GRPC_ARG_KEEPALIVE_PERMIT_WITHOUT_CALLS, 1);
      |                                ^
../src/nix-grpc-daemon.cc:1268:32: error: no header providing "GRPC_ARG_HTTP2_MIN_RECV_PING_INTERVAL_WITHOUT_DATA_MS" is directly included [misc-include-cleaner,-warnings-as-errors]
 1268 |     builder.AddChannelArgument(GRPC_ARG_HTTP2_MIN_RECV_PING_INTERVAL_WITHOUT_DATA_MS, minPingIntervalMs);
      |                                ^
FAILED: [code=1] meson-internal__clang-tidy 
/nix/store/735yy09gy9j1wzwrsd1v1xrgf6izyr5d-meson-1.10.2/bin/meson --internal clangtidy /nix/var/nix/builds/nix-75114-2484289219/source /nix/var/nix/builds/nix-75114-2484289219/source/build --color always
ninja: build stopped: subcommand failed.
failed checks.aarch64-linux.clang-tidy 1m 19s
nix-grpc-store-clang-tidy-0.1.0: 14 | builder.AddChannelArgument(GRPC_ARG_KEEPALIVE_PERMIT_WITHOUT_CALLS, 1); | ^ .. …
nix-grpc-store-clang-tidy-0.1.0:
   14 |     builder.AddChannelArgument(GRPC_ARG_KEEPALIVE_PERMIT_WITHOUT_CALLS, 1);
      |                                ^
../src/nix-grpc-daemon.cc:1268:32: error: no header providing "GRPC_ARG_HTTP2_MIN_RECV_PING_INTERVAL_WITHOUT_DATA_MS" is directly included [misc-include-cleaner,-warnings-as-errors]
 1268 |     builder.AddChannelArgument(GRPC_ARG_HTTP2_MIN_RECV_PING_INTERVAL_WITHOUT_DATA_MS, minPingIntervalMs);
      |                                ^
FAILED: [code=1] meson-internal__clang-tidy 
/nix/store/4nhp26ss88i238s986fx3jcqcw4si9ly-meson-1.10.2/bin/meson --internal clangtidy /build/source /build/source/build --color always
ninja: build stopped: subcommand failed.
failed checks.x86_64-linux.clang-tidy 51s
nix-grpc-store-clang-tidy-0.1.0: 14 | builder.AddChannelArgument(GRPC_ARG_KEEPALIVE_PERMIT_WITHOUT_CALLS, 1); | ^ .. …
nix-grpc-store-clang-tidy-0.1.0:
   14 |     builder.AddChannelArgument(GRPC_ARG_KEEPALIVE_PERMIT_WITHOUT_CALLS, 1);
      |                                ^
../src/nix-grpc-daemon.cc:1268:32: error: no header providing "GRPC_ARG_HTTP2_MIN_RECV_PING_INTERVAL_WITHOUT_DATA_MS" is directly included [misc-include-cleaner,-warnings-as-errors]
 1268 |     builder.AddChannelArgument(GRPC_ARG_HTTP2_MIN_RECV_PING_INTERVAL_WITHOUT_DATA_MS, minPingIntervalMs);
      |                                ^
FAILED: [code=1] meson-internal__clang-tidy 
/nix/store/azf6s3lpx8f53si93y8135mpyykjj72b-meson-1.10.2/bin/meson --internal clangtidy /build/source /build/source/build --color always
ninja: build stopped: subcommand failed.
25 succeeded ⚠ 2
succeeded attributes
status attribute duration
succeeded checks.aarch64-linux.farm
  • getExe: Package "niks3-1.10.1" does not have the meta.mainProgram attribute. We'll assume that the main program has the same name for now, but this behavior is deprecated, because it leads to surprising errors when the assumption does not hold. If the package has a main program, please set `meta.mainProgram` in its definition to make this warning go away. Otherwise, if the package does not have a main program, or if you don't control its definition, use getExe' to specify the name to the program, such as lib.getExe' foo "bar".
  • getExe: Package "niks3-1.10.1" does not have the meta.mainProgram attribute. We'll assume that the main program has the same name for now, but this behavior is deprecated, because it leads to surprising errors when the assumption does not hold. If the package has a main program, please set `meta.mainProgram` in its definition to make this warning go away. Otherwise, if the package does not have a main program, or if you don't control its definition, use getExe' to specify the name to the program, such as lib.getExe' foo "bar".
1m 44s
succeeded checks.x86_64-linux.farm
  • getExe: Package "niks3-1.10.1" does not have the meta.mainProgram attribute. We'll assume that the main program has the same name for now, but this behavior is deprecated, because it leads to surprising errors when the assumption does not hold. If the package has a main program, please set `meta.mainProgram` in its definition to make this warning go away. Otherwise, if the package does not have a main program, or if you don't control its definition, use getExe' to specify the name to the program, such as lib.getExe' foo "bar".
  • getExe: Package "niks3-1.10.1" does not have the meta.mainProgram attribute. We'll assume that the main program has the same name for now, but this behavior is deprecated, because it leads to surprising errors when the assumption does not hold. If the package has a main program, please set `meta.mainProgram` in its definition to make this warning go away. Otherwise, if the package does not have a main program, or if you don't control its definition, use getExe' to specify the name to the program, such as lib.getExe' foo "bar".
1m 35s
succeeded checks.aarch64-darwin.exit-stress 1m 27s
succeeded checks.aarch64-darwin.plugin-dispatcher 1s
succeeded checks.aarch64-darwin.plugin-nix_2_31 1m 36s
succeeded checks.aarch64-darwin.plugin-nix_2_34 49s
succeeded checks.aarch64-darwin.plugin-nix_2_35 1m 38s
succeeded checks.aarch64-linux.acme-vm 51s
succeeded checks.aarch64-linux.exit-stress 2m 24s
succeeded checks.aarch64-linux.fuzz 40s
succeeded checks.aarch64-linux.plugin-dispatcher 1s
succeeded checks.aarch64-linux.plugin-nix_2_31 1m 37s
succeeded checks.aarch64-linux.plugin-nix_2_34 1m 37s
succeeded checks.aarch64-linux.plugin-nix_2_35 1m 37s
succeeded checks.aarch64-linux.sanitize-smoke 1m 8s
succeeded checks.aarch64-linux.vm 1m 44s
succeeded checks.x86_64-linux.acme-vm 51s
succeeded checks.x86_64-linux.exit-stress 1m 33s
succeeded checks.x86_64-linux.fuzz 27s
succeeded checks.x86_64-linux.plugin-dispatcher 7s
succeeded checks.x86_64-linux.plugin-nix_2_31 51s
succeeded checks.x86_64-linux.plugin-nix_2_34 52s
succeeded checks.x86_64-linux.plugin-nix_2_35 51s
succeeded checks.x86_64-linux.sanitize-smoke 50s
succeeded checks.x86_64-linux.vm 1m 22s
3 already built
skipped attributes
status attribute duration
loading…