nixbot

builds

Mic92/nix-grpc-store build #163 failed

branch maiao.I7b40e4bcdb57bd2876f8627a19fa4d92362e275b · PR #59 · commit dc91bd3107 · · took 1m 59s · eval 16s

6 failed
failed attributes
status attribute duration
failed checks.aarch64-darwin.exit-stress 1m 30s
nix-grpc-store-0.1.0: ../src/daemon/token-file.hh:50:62: error: no member named 'st_mtim' in 'stat' 50 | *cur = {.token = std::move(token), .mtim …
nix-grpc-store-0.1.0:
../src/daemon/token-file.hh:50:62: error: no member named 'st_mtim' in 'stat'
   50 |             *cur = {.token = std::move(token), .mtime = info.st_mtim, .ino = info.st_ino};
      |                                                         ~~~~ ^
3 errors generated.
[7/26] Precompiling header ../pch/client_pch.hh
[8/26] Precompiling header ../pch/daemon_pch.hh
[9/26] Compiling C++ object oidc-test.p/tests_oidc-test.cc.o
ninja: build stopped: subcommand failed.
dependency failed checks.aarch64-darwin.plugin-dispatcher
failed checks.aarch64-darwin.plugin-nix_2_31 1m 30s
nix-grpc-store-0.1.0: ../src/daemon/token-file.hh:50:62: error: no member named 'st_mtim' in 'stat' 50 | *cur = {.token = std::move(token), .mtim …
nix-grpc-store-0.1.0:
../src/daemon/token-file.hh:50:62: error: no member named 'st_mtim' in 'stat'
   50 |             *cur = {.token = std::move(token), .mtime = info.st_mtim, .ino = info.st_ino};
      |                                                         ~~~~ ^
3 errors generated.
[7/26] Precompiling header ../pch/client_pch.hh
[8/26] Precompiling header ../pch/daemon_pch.hh
[9/26] Compiling C++ object oidc-test.p/tests_oidc-test.cc.o
ninja: build stopped: subcommand failed.
failed checks.aarch64-darwin.plugin-nix_2_34 1m 30s
nix-grpc-store-0.1.0: ../src/daemon/token-file.hh:50:62: error: no member named 'st_mtim' in 'stat' 50 | *cur = {.token = std::move(token), .mtim …
nix-grpc-store-0.1.0:
../src/daemon/token-file.hh:50:62: error: no member named 'st_mtim' in 'stat'
   50 |             *cur = {.token = std::move(token), .mtime = info.st_mtim, .ino = info.st_ino};
      |                                                         ~~~~ ^
3 errors generated.
[7/26] Precompiling header ../pch/client_pch.hh
[8/26] Precompiling header ../pch/daemon_pch.hh
[9/26] Compiling C++ object oidc-test.p/tests_oidc-test.cc.o
ninja: build stopped: subcommand failed.
failed checks.aarch64-darwin.plugin-nix_2_35 1m 31s
nix-grpc-store-0.1.0: ../src/daemon/token-file.hh:50:62: error: no member named 'st_mtim' in 'stat' 50 | *cur = {.token = std::move(token), .mtim …
nix-grpc-store-0.1.0:
../src/daemon/token-file.hh:50:62: error: no member named 'st_mtim' in 'stat'
   50 |             *cur = {.token = std::move(token), .mtime = info.st_mtim, .ino = info.st_ino};
      |                                                         ~~~~ ^
3 errors generated.
[7/26] Precompiling header ../pch/client_pch.hh
[8/26] Precompiling header ../pch/daemon_pch.hh
[9/26] Compiling C++ object oidc-test.p/tests_oidc-test.cc.o
ninja: build stopped: subcommand failed.
failed checks.x86_64-linux.fuzz 30s
nix-grpc-store-fuzzers-0.1.0: [66/70] Compiling C++ object nix-grpc-store.so.p/src_client_build.cc.o [67/70] Compiling C++ object nix-grpc-daemon.p/src_daemon_a …
nix-grpc-store-fuzzers-0.1.0:
[66/70] Compiling C++ object nix-grpc-store.so.p/src_client_build.cc.o
[67/70] Compiling C++ object nix-grpc-daemon.p/src_daemon_auth.cc.o
[68/70] Linking target nix-grpc-store.so
clang++: warning: argument unused during compilation: '-Wa,--compress-debug-sections' [-Wunused-command-line-argument]
[69/70] Compiling C++ object nix-grpc-daemon.p/src_daemon_main.cc.o
[70/70] Linking target nix-grpc-daemon
clang++: warning: argument unused during compilation: '-Wa,--compress-debug-sections' [-Wunused-command-line-argument]
tribuchet worker error: builder did not produce output /nix/store/4hy86j2jr8wm4nadgyqxcwcv5pirrzwp-nix-grpc-store-fuzzers-0.1.0-debug
16 cancelled
cancelled attributes
status attribute duration
loading…
6 succeeded
succeeded attributes
status attribute duration
loading…
3 already built
skipped attributes
status attribute duration
loading…