nixbot

builds

Mic92/nix-grpc-store build #167 failed

branch maiao.I90db74e9a5e2f97b6282d61f6110c0f22499e810 · PR #57 · commit 95b6e33605 · · took 5m 8s · eval 16s

6 failed
failed attributes
status attribute duration
failed checks.aarch64-darwin.clang-tidy 1m 24s
nix-grpc-store-clang-tidy-0.1.0: 45 | || info.st_mtim.tv_nsec != cur->mtime.tv_nsec) { | ~~~~ ^ ../src/daemon/token-file.hh: …
nix-grpc-store-clang-tidy-0.1.0:
   45 |             || info.st_mtim.tv_nsec != cur->mtime.tv_nsec) {
      |                ~~~~ ^
../src/daemon/token-file.hh:50:62: error: no member named 'st_mtim' in 'stat' [clang-diagnostic-error]
   50 |             *cur = {.token = std::move(token), .mtime = info.st_mtim, .ino = info.st_ino};
      |                                                         ~~~~ ^
FAILED: [code=1] meson-internal__clang-tidy 
/nix/store/735yy09gy9j1wzwrsd1v1xrgf6izyr5d-meson-1.10.2/bin/meson --internal clangtidy /nix/var/nix/builds/nix-40525-1899704256/source /nix/var/nix/builds/nix-40525-1899704256/source/build --color always
ninja: build stopped: subcommand failed.
failed checks.aarch64-darwin.exit-stress 53s
nix-grpc-store-0.1.0: ../src/daemon/token-file.hh:50:62: error: no member named 'st_mtim' in 'stat' 50 | *cur = {.token = std::move(token), .mtim …
nix-grpc-store-0.1.0:
../src/daemon/token-file.hh:50:62: error: no member named 'st_mtim' in 'stat'
   50 |             *cur = {.token = std::move(token), .mtime = info.st_mtim, .ino = info.st_ino};
      |                                                         ~~~~ ^
3 errors generated.
[7/26] Precompiling header ../pch/client_pch.hh
[8/26] Precompiling header ../pch/daemon_pch.hh
[9/26] Compiling C++ object oidc-test.p/tests_oidc-test.cc.o
ninja: build stopped: subcommand failed.
dependency failed checks.aarch64-darwin.plugin-dispatcher
failed checks.aarch64-darwin.plugin-nix_2_31 52s
nix-grpc-store-0.1.0: ../src/daemon/token-file.hh:50:62: error: no member named 'st_mtim' in 'stat' 50 | *cur = {.token = std::move(token), .mtim …
nix-grpc-store-0.1.0:
../src/daemon/token-file.hh:50:62: error: no member named 'st_mtim' in 'stat'
   50 |             *cur = {.token = std::move(token), .mtime = info.st_mtim, .ino = info.st_ino};
      |                                                         ~~~~ ^
3 errors generated.
[7/26] Precompiling header ../pch/client_pch.hh
[8/26] Precompiling header ../pch/daemon_pch.hh
[9/26] Compiling C++ object oidc-test.p/tests_oidc-test.cc.o
ninja: build stopped: subcommand failed.
failed checks.aarch64-darwin.plugin-nix_2_34 47s
nix-grpc-store-0.1.0: ../src/daemon/token-file.hh:50:62: error: no member named 'st_mtim' in 'stat' 50 | *cur = {.token = std::move(token), .mtim …
nix-grpc-store-0.1.0:
../src/daemon/token-file.hh:50:62: error: no member named 'st_mtim' in 'stat'
   50 |             *cur = {.token = std::move(token), .mtime = info.st_mtim, .ino = info.st_ino};
      |                                                         ~~~~ ^
3 errors generated.
[7/26] Precompiling header ../pch/client_pch.hh
[8/26] Precompiling header ../pch/daemon_pch.hh
[9/26] Compiling C++ object oidc-test.p/tests_oidc-test.cc.o
ninja: build stopped: subcommand failed.
failed checks.aarch64-darwin.plugin-nix_2_35 47s
nix-grpc-store-0.1.0: ../src/daemon/token-file.hh:50:62: error: no member named 'st_mtim' in 'stat' 50 | *cur = {.token = std::move(token), .mtim …
nix-grpc-store-0.1.0:
../src/daemon/token-file.hh:50:62: error: no member named 'st_mtim' in 'stat'
   50 |             *cur = {.token = std::move(token), .mtime = info.st_mtim, .ino = info.st_ino};
      |                                                         ~~~~ ^
3 errors generated.
[7/26] Precompiling header ../pch/client_pch.hh
[8/26] Precompiling header ../pch/daemon_pch.hh
[9/26] Compiling C++ object oidc-test.p/tests_oidc-test.cc.o
ninja: build stopped: subcommand failed.
22 succeeded
succeeded attributes
status attribute duration
loading…
3 already built
skipped attributes
status attribute duration
loading…