nixbot

builds

Mic92/nix-grpc-store build #197 failed

branch maiao.I740d5a2446d5eb33d39c7c97e292d44e7d4e4c4e · PR #70 · commit 898e93364c · · took 5m 56s · eval 19s

9 failed
failed attributes
status attribute duration
failed checks.aarch64-darwin.clang-tidy 5m 42s
nix-grpc-store-clang-tidy-0.1.0: 772 | return __f_(std::forward<_ArgTypes>(__arg)...); | ^ ../src/daemon/dispatcher.cc:91:13: note: frame #3: …
nix-grpc-store-clang-tidy-0.1.0:
  772 |   return __f_(std::forward<_ArgTypes>(__arg)...);
      |          ^
../src/daemon/dispatcher.cc:91:13: note: frame #3: function '~Lock' calls function 'operator()' here
   91 |         func();
      |             ^
FAILED: [code=1] meson-internal__clang-tidy 
/nix/store/735yy09gy9j1wzwrsd1v1xrgf6izyr5d-meson-1.10.2/bin/meson --internal clangtidy /nix/var/nix/builds/nix-4353-3138551491/source /nix/var/nix/builds/nix-4353-3138551491/source/build --color always
ninja: build stopped: subcommand failed.
failed checks.aarch64-darwin.exit-stress 1m 23s
nix-grpc-store-0.1.0: 414 | cfg.clients, 415 | cfg.inflight, 416 | presentCalls.load(), 417 | total, | ^~~ …
nix-grpc-store-0.1.0:
  414 |         cfg.clients,
  415 |         cfg.inflight,
  416 |         presentCalls.load(),
  417 |         total,
      |         ^~~~~
4 warnings generated.
[16/36] Compiling C++ object oidc-test.p/tests_oidc-test.cc.o
ninja: build stopped: subcommand failed.
dependency failed checks.aarch64-darwin.plugin-dispatcher
failed checks.aarch64-darwin.plugin-nix_2_31 1m 20s
nix-grpc-store-0.1.0: 414 | cfg.clients, 415 | cfg.inflight, 416 | presentCalls.load(), 417 | total, | ^~~ …
nix-grpc-store-0.1.0:
  414 |         cfg.clients,
  415 |         cfg.inflight,
  416 |         presentCalls.load(),
  417 |         total,
      |         ^~~~~
4 warnings generated.
[13/36] Compiling C++ object oidc-test.p/tests_oidc-test.cc.o
ninja: build stopped: subcommand failed.
failed checks.aarch64-darwin.plugin-nix_2_34 1m 23s
nix-grpc-store-0.1.0: 414 | cfg.clients, 415 | cfg.inflight, 416 | presentCalls.load(), 417 | total, | ^~~ …
nix-grpc-store-0.1.0:
  414 |         cfg.clients,
  415 |         cfg.inflight,
  416 |         presentCalls.load(),
  417 |         total,
      |         ^~~~~
4 warnings generated.
[15/36] Compiling C++ object oidc-test.p/tests_oidc-test.cc.o
ninja: build stopped: subcommand failed.
failed checks.aarch64-darwin.plugin-nix_2_35 1m 24s
nix-grpc-store-0.1.0: 414 | cfg.clients, 415 | cfg.inflight, 416 | presentCalls.load(), 417 | total, | ^~~ …
nix-grpc-store-0.1.0:
  414 |         cfg.clients,
  415 |         cfg.inflight,
  416 |         presentCalls.load(),
  417 |         total,
      |         ^~~~~
4 warnings generated.
[16/36] Compiling C++ object oidc-test.p/tests_oidc-test.cc.o
ninja: build stopped: subcommand failed.
failed checks.aarch64-linux.clang-tidy 1m 22s
nix-grpc-store-clang-tidy-0.1.0: 415 | if (restarting) { | ^ ../src/daemon/coordinator.cc:419:11: note: +1, nesting level increased to 2 …
nix-grpc-store-clang-tidy-0.1.0:
  415 |         if (restarting) {
      |         ^
../src/daemon/coordinator.cc:419:11: note: +1, nesting level increased to 2
  419 |         } else {
      |           ^
FAILED: [code=1] meson-internal__clang-tidy 
/nix/store/4nhp26ss88i238s986fx3jcqcw4si9ly-meson-1.10.2/bin/meson --internal clangtidy /build/source /build/source/build --color always
ninja: build stopped: subcommand failed.
failed checks.x86_64-linux.clang-tidy 53s
nix-grpc-store-clang-tidy-0.1.0: 415 | if (restarting) { | ^ ../src/daemon/coordinator.cc:419:11: note: +1, nesting level increased to 2 …
nix-grpc-store-clang-tidy-0.1.0:
  415 |         if (restarting) {
      |         ^
../src/daemon/coordinator.cc:419:11: note: +1, nesting level increased to 2
  419 |         } else {
      |           ^
FAILED: [code=1] meson-internal__clang-tidy 
/nix/store/azf6s3lpx8f53si93y8135mpyykjj72b-meson-1.10.2/bin/meson --internal clangtidy /build/source /build/source/build --color always
ninja: build stopped: subcommand failed.
failed checks.x86_64-linux.farm 2m 1s
vm-test-run-nix-grpc-farm: worker1 # qemu-system-x86_64: terminating on signal 15 from pid 39 (/nix/store/b5bpi6zfajzzrwwpgba2q6li3nnya4bs-python3-3.14.7/bin/py …
vm-test-run-nix-grpc-farm:
worker1 # qemu-system-x86_64: terminating on signal 15 from pid 39 (/nix/store/b5bpi6zfajzzrwwpgba2q6li3nnya4bs-python3-3.14.7/bin/python3.14)
kill QemuMachine (pid 51)
worker2 # qemu-system-x86_64: terminating on signal 15 from pid 39 (/nix/store/b5bpi6zfajzzrwwpgba2q6li3nnya4bs-python3-3.14.7/bin/python3.14)
(finished: cleanup, in 0.83 seconds)
additionally exposed symbols:
    client, lb, worker1, worker2,
    vlan1,
    start_all, test_script, machines, machines_qemu, machines_nspawn, vlans, driver, log, os, create_machine, subtest, run_tests, join_all, retry, serial_stdout_off, serial_stdout_on, polling_condition, BaseMachine, QemuMachine, NspawnMachine, t, debug, dump_machine_ssh
20 succeeded
succeeded attributes
status attribute duration
loading…
5 already built
skipped attributes
status attribute duration
loading…