nixbot

builds

Mic92/nix-grpc-store build #462 failed

branch main · PR #94 · commit 7b264974ee · · took 10m 8s · eval 21s

5 failed
failed attributes
status attribute duration
failed checks.aarch64-darwin.clang-tidy 3m 56s
nix-grpc-store-clang-tidy-0.1.0-beta.1: 17 | auto present = queryValidPathsRouted(closure, NoSubstitute, headers); | …
nix-grpc-store-clang-tidy-0.1.0-beta.1:
   17 |   auto present = queryValidPathsRouted(closure, NoSubstitute, headers);
      |                                                 ^
../src/client/build.cc:608:80: error: no header providing "nix::Substitute" is directly included [misc-include-cleaner,-warnings-as-errors]
  608 |   auto validOpaque = opaque.empty() ? StorePathSet{} : queryValidPaths(opaque, Substitute);
      |                                                                                ^
FAILED: [code=1] meson-internal__clang-tidy 
/nix/store/735yy09gy9j1wzwrsd1v1xrgf6izyr5d-meson-1.10.2/bin/meson --internal clangtidy /nix/var/nix/builds/nix-30841-1868907608/source /nix/var/nix/builds/nix-30841-1868907608/source/build --color always
ninja: build stopped: subcommand failed.
failed checks.aarch64-linux.clang-tidy 3m 8s
nix-grpc-store-clang-tidy-0.1.0-beta.1: 13 | localStore->queryValidPaths(paths, request->substitute() ? nix::Substitute : nix::NoSubstitute) …
nix-grpc-store-clang-tidy-0.1.0-beta.1:
   13 |                  localStore->queryValidPaths(paths, request->substitute() ? nix::Substitute : nix::NoSubstitute)) {
      |                                                                                  ^
../src/daemon/main.cc:275:100: error: no header providing "nix::NoSubstitute" is directly included [misc-include-cleaner,-warnings-as-errors]
  275 |                  localStore->queryValidPaths(paths, request->substitute() ? nix::Substitute : nix::NoSubstitute)) {
      |                                                                                                    ^
FAILED: [code=1] meson-internal__clang-tidy 
/nix/store/4nhp26ss88i238s986fx3jcqcw4si9ly-meson-1.10.2/bin/meson --internal clangtidy /build/source /build/source/build --color always
ninja: build stopped: subcommand failed.
failed checks.aarch64-linux.vm 3m 47s
vm-test-run-nix-grpc-store: machine # qemu-system-aarch64: terminating on signal 15 from pid 39 (/nix/store/lfh101cfjj8p8npcari9hk0lbqi33yvh-python3-3.14.7/bin/ …
vm-test-run-nix-grpc-store:
machine # qemu-system-aarch64: terminating on signal 15 from pid 39 (/nix/store/lfh101cfjj8p8npcari9hk0lbqi33yvh-python3-3.14.7/bin/python3.14)
(finished: cleanup, in 0.25 seconds)
additionally exposed symbols:
    machine,
    vlan1,
    start_all, test_script, machines, machines_qemu, machines_nspawn, vlans, driver, log, os, create_machine, subtest, run_tests, join_all, retry, serial_stdout_off, serial_stdout_on, polling_condition, BaseMachine, QemuMachine, NspawnMachine, t, debug, dump_machine_ssh
error: gRPC QueryMissing on 'localhost:50053' failed: server requires a TLS client certificate or bearer token
       hint: TLS handshake failed and no client certificate was presented. If the server requires mTLS set 'client-cert'/'client-key' or install client.crt/client.key in $XDG_DATA_HOME/nix-grpc-store or /var/lib/nix-grpc-store. Set NIX_GRPC_DEBUG=1 for a handshake trace.
failed checks.x86_64-linux.clang-tidy 2m 19s
nix-grpc-store-clang-tidy-0.1.0-beta.1: 13 | localStore->queryValidPaths(paths, request->substitute() ? nix::Substitute : nix::NoSubstitute) …
nix-grpc-store-clang-tidy-0.1.0-beta.1:
   13 |                  localStore->queryValidPaths(paths, request->substitute() ? nix::Substitute : nix::NoSubstitute)) {
      |                                                                                  ^
../src/daemon/main.cc:275:100: error: no header providing "nix::NoSubstitute" is directly included [misc-include-cleaner,-warnings-as-errors]
  275 |                  localStore->queryValidPaths(paths, request->substitute() ? nix::Substitute : nix::NoSubstitute)) {
      |                                                                                                    ^
FAILED: [code=1] meson-internal__clang-tidy 
/nix/store/azf6s3lpx8f53si93y8135mpyykjj72b-meson-1.10.2/bin/meson --internal clangtidy /build/source /build/source/build --color always
ninja: build stopped: subcommand failed.
failed checks.x86_64-linux.vm 3m 50s
vm-test-run-nix-grpc-store: machine # qemu-system-x86_64: terminating on signal 15 from pid 39 (/nix/store/b5bpi6zfajzzrwwpgba2q6li3nnya4bs-python3-3.14.7/bin/p …
vm-test-run-nix-grpc-store:
machine # qemu-system-x86_64: terminating on signal 15 from pid 39 (/nix/store/b5bpi6zfajzzrwwpgba2q6li3nnya4bs-python3-3.14.7/bin/python3.14)
(finished: cleanup, in 0.20 seconds)
additionally exposed symbols:
    machine,
    vlan1,
    start_all, test_script, machines, machines_qemu, machines_nspawn, vlans, driver, log, os, create_machine, subtest, run_tests, join_all, retry, serial_stdout_off, serial_stdout_on, polling_condition, BaseMachine, QemuMachine, NspawnMachine, t, debug, dump_machine_ssh
error: gRPC QueryMissing on 'localhost:50053' failed: server requires a TLS client certificate or bearer token
       hint: TLS handshake failed and no client certificate was presented. If the server requires mTLS set 'client-cert'/'client-key' or install client.crt/client.key in $XDG_DATA_HOME/nix-grpc-store or /var/lib/nix-grpc-store. Set NIX_GRPC_DEBUG=1 for a handshake trace.
15 succeeded
succeeded attributes
status attribute duration
loading…
14 already built
skipped attributes
status attribute duration
loading…