nixbot

builds

Mic92/nix-grpc-store build #468 failed

branch main · PR #99 · commit 0cb9fbcf96 · · took 14m 55s · eval 26s

7 failed
failed attributes
status attribute duration
failed checks.aarch64-darwin.clang-tidy 2m 35s
… and 1 more failed derivation
… and 1 more failed derivation
failed checks.aarch64-linux.clang-tidy 2m 23s
nix-grpc-store-clang-tidy-0.1.0-beta.1: 155 | zstdCompressInto(*cctx, out, zin, directive, []() -> void {}); | …
nix-grpc-store-clang-tidy-0.1.0-beta.1:
  155 |         zstdCompressInto(*cctx, out, zin, directive, []() -> void {});
      |                                                        ^~
../src/pump.hh:233:78: error: redundant empty parameter list in lambda expression [readability-redundant-lambda-parameter-list,-warnings-as-errors]
  233 |         zstdCompressInto(*cctx, *msg.mutable_data(), input, directive, [this]() -> void { ship(); });
      |                                                                              ^~
FAILED: [code=1] meson-internal__clang-tidy 
/nix/store/sc7hggvmvma7m8bbgmp8gsa1q1x37aq8-meson-1.10.2/bin/meson --internal clangtidy /build/source /build/source/build --color always
ninja: build stopped: subcommand failed.
failed checks.aarch64-linux.fuzz 2m 36s
nix-grpc-store-fuzz-smoke: tribuchet: building on eliza ###### End of recommended dictionary. ###### Done 200 runs in 0 second(s) #200 DONE cov: 89 ft: 90 cor …
nix-grpc-store-fuzz-smoke:
tribuchet: building on eliza
###### End of recommended dictionary. ######
Done 200 runs in 0 second(s)
#200	DONE   cov: 89 ft: 90 corp: 1/1b lim: 4 exec/s: 0 rss: 54Mb
Done 200 runs in 0 second(s)
SUMMARY: AddressSanitizer: SEGV (/nix/store/nxlmb8lkbnzwcj46mmsvn1gjrgzap7sw-protobuf-36.1/lib/libprotobuf.so.36.1.0+0x1c12a4) (BuildId: 10664eccb5e7126ba9b6865128060c68499201ec) 
==11==ABORTING
failed checks.aarch64-linux.sanitize-smoke 6m 0s
nix-grpc-store-sanitize-smoke: x12 = 0x0000ffffffff8308 x13 = 0x0000000000000000 x14 = 0x0000000000000000 x15 = 0x0000000000000000 x16 = 0x0000fffff6cfe150 …
nix-grpc-store-sanitize-smoke:
x12 = 0x0000ffffffff8308  x13 = 0x0000000000000000  x14 = 0x0000000000000000  x15 = 0x0000000000000000  
x16 = 0x0000fffff6cfe150  x17 = 0x0000fffff6b61244  x18 = 0x0000000000000000  x19 = 0x0000aaab3de209bb  
x20 = 0x0000ffffffff83b8  x21 = 0x0000000000000009  x22 = 0x0000ffffffffa2a8  x23 = 0x0000fffff7ffdc90  
x24 = 0x0000aaaaab8bf824  x25 = 0x0000000000000000  x26 = 0x0000fffff7ffe000  x27 = 0x0000aaaaabf348f0  
x28 = 0x0000000000000000   fp = 0x0000ffffffff8390   lr = 0x0000fffff6b61690   sp = 0x0000ffffffff82e0  
AddressSanitizer can not provide additional info.
SUMMARY: AddressSanitizer: SEGV (/nix/store/nxlmb8lkbnzwcj46mmsvn1gjrgzap7sw-protobuf-36.1/lib/libprotobuf.so.36.1.0+0x1c12a4) (BuildId: 10664eccb5e7126ba9b6865128060c68499201ec) 
==58==ABORTING
failed checks.x86_64-linux.clang-tidy 1m 46s
nix-grpc-store-clang-tidy-0.1.0-beta.1: 155 | zstdCompressInto(*cctx, out, zin, directive, []() -> void {}); | …
nix-grpc-store-clang-tidy-0.1.0-beta.1:
  155 |         zstdCompressInto(*cctx, out, zin, directive, []() -> void {});
      |                                                        ^~
../src/pump.hh:233:78: error: redundant empty parameter list in lambda expression [readability-redundant-lambda-parameter-list,-warnings-as-errors]
  233 |         zstdCompressInto(*cctx, *msg.mutable_data(), input, directive, [this]() -> void { ship(); });
      |                                                                              ^~
FAILED: [code=1] meson-internal__clang-tidy 
/nix/store/jaa89dphx07w3r26y7gh79a7b1mld5p4-meson-1.10.2/bin/meson --internal clangtidy /build/source /build/source/build --color always
ninja: build stopped: subcommand failed.
failed checks.x86_64-linux.fuzz 1m 49s
nix-grpc-store-fuzz-smoke: tribuchet: building on jamie #200 DONE cov: 1845 ft: 6129 corp: 16/50b lim: 4 exec/s: 0 rss: 63Mb Done 200 runs in 0 second(s) #200 …
nix-grpc-store-fuzz-smoke:
tribuchet: building on jamie
#200	DONE   cov: 1845 ft: 6129 corp: 16/50b lim: 4 exec/s: 0 rss: 63Mb
Done 200 runs in 0 second(s)
#200	DONE   cov: 89 ft: 90 corp: 1/1b lim: 4 exec/s: 0 rss: 57Mb
Done 200 runs in 0 second(s)
SUMMARY: AddressSanitizer: SEGV (/nix/store/4hdzvycn5mkg3xm1ggscp3mxz8005c3m-protobuf-36.1/lib/libprotobuf.so.36.1.0+0x1e42b0) (BuildId: 43e6fe0f83af6fdafa4e14f9eb73b5a064a80b18) 
==11==ABORTING
failed checks.x86_64-linux.sanitize-smoke 4m 33s
nix-grpc-store-sanitize-smoke: ==58==Register values: rax = 0x000000000001a1d8 rbx = 0x00005555baf522e0 rcx = 0x0000000000000000 rdx = 0x0000555556119998 r …
nix-grpc-store-sanitize-smoke:
==58==Register values:
rax = 0x000000000001a1d8  rbx = 0x00005555baf522e0  rcx = 0x0000000000000000  rdx = 0x0000555556119998  
rdi = 0x00007fffffff8030  rsi = 0x00007bffef80cf40  rbp = 0x00007fffffff8020  rsp = 0x00007fffffff7f80  
 r8 = 0x0000000000000000   r9 = 0x0001000000000001  r10 = 0x0000000000000000  r11 = 0x000000000000009d  
r12 = 0x0000555556119998  r13 = 0x00007fffffff8030  r14 = 0x00007bffef80cf40  r15 = 0x00005555bafbaa40  
AddressSanitizer can not provide additional info.
SUMMARY: AddressSanitizer: SEGV (/nix/store/4hdzvycn5mkg3xm1ggscp3mxz8005c3m-protobuf-36.1/lib/libprotobuf.so.36.1.0+0x1e42b0) (BuildId: 43e6fe0f83af6fdafa4e14f9eb73b5a064a80b18) 
==58==ABORTING
30 succeeded
succeeded attributes
status attribute duration
loading…