nixbot

builds

Mic92/nix-grpc-store build #476 failed

branch main · PR #99 · commit ef1e3b8200 · · took 12m 24s · eval 19s

3 failed
failed attributes
status attribute duration
failed checks.aarch64-darwin.clang-tidy 1s
… and 1 more failed derivation
… and 1 more failed derivation
failed checks.aarch64-linux.clang-tidy 1m 28s
nix-grpc-store-clang-tidy-0.1.0-beta.1: >>> /nix/store/a988c0xbm4g0miv5kdzjz4bd1xfk8ilm-clang-tools-23.1.0/bin/clang-tidy --use-color -quiet -p /build/source/bu …
nix-grpc-store-clang-tidy-0.1.0-beta.1:
>>> /nix/store/a988c0xbm4g0miv5kdzjz4bd1xfk8ilm-clang-tools-23.1.0/bin/clang-tidy --use-color -quiet -p /build/source/build /build/source/src/client/transfer.cc
Errors encountered while running clang-tidy
../src/client/transfer.cc:72:31: error: redundant empty parameter list in lambda expression [readability-redundant-lambda-parameter-list,-warnings-as-errors]
   72 |   retrying("QueryMissing", [&]() -> grpc::Status {
      |                               ^~
FAILED: [code=1] meson-internal__clang-tidy 
/nix/store/sc7hggvmvma7m8bbgmp8gsa1q1x37aq8-meson-1.10.2/bin/meson --internal clangtidy /build/source /build/source/build --color always
ninja: build stopped: subcommand failed.
failed checks.x86_64-linux.clang-tidy 51s
nix-grpc-store-clang-tidy-0.1.0-beta.1: >>> /nix/store/ay7j9s9mjqnk20glj04ck2yp40vgwaaz-clang-tools-23.1.0/bin/clang-tidy --use-color -quiet -p /build/source/bu …
nix-grpc-store-clang-tidy-0.1.0-beta.1:
>>> /nix/store/ay7j9s9mjqnk20glj04ck2yp40vgwaaz-clang-tools-23.1.0/bin/clang-tidy --use-color -quiet -p /build/source/build /build/source/src/client/transfer.cc
Errors encountered while running clang-tidy
../src/client/transfer.cc:72:31: error: redundant empty parameter list in lambda expression [readability-redundant-lambda-parameter-list,-warnings-as-errors]
   72 |   retrying("QueryMissing", [&]() -> grpc::Status {
      |                               ^~
FAILED: [code=1] meson-internal__clang-tidy 
/nix/store/jaa89dphx07w3r26y7gh79a7b1mld5p4-meson-1.10.2/bin/meson --internal clangtidy /build/source /build/source/build --color always
ninja: build stopped: subcommand failed.
31 succeeded
succeeded attributes
status attribute duration
loading…
3 already built
skipped attributes
status attribute duration
loading…