nixbot

builds

Mic92/nix-grpc-store build #492 failed

branch main · PR #108 · commit 21f87de209 · · took 7m 34s · eval 18s

3 failed
failed attributes
status attribute duration
failed checks.aarch64-darwin.clang-tidy 4m 51s
nix-grpc-store-clang-tidy-0.1.0-beta.1: Errors encountered while running clang-tidy ../src/daemon/main.cc:112:5: error: function 'openLocalStore' should be mark …
nix-grpc-store-clang-tidy-0.1.0-beta.1:
Errors encountered while running clang-tidy
../src/daemon/main.cc:112:5: error: function 'openLocalStore' should be marked [[nodiscard]] [modernize-use-nodiscard,-warnings-as-errors]
  112 |     auto openLocalStore() const -> nix::ref<nix::Store>
      |     ^
      |     [[nodiscard]] 
FAILED: [code=1] meson-internal__clang-tidy 
/nix/store/735yy09gy9j1wzwrsd1v1xrgf6izyr5d-meson-1.10.2/bin/meson --internal clangtidy /nix/var/nix/builds/nix-70813-1531400313/source /nix/var/nix/builds/nix-70813-1531400313/source/build --color always
ninja: build stopped: subcommand failed.
failed checks.aarch64-linux.clang-tidy 2m 4s
nix-grpc-store-clang-tidy-0.1.0-beta.1: Errors encountered while running clang-tidy ../src/daemon/main.cc:112:5: error: function 'openLocalStore' should be mark …
nix-grpc-store-clang-tidy-0.1.0-beta.1:
Errors encountered while running clang-tidy
../src/daemon/main.cc:112:5: error: function 'openLocalStore' should be marked [[nodiscard]] [modernize-use-nodiscard,-warnings-as-errors]
  112 |     auto openLocalStore() const -> nix::ref<nix::Store>
      |     ^
      |     [[nodiscard]] 
FAILED: [code=1] meson-internal__clang-tidy 
/nix/store/4nhp26ss88i238s986fx3jcqcw4si9ly-meson-1.10.2/bin/meson --internal clangtidy /build/source /build/source/build --color always
ninja: build stopped: subcommand failed.
failed checks.x86_64-linux.clang-tidy 56s
nix-grpc-store-clang-tidy-0.1.0-beta.1: Errors encountered while running clang-tidy ../src/daemon/main.cc:112:5: error: function 'openLocalStore' should be mark …
nix-grpc-store-clang-tidy-0.1.0-beta.1:
Errors encountered while running clang-tidy
../src/daemon/main.cc:112:5: error: function 'openLocalStore' should be marked [[nodiscard]] [modernize-use-nodiscard,-warnings-as-errors]
  112 |     auto openLocalStore() const -> nix::ref<nix::Store>
      |     ^
      |     [[nodiscard]] 
FAILED: [code=1] meson-internal__clang-tidy 
/nix/store/azf6s3lpx8f53si93y8135mpyykjj72b-meson-1.10.2/bin/meson --internal clangtidy /build/source /build/source/build --color always
ninja: build stopped: subcommand failed.
29 succeeded
succeeded attributes
status attribute duration
loading…
5 already built
skipped attributes
status attribute duration
loading…