nixbot

builds

Mic92/nix-grpc-store build #514 failed

branch maiao.Id2a121dd78dfc41caaba55398fd48e52fd62adcd · PR #124 · commit 48dd18ee7c · · took 11m 58s · eval 19s

eval warnings 1 kind · 2 occurrences
  • warn services.nix-grpc-farm-lb.workers is deprecated and its addresses are ignored. ×2

5 failed ⚠ 2
failed attributes
status attribute duration
failed checks.aarch64-linux.farm
  • services.nix-grpc-farm-lb.workers is deprecated and its addresses are ignored. Set `systems = [ "aarch64-linux" ];` and give every builder an `advertise` of the form IP:port.
2m 49s
vm-test-run-nix-grpc-farm: lb:50051: no healthy upstream, retrying lb:50051: no healthy upstream, retrying lb:50051: no healthy upstream, retrying lb:50051: no …
vm-test-run-nix-grpc-farm:
lb:50051: no healthy upstream, retrying
lb:50051: no healthy upstream, retrying
lb:50051: no healthy upstream, retrying
lb:50051: no healthy upstream, retrying
lb:50051: no healthy upstream, retrying
lb:50051: no healthy upstream, retrying
error: gRPC QueryMissing on 'lb:50051' failed: no healthy upstream
       hint: Set NIX_GRPC_DEBUG=1 for a handshake trace.
failed checks.x86_64-linux.farm
  • services.nix-grpc-farm-lb.workers is deprecated and its addresses are ignored. Set `systems = [ "x86_64-linux" ];` and give every builder an `advertise` of the form IP:port.
1m 35s
vm-test-run-nix-grpc-farm: lb:50051: no healthy upstream, retrying lb:50051: no healthy upstream, retrying lb:50051: no healthy upstream, retrying lb:50051: no …
vm-test-run-nix-grpc-farm:
lb:50051: no healthy upstream, retrying
lb:50051: no healthy upstream, retrying
lb:50051: no healthy upstream, retrying
lb:50051: no healthy upstream, retrying
lb:50051: no healthy upstream, retrying
lb:50051: no healthy upstream, retrying
error: gRPC QueryMissing on 'lb:50051' failed: no healthy upstream
       hint: Set NIX_GRPC_DEBUG=1 for a handshake trace.
failed checks.aarch64-darwin.clang-tidy 8m 37s
nix-grpc-store-clang-tidy-0.1.0-beta.3: | ^ >>> /nix/store/l8sbl3yky84xqxj3a5hazrjdx52avnf2-clang-tools-22.1.8/bin/clang-tidy --use-color …
nix-grpc-store-clang-tidy-0.1.0-beta.3:
      |                  ^
>>> /nix/store/l8sbl3yky84xqxj3a5hazrjdx52avnf2-clang-tools-22.1.8/bin/clang-tidy --use-color -quiet -p /nix/var/nix/builds/nix-67900-2067956260/source/build /nix/var/nix/builds/nix-67900-2067956260/source/src/client/channel.cc
Errors encountered while running clang-tidy
[1/1] (1/2) Processing file /nix/var/nix/builds/nix-67900-2067956260/source/src/client/channel.cc.
[1/1] (2/2) Processing file /nix/var/nix/builds/nix-67900-2067956260/source/src/client/channel.cc.
FAILED: [code=1] meson-internal__clang-tidy 
/nix/store/j2s018h6gc2q0z3sw002br2zas3m1l9d-meson-1.10.2/bin/meson --internal clangtidy /nix/var/nix/builds/nix-67900-2067956260/source /nix/var/nix/builds/nix-67900-2067956260/source/build --color always
ninja: build stopped: subcommand failed.
failed checks.aarch64-linux.clang-tidy 3m 25s
nix-grpc-store-clang-tidy-0.1.0-beta.3: | ^ >>> /nix/store/7wgbxsfygsdmgsai483p205pkcpy6ls8-clang-tools-22.1.8/bin/clang-tidy --use-color …
nix-grpc-store-clang-tidy-0.1.0-beta.3:
      |                  ^
>>> /nix/store/7wgbxsfygsdmgsai483p205pkcpy6ls8-clang-tools-22.1.8/bin/clang-tidy --use-color -quiet -p /build/source/build /build/source/src/client/channel.cc
Errors encountered while running clang-tidy
[1/1] (1/2) Processing file /build/source/src/client/channel.cc.
[1/1] (2/2) Processing file /build/source/src/client/channel.cc.
FAILED: [code=1] meson-internal__clang-tidy 
/nix/store/sc7hggvmvma7m8bbgmp8gsa1q1x37aq8-meson-1.10.2/bin/meson --internal clangtidy /build/source /build/source/build --color always
ninja: build stopped: subcommand failed.
failed checks.x86_64-linux.clang-tidy 1m 13s
nix-grpc-store-clang-tidy-0.1.0-beta.3: | const & >>> /nix/store/xvjhx2zrkdnccqgf9wbmzlbqqjnbjqdk-clang-tools-22.1.8/b …
nix-grpc-store-clang-tidy-0.1.0-beta.3:
      |                                const      &
>>> /nix/store/xvjhx2zrkdnccqgf9wbmzlbqqjnbjqdk-clang-tools-22.1.8/bin/clang-tidy --use-color -quiet -p /build/source/build /build/source/src/client/channel.cc
Errors encountered while running clang-tidy
[1/1] (1/2) Processing file /build/source/src/client/channel.cc.
[1/1] (2/2) Processing file /build/source/src/client/channel.cc.
FAILED: [code=1] meson-internal__clang-tidy 
/nix/store/jaa89dphx07w3r26y7gh79a7b1mld5p4-meson-1.10.2/bin/meson --internal clangtidy /build/source /build/source/build --color always
ninja: build stopped: subcommand failed.
29 succeeded
succeeded attributes
status attribute duration
loading…
3 already built
skipped attributes
status attribute duration
loading…