nixbot

builds

Mic92/nix-grpc-store build #519 failed

branch maiao.I130c324d0ba2f34431872bfc5edf2ac99da415ae · PR #128 · commit 59869edd0b · · took 12m 7s · eval 18s

3 failed
failed attributes
status attribute duration
failed checks.aarch64-darwin.clang-tidy 6m 12s
nix-grpc-store-clang-tidy-0.1.0-beta.3: | = 0 ../src/pump.hh:276:44: error: the parameter 'initial' o …
nix-grpc-store-clang-tidy-0.1.0-beta.3:
      |                                                      = 0
../src/pump.hh:276:44: error: the parameter 'initial' of type 'std::string' (aka 'basic_string<char>') is copied for each invocation but only used as a const reference; consider making it a const reference [performance-unnecessary-value-param,-warnings-as-errors]
  276 |     static auto makeInitialMsg(std::string initial) -> Msg
      |                                            ^
      |                                const      &
FAILED: [code=1] meson-internal__clang-tidy 
/nix/store/j2s018h6gc2q0z3sw002br2zas3m1l9d-meson-1.10.2/bin/meson --internal clangtidy /nix/var/nix/builds/nix-12824-4142853305/source /nix/var/nix/builds/nix-12824-4142853305/source/build --color always
ninja: build stopped: subcommand failed.
failed checks.aarch64-linux.clang-tidy 1m 23s
nix-grpc-store-clang-tidy-0.1.0-beta.3: | const & >>> /nix/store/7wgbxsfygsdmgsai483p205pkcpy6ls8-clang-tools-22.1.8/b …
nix-grpc-store-clang-tidy-0.1.0-beta.3:
      |                                const      &
>>> /nix/store/7wgbxsfygsdmgsai483p205pkcpy6ls8-clang-tools-22.1.8/bin/clang-tidy --use-color -quiet -p /build/source/build /build/source/src/client/channel.cc
Errors encountered while running clang-tidy
[1/1] (1/2) Processing file /build/source/src/client/channel.cc.
[1/1] (2/2) Processing file /build/source/src/client/channel.cc.
FAILED: [code=1] meson-internal__clang-tidy 
/nix/store/sc7hggvmvma7m8bbgmp8gsa1q1x37aq8-meson-1.10.2/bin/meson --internal clangtidy /build/source /build/source/build --color always
ninja: build stopped: subcommand failed.
failed checks.x86_64-linux.clang-tidy 42s
nix-grpc-store-clang-tidy-0.1.0-beta.3: | ^ >>> /nix/store/xvjhx2zrkdnccqgf9wbmzlbqqjnbjqdk-clang-tools-22.1.8/bin/clang-tidy --use-color …
nix-grpc-store-clang-tidy-0.1.0-beta.3:
      |                  ^
>>> /nix/store/xvjhx2zrkdnccqgf9wbmzlbqqjnbjqdk-clang-tools-22.1.8/bin/clang-tidy --use-color -quiet -p /build/source/build /build/source/src/client/channel.cc
Errors encountered while running clang-tidy
[1/1] (1/2) Processing file /build/source/src/client/channel.cc.
[1/1] (2/2) Processing file /build/source/src/client/channel.cc.
FAILED: [code=1] meson-internal__clang-tidy 
/nix/store/jaa89dphx07w3r26y7gh79a7b1mld5p4-meson-1.10.2/bin/meson --internal clangtidy /build/source /build/source/build --color always
ninja: build stopped: subcommand failed.
29 succeeded
succeeded attributes
status attribute duration
loading…
5 already built
skipped attributes
status attribute duration
loading…