nixbot

builds

Mic92/nix-grpc-store build #521 failed

branch maiao.I19bf67771282fd4ba847246ea36f710d0da24166 · PR #130 · commit 7c92ebf12b · · took 8m 30s · eval 18s

eval warnings 1 kind · 2 occurrences
  • warn services.nix-grpc-farm-lb.workers is deprecated and its addresses are ignored. ×2

5 failed ⚠ 2
failed attributes
status attribute duration
failed checks.aarch64-linux.farm
  • services.nix-grpc-farm-lb.workers is deprecated and its addresses are ignored. Set `systems = [ "aarch64-linux" ];` and give every builder an `advertise` of the form IP:port.
2m 48s
vm-test-run-nix-grpc-farm: lb:50051: no healthy upstream, retrying lb:50051: no healthy upstream, retrying lb:50051: no healthy upstream, retrying lb:50051: no …
vm-test-run-nix-grpc-farm:
lb:50051: no healthy upstream, retrying
lb:50051: no healthy upstream, retrying
lb:50051: no healthy upstream, retrying
lb:50051: no healthy upstream, retrying
lb:50051: no healthy upstream, retrying
lb:50051: no healthy upstream, retrying
error: gRPC QueryMissing on 'lb:50051' failed: no healthy upstream
       hint: Set NIX_GRPC_DEBUG=1 for a handshake trace.
failed checks.x86_64-linux.farm
  • services.nix-grpc-farm-lb.workers is deprecated and its addresses are ignored. Set `systems = [ "x86_64-linux" ];` and give every builder an `advertise` of the form IP:port.
2m 35s
vm-test-run-nix-grpc-farm: lb:50051: no healthy upstream, retrying lb:50051: no healthy upstream, retrying lb:50051: no healthy upstream, retrying lb:50051: no …
vm-test-run-nix-grpc-farm:
lb:50051: no healthy upstream, retrying
lb:50051: no healthy upstream, retrying
lb:50051: no healthy upstream, retrying
lb:50051: no healthy upstream, retrying
lb:50051: no healthy upstream, retrying
lb:50051: no healthy upstream, retrying
error: gRPC QueryMissing on 'lb:50051' failed: no healthy upstream
       hint: Set NIX_GRPC_DEBUG=1 for a handshake trace.
failed checks.aarch64-darwin.clang-tidy 4m 58s
nix-grpc-store-clang-tidy-0.1.0-beta.3: | ^ >>> /nix/store/l8sbl3yky84xqxj3a5hazrjdx52avnf2-clang-tools-22.1.8/bin/clang-tidy --use-color …
nix-grpc-store-clang-tidy-0.1.0-beta.3:
      |                  ^
>>> /nix/store/l8sbl3yky84xqxj3a5hazrjdx52avnf2-clang-tools-22.1.8/bin/clang-tidy --use-color -quiet -p /nix/var/nix/builds/nix-12120-2902983512/source/build /nix/var/nix/builds/nix-12120-2902983512/source/src/client/channel.cc
Errors encountered while running clang-tidy
[1/1] (1/2) Processing file /nix/var/nix/builds/nix-12120-2902983512/source/src/client/channel.cc.
[1/1] (2/2) Processing file /nix/var/nix/builds/nix-12120-2902983512/source/src/client/channel.cc.
FAILED: [code=1] meson-internal__clang-tidy 
/nix/store/j2s018h6gc2q0z3sw002br2zas3m1l9d-meson-1.10.2/bin/meson --internal clangtidy /nix/var/nix/builds/nix-12120-2902983512/source /nix/var/nix/builds/nix-12120-2902983512/source/build --color always
ninja: build stopped: subcommand failed.
failed checks.aarch64-linux.clang-tidy 3m 38s
nix-grpc-store-clang-tidy-0.1.0-beta.3: | ^ >>> /nix/store/7wgbxsfygsdmgsai483p205pkcpy6ls8-clang-tools-22.1.8/bin/clang-tidy --use-color …
nix-grpc-store-clang-tidy-0.1.0-beta.3:
      |                  ^
>>> /nix/store/7wgbxsfygsdmgsai483p205pkcpy6ls8-clang-tools-22.1.8/bin/clang-tidy --use-color -quiet -p /build/source/build /build/source/src/client/channel.cc
Errors encountered while running clang-tidy
[1/1] (1/2) Processing file /build/source/src/client/channel.cc.
[1/1] (2/2) Processing file /build/source/src/client/channel.cc.
FAILED: [code=1] meson-internal__clang-tidy 
/nix/store/sc7hggvmvma7m8bbgmp8gsa1q1x37aq8-meson-1.10.2/bin/meson --internal clangtidy /build/source /build/source/build --color always
ninja: build stopped: subcommand failed.
failed checks.x86_64-linux.clang-tidy 49s
nix-grpc-store-clang-tidy-0.1.0-beta.3: | ^ >>> /nix/store/xvjhx2zrkdnccqgf9wbmzlbqqjnbjqdk-clang-tools-22.1.8/bin/clang-tidy --use-color …
nix-grpc-store-clang-tidy-0.1.0-beta.3:
      |                  ^
>>> /nix/store/xvjhx2zrkdnccqgf9wbmzlbqqjnbjqdk-clang-tools-22.1.8/bin/clang-tidy --use-color -quiet -p /build/source/build /build/source/src/client/channel.cc
Errors encountered while running clang-tidy
[1/1] (1/2) Processing file /build/source/src/client/channel.cc.
[1/1] (2/2) Processing file /build/source/src/client/channel.cc.
FAILED: [code=1] meson-internal__clang-tidy 
/nix/store/jaa89dphx07w3r26y7gh79a7b1mld5p4-meson-1.10.2/bin/meson --internal clangtidy /build/source /build/source/build --color always
ninja: build stopped: subcommand failed.
1 cancelled
cancelled attributes
status attribute duration
loading…
27 succeeded
succeeded attributes
status attribute duration
loading…
4 already built
skipped attributes
status attribute duration
loading…