setup
checks.x86_64-linux.acme-vm
· build #53
· raw
1these 54 derivations will be built:2 /nix/store/dr5hsmkj3fsm9p9zxfw4j5q46d8whgsn-nix-util-tests-run-without-new-syscalls.drv3 /nix/store/knw1phspqj59n0g5yzn3482g7ii7cvgp-nix-util-tests-run.drv4 /nix/store/0r6xsxgdwzi8fsz80pa8ajysg3wg38zg-nix-2.36.0pre20260813_8529b7a.drv5 /nix/store/01wr3b1ix5x9k1n54f98pj1aqzi4wgdf-tmpfiles.d.drv6 /nix/store/nskfqza6mmr6fi2wbkdp329hsgjdk1ab-unit-script-nix-gc-start.drv7 /nix/store/04gp6l58dskcrm5l1y58zpfrz9997119-unit-nix-gc.service.drv8 /nix/store/13y71v606lh11hjbppd2rs8b0z1pd370-user-generators.drv9 /nix/store/1lv22czx6rrx7pblqgnkyldnsfdqh0cp-nix.conf.drv10 /nix/store/jfdxrx7y5nnml26ys8kkxn77044px2x1-nixos-rebuild-ng-26.11.drv11 /nix/store/x3aingjklgf3bqap9ycc0kj51nn5cjn6-nixos-option-26.11.drv12 /nix/store/b9nxr7x7pfixnfac58v3cpr2ax51dak9-system-path.drv13 /nix/store/ip8axb6b4mdk48phqmfdr26pq9nx3l99-X-Restart-Triggers-systemd-tmpfiles-resetup.drv14 /nix/store/376dnkk6mgzlgarfr19i7ql7gf93l1kl-unit-systemd-tmpfiles-resetup.service.drv15 /nix/store/pb04xr8vfxjh2fka4mpz8i0qapf0g4g5-dbus-1.drv16 /nix/store/xvvk1h02ccj66fk6cz22ymj49kbi7cn1-X-Restart-Triggers-dbus-broker.drv17 /nix/store/l6p06vs55mg3idw4l0kxkb51hgqfzb1m-unit-dbus-broker.service.drv18 /nix/store/a48jcsanfampgik607gwl106j4rh0jxj-unit-script-register-nix-paths-start.drv19 /nix/store/lb4ggxhx9ivzk9sg0p8abkn7193ibsxq-unit-register-nix-paths.service.drv20 /nix/store/mfbjwdw0xgmd18jizrq2kl6ir9cc85v3-X-Restart-Triggers-nix-daemon.drv21 /nix/store/s5s5z3m4rb9ikn3afds2zbmx5w6jhjnl-unit-nix-daemon.service.drv22 /nix/store/sibz8sy2039k658lxh10ir3qhi0c3q66-unit-nix-optimise.service.drv23 /nix/store/ar1236792qqj00iiwya1cb0ps9iq6mvk-system-units.drv24 /nix/store/fhlsijxb9xpvyhm3bnxd4r0zigxkjw84-system-shutdown.drv25 /nix/store/jsdpppr84fpi4ws0wx64x4lfyhnskbd1-system-generators.drv26 /nix/store/qwg9q65afsnf36mm35j60kgzd19a4sqj-unit-dbus-broker.service.drv27 /nix/store/m3480bkyw4k2klyak71f8xjfm1gy8rsx-user-units.drv28 /nix/store/x5b2p8ps9qafg3rb0q8qwy0l8hl2ap9y-etc.drv29 /nix/store/vn76g4z36q2l6qc8b9hxmyrc3vljwzmk-activate.drv30 /nix/store/gz2yng6pfjhz4x8n1vh9rv6jgvbdi80b-nixos-system-server-test.drv31 /nix/store/gz8w8d8hilv37bfimacvqzxviyb7s8vd-closure-info.drv32 /nix/store/m0scc7799d5rz16yc1ifwdndda7wnmxa-run-nixos-vm.drv33 /nix/store/maxsi7kf1lc3rl3hjgmy54fswabpx655-nixos-vm.drv34 /nix/store/49sp1dy7vhgvrqlh8dq57d67pr1a8n97-user-generators.drv35 /nix/store/5a113ia0s02rxmzzx5nhs3a9k4d9iyil-system-shutdown.drv36 /nix/store/9lb3nsdqr377als2i3l2r1pw34nrniyp-system-path.drv37 /nix/store/859sqc1n5wzymjc89h417z625sn7p2cc-dbus-1.drv38 /nix/store/96d92v4hrbhcwrbh02fdky5p8g75m5w2-nix.conf.drv39 /nix/store/s448csqikh85qbkrqyygchpg9y9d0zqi-X-Restart-Triggers-nix-daemon.drv40 /nix/store/jrzldvydkb8cvqgdc4sf5rzjpccx2c39-unit-nix-daemon.service.drv41 /nix/store/5hp8cpyilhk8g3fiw0rsnrcr8gcq12l5-X-Restart-Triggers-dbus-broker.drv42 /nix/store/vlpw591ngjrvgs435p9b3wq873cgma6i-unit-dbus-broker.service.drv43 /nix/store/hgzng6pxlg1s9nvf7jfrj8f6jcnc6n8m-system-units.drv44 /nix/store/rai4rad608n333rsr3gvm43qfvj8nl2s-unit-dbus-broker.service.drv45 /nix/store/p4h7gxaphwgnz6x5s6c2zcx5hgasabga-user-units.drv46 /nix/store/paylaz2zn5h609nc9f4xr2lkbxbfhvr7-system-generators.drv47 /nix/store/c4jm34r14arnwsn1b1hmk6w6xvyscqg4-etc.drv48 /nix/store/6qcb2gzfhny5f3ampcx5z400ixlmkwrb-activate.drv49 /nix/store/gf7qvj3hb18v4942isnz9q9vjnjgkcrl-nixos-system-host1-test.drv50 /nix/store/kq0f27338vnjzzqfm877g6vfmj87385i-closure-info.drv51 /nix/store/3fpi2yzrdnn576q1z4hzv3vdaqsa0rbb-run-nixos-vm.drv52 /nix/store/miwjcxrwjd359rk0s2r3y07634vpx7rg-nixos-vm.drv53 /nix/store/zz61cn2gz7q7d38qfhxq5khzl6d7ff2s-driverConfiguration.json.drv54 /nix/store/2ajyg8j4lfy9bn6mkg5azr7ffxhs7avj-nixos-test-driver-nix-grpc-store-acme-substituter.drv55 /nix/store/g31c5s1l70sfvsdi8l55xkym2bmyb1k3-vm-test-run-nix-grpc-store-acme-substituter.drv56error: Cannot build '/nix/store/dr5hsmkj3fsm9p9zxfw4j5q46d8whgsn-nix-util-tests-run-without-new-syscalls.drv'.57 Reason: builder failed with exit code 1.58 Output paths:59 /nix/store/0k3n7ggc8x05bmscackrcnz247sibcrl-nix-util-tests-run-without-new-syscalls60 Last 25 log lines:61 > [ RUN ] Unix/UrlPathTest.urlPathToPath/absolute_path62 > [ OK ] Unix/UrlPathTest.urlPathToPath/absolute_path (0 ms)63 > [ RUN ] Unix/UrlPathTest.urlPathToPath/root_path64 > [ OK ] Unix/UrlPathTest.urlPathToPath/root_path (0 ms)65 > [ RUN ] Unix/UrlPathTest.urlToString/absolute_path66 > [ OK ] Unix/UrlPathTest.urlToString/absolute_path (0 ms)67 > [ RUN ] Unix/UrlPathTest.urlToString/root_path68 > [ OK ] Unix/UrlPathTest.urlToString/root_path (0 ms)69 > [ RUN ] Unix/UrlPathTest.stringToUrl/absolute_path70 > [ OK ] Unix/UrlPathTest.stringToUrl/absolute_path (0 ms)71 > [ RUN ] Unix/UrlPathTest.stringToUrl/root_path72 > [ OK ] Unix/UrlPathTest.stringToUrl/root_path (0 ms)73 > [----------] 8 tests from Unix/UrlPathTest (0 ms total)74 >75 > [----------] Global test environment tear-down76 > [==========] 775 tests from 145 test suites ran. (2932 ms total)77 > [ PASSED ] 773 tests.78 > [ SKIPPED ] 1 test, listed below:79 > [ SKIPPED ] CompressionDecompression/CompressionDecompressionTest.invalidDecompression/none80 > [ FAILED ] 1 test, listed below:81 > [ FAILED ] sourceToSink.forcedUnwindUcaughtExceptions82 >83 > 1 FAILED TEST84 > YOU HAVE 1 DISABLED TEST85 >86 For full logs, run:87 nix log /nix/store/dr5hsmkj3fsm9p9zxfw4j5q46d8whgsn-nix-util-tests-run-without-new-syscalls.drv88error: Cannot build '/nix/store/knw1phspqj59n0g5yzn3482g7ii7cvgp-nix-util-tests-run.drv'.89 Reason: builder failed with exit code 1.90 Output paths:91 /nix/store/3dhvzccgv49wlr8anvmk98b7597zbbd0-nix-util-tests-run92 Last 25 log lines:93 > [ RUN ] Unix/UrlPathTest.urlPathToPath/absolute_path94 > [ OK ] Unix/UrlPathTest.urlPathToPath/absolute_path (0 ms)95 > [ RUN ] Unix/UrlPathTest.urlPathToPath/root_path96 > [ OK ] Unix/UrlPathTest.urlPathToPath/root_path (0 ms)97 > [ RUN ] Unix/UrlPathTest.urlToString/absolute_path98 > [ OK ] Unix/UrlPathTest.urlToString/absolute_path (0 ms)99 > [ RUN ] Unix/UrlPathTest.urlToString/root_path100 > [ OK ] Unix/UrlPathTest.urlToString/root_path (0 ms)101 > [ RUN ] Unix/UrlPathTest.stringToUrl/absolute_path102 > [ OK ] Unix/UrlPathTest.stringToUrl/absolute_path (0 ms)103 > [ RUN ] Unix/UrlPathTest.stringToUrl/root_path104 > [ OK ] Unix/UrlPathTest.stringToUrl/root_path (0 ms)105 > [----------] 8 tests from Unix/UrlPathTest (0 ms total)106 >107 > [----------] Global test environment tear-down108 > [==========] 775 tests from 145 test suites ran. (3005 ms total)109 > [ PASSED ] 773 tests.110 > [ SKIPPED ] 1 test, listed below:111 > [ SKIPPED ] CompressionDecompression/CompressionDecompressionTest.invalidDecompression/none112 > [ FAILED ] 1 test, listed below:113 > [ FAILED ] sourceToSink.forcedUnwindUcaughtExceptions114 >115 > 1 FAILED TEST116 > YOU HAVE 1 DISABLED TEST117 >118 For full logs, run:119 nix log /nix/store/knw1phspqj59n0g5yzn3482g7ii7cvgp-nix-util-tests-run.drv120error: Cannot build '/nix/store/0r6xsxgdwzi8fsz80pa8ajysg3wg38zg-nix-2.36.0pre20260813_8529b7a.drv'.121 Reason: 2 dependencies failed.122 Output paths:123 /nix/store/0r13shg5b7kc9rlxpm5pf8gi7x8rd46y-nix-2.36.0pre20260813_8529b7a-doc124 /nix/store/j3mhpd4gl440ycdz9jk9sc91aqrglb6d-nix-2.36.0pre20260813_8529b7a-man125 /nix/store/j707z6zqaja58wjrl82kayc5m1wl2rx7-nix-2.36.0pre20260813_8529b7a-dev126 /nix/store/vkykvvj246czchby8bldg73i43c7zsr8-nix-2.36.0pre20260813_8529b7a127error: Cannot build '/nix/store/0r6xsxgdwzi8fsz80pa8ajysg3wg38zg-nix-2.36.0pre20260813_8529b7a.drv'.128 Reason: 2 dependencies failed.129 Output paths:130 /nix/store/0r13shg5b7kc9rlxpm5pf8gi7x8rd46y-nix-2.36.0pre20260813_8529b7a-doc131 /nix/store/j3mhpd4gl440ycdz9jk9sc91aqrglb6d-nix-2.36.0pre20260813_8529b7a-man132 /nix/store/j707z6zqaja58wjrl82kayc5m1wl2rx7-nix-2.36.0pre20260813_8529b7a-dev133 /nix/store/vkykvvj246czchby8bldg73i43c7zsr8-nix-2.36.0pre20260813_8529b7a134error: Cannot build '/nix/store/0r6xsxgdwzi8fsz80pa8ajysg3wg38zg-nix-2.36.0pre20260813_8529b7a.drv'.135 Reason: 2 dependencies failed.136 Output paths:137 /nix/store/0r13shg5b7kc9rlxpm5pf8gi7x8rd46y-nix-2.36.0pre20260813_8529b7a-doc138 /nix/store/j3mhpd4gl440ycdz9jk9sc91aqrglb6d-nix-2.36.0pre20260813_8529b7a-man139 /nix/store/j707z6zqaja58wjrl82kayc5m1wl2rx7-nix-2.36.0pre20260813_8529b7a-dev140 /nix/store/vkykvvj246czchby8bldg73i43c7zsr8-nix-2.36.0pre20260813_8529b7a141error: Cannot build '/nix/store/1lv22czx6rrx7pblqgnkyldnsfdqh0cp-nix.conf.drv'.142 Reason: 1 dependency failed.143 Output paths:144 /nix/store/zm65dhw9c9924qb2py3kw93ma5yqjmni-nix.conf145error: Cannot build '/nix/store/96d92v4hrbhcwrbh02fdky5p8g75m5w2-nix.conf.drv'.146 Reason: 1 dependency failed.147 Output paths:148 /nix/store/cpryc4aiqhnq03xljljbrbb5kg0c2hy8-nix.conf149error: Cannot build '/nix/store/x3aingjklgf3bqap9ycc0kj51nn5cjn6-nixos-option-26.11.drv'.150 Reason: 1 dependency failed.151 Output paths:152 /nix/store/yi5pr6mw4r01p0xxkb5sby83nhdpcngk-nixos-option-26.11153error: Cannot build '/nix/store/jfdxrx7y5nnml26ys8kkxn77044px2x1-nixos-rebuild-ng-26.11.drv'.154 Reason: 1 dependency failed.155 Output paths:156 /nix/store/qh8159p8nq019p9pwf6yramism6vlmll-nixos-rebuild-ng-26.11-dist157 /nix/store/yrh60p2s9bkdc7798syn0nhwrwyil9qp-nixos-rebuild-ng-26.11158error: Cannot build '/nix/store/jsdpppr84fpi4ws0wx64x4lfyhnskbd1-system-generators.drv'.159 Reason: 1 dependency failed.160 Output paths:161 /nix/store/ni54s16gkx442i4963n3n5phz10lk3ng-system-generators162error: Cannot build '/nix/store/paylaz2zn5h609nc9f4xr2lkbxbfhvr7-system-generators.drv'.163 Reason: 1 dependency failed.164 Output paths:165 /nix/store/7ia0sbwd12ck4ag4x9swhr5cd8hq27jd-system-generators166error: Cannot build '/nix/store/5a113ia0s02rxmzzx5nhs3a9k4d9iyil-system-shutdown.drv'.167 Reason: 1 dependency failed.168 Output paths:169 /nix/store/l6r0b3bjrmp6hdmiysiks740w1gayr30-system-shutdown170error: Cannot build '/nix/store/fhlsijxb9xpvyhm3bnxd4r0zigxkjw84-system-shutdown.drv'.171 Reason: 1 dependency failed.172 Output paths:173 /nix/store/w1dzizngc8fczpbc3rcpjvyl5mqjz9az-system-shutdown174error: Cannot build '/nix/store/01wr3b1ix5x9k1n54f98pj1aqzi4wgdf-tmpfiles.d.drv'.175 Reason: 1 dependency failed.176 Output paths:177 /nix/store/i9q71xlw9i83jb60f417pn5d8yrd9aa9-tmpfiles.d178error: Cannot build '/nix/store/sibz8sy2039k658lxh10ir3qhi0c3q66-unit-nix-optimise.service.drv'.179 Reason: 1 dependency failed.180 Output paths:181 /nix/store/rh1pkid9iwjxb2dn29p0gl7m514jfibg-unit-nix-optimise.service182error: Cannot build '/nix/store/nskfqza6mmr6fi2wbkdp329hsgjdk1ab-unit-script-nix-gc-start.drv'.183 Reason: 1 dependency failed.184 Output paths:185 /nix/store/m7pjnj8q6xxdy34arh1szkhk1rv4m6jn-unit-script-nix-gc-start186error: Cannot build '/nix/store/a48jcsanfampgik607gwl106j4rh0jxj-unit-script-register-nix-paths-start.drv'.187 Reason: 1 dependency failed.188 Output paths:189 /nix/store/bwaa9zjb2k0myf6grv9lvzvsf11gxkac-unit-script-register-nix-paths-start190error: Cannot build '/nix/store/13y71v606lh11hjbppd2rs8b0z1pd370-user-generators.drv'.191 Reason: 1 dependency failed.192 Output paths:193 /nix/store/by0xlj5kffjxaa7gvg66xmzgi9j1qcc8-user-generators194error: Cannot build '/nix/store/49sp1dy7vhgvrqlh8dq57d67pr1a8n97-user-generators.drv'.195 Reason: 1 dependency failed.196 Output paths:197 /nix/store/xm7j947plcgp3gnm46ikq9fxj1657d0v-user-generators198error: Cannot build '/nix/store/mfbjwdw0xgmd18jizrq2kl6ir9cc85v3-X-Restart-Triggers-nix-daemon.drv'.199 Reason: 1 dependency failed.200 Output paths:201 /nix/store/pkiakir4fpza2l88lxi45sc0z0ri9367-X-Restart-Triggers-nix-daemon202error: Cannot build '/nix/store/s448csqikh85qbkrqyygchpg9y9d0zqi-X-Restart-Triggers-nix-daemon.drv'.203 Reason: 1 dependency failed.204 Output paths:205 /nix/store/3b10gk418ip3y7cl6jz4brq4y0izsr60-X-Restart-Triggers-nix-daemon206error: Cannot build '/nix/store/ip8axb6b4mdk48phqmfdr26pq9nx3l99-X-Restart-Triggers-systemd-tmpfiles-resetup.drv'.207 Reason: 1 dependency failed.208 Output paths:209 /nix/store/wndji6rg70vgim7v960d88ii6dxd8bh6-X-Restart-Triggers-systemd-tmpfiles-resetup210error: Cannot build '/nix/store/9lb3nsdqr377als2i3l2r1pw34nrniyp-system-path.drv'.211 Reason: 5 dependencies failed.212 Output paths:213 /nix/store/vlgh50i3icircq2fhifnywpdfhsqsrnq-system-path214error: Cannot build '/nix/store/b9nxr7x7pfixnfac58v3cpr2ax51dak9-system-path.drv'.215 Reason: 5 dependencies failed.216 Output paths:217 /nix/store/vgalzp8s2av9g1xjrz4dbxmkxn0jk11w-system-path218error: Cannot build '/nix/store/04gp6l58dskcrm5l1y58zpfrz9997119-unit-nix-gc.service.drv'.219 Reason: 1 dependency failed.220 Output paths:221 /nix/store/wyalyw8y3ch0biiwn9cjvw6ixasff6ip-unit-nix-gc.service222error: Cannot build '/nix/store/lb4ggxhx9ivzk9sg0p8abkn7193ibsxq-unit-register-nix-paths.service.drv'.223 Reason: 1 dependency failed.224 Output paths:225 /nix/store/vl0rfmhv1va02jmyg6iiq56s02m8wbrr-unit-register-nix-paths.service226error: Cannot build '/nix/store/859sqc1n5wzymjc89h417z625sn7p2cc-dbus-1.drv'.227 Reason: 1 dependency failed.228 Output paths:229 /nix/store/svahij7qwrcw5rh6h8ayny3dcymd92fq-dbus-1230error: Cannot build '/nix/store/pb04xr8vfxjh2fka4mpz8i0qapf0g4g5-dbus-1.drv'.231 Reason: 1 dependency failed.232 Output paths:233 /nix/store/hwpx2b1lvz7gz9kx6cd7bm7sb4nb9h6c-dbus-1234error: Cannot build '/nix/store/jrzldvydkb8cvqgdc4sf5rzjpccx2c39-unit-nix-daemon.service.drv'.235 Reason: 2 dependencies failed.236 Output paths:237 /nix/store/apmzwg1yiz3659ry22m1c74x6aazvx6z-unit-nix-daemon.service238error: Cannot build '/nix/store/s5s5z3m4rb9ikn3afds2zbmx5w6jhjnl-unit-nix-daemon.service.drv'.239 Reason: 2 dependencies failed.240 Output paths:241 /nix/store/kz3ph6p663rxfvazwg7733w0hp8wf6a0-unit-nix-daemon.service242error: Cannot build '/nix/store/376dnkk6mgzlgarfr19i7ql7gf93l1kl-unit-systemd-tmpfiles-resetup.service.drv'.243 Reason: 1 dependency failed.244 Output paths:245 /nix/store/i90yj13ip0fnv37c076295a2vvhb1b57-unit-systemd-tmpfiles-resetup.service246error: Cannot build '/nix/store/5hp8cpyilhk8g3fiw0rsnrcr8gcq12l5-X-Restart-Triggers-dbus-broker.drv'.247 Reason: 1 dependency failed.248 Output paths:249 /nix/store/0gxn2zwn69yaqcsnal9f4ghngjaskdfn-X-Restart-Triggers-dbus-broker250error: Cannot build '/nix/store/xvvk1h02ccj66fk6cz22ymj49kbi7cn1-X-Restart-Triggers-dbus-broker.drv'.251 Reason: 1 dependency failed.252 Output paths:253 /nix/store/ch1aybsyixvsxqhkmqlf662mzkip4j88-X-Restart-Triggers-dbus-broker254error: Cannot build '/nix/store/l6p06vs55mg3idw4l0kxkb51hgqfzb1m-unit-dbus-broker.service.drv'.255 Reason: 1 dependency failed.256 Output paths:257 /nix/store/swqbfzxardv69cc633wfz8acif3yy6ag-unit-dbus-broker.service258error: Cannot build '/nix/store/qwg9q65afsnf36mm35j60kgzd19a4sqj-unit-dbus-broker.service.drv'.259 Reason: 1 dependency failed.260 Output paths:261 /nix/store/17agps5dajlfkr7yngaj9s9r21hd26xf-unit-dbus-broker.service262error: Cannot build '/nix/store/rai4rad608n333rsr3gvm43qfvj8nl2s-unit-dbus-broker.service.drv'.263 Reason: 1 dependency failed.264 Output paths:265 /nix/store/v54yi9qy7yj636ybs696mxnlvhhfbvvg-unit-dbus-broker.service266error: Cannot build '/nix/store/vlpw591ngjrvgs435p9b3wq873cgma6i-unit-dbus-broker.service.drv'.267 Reason: 1 dependency failed.268 Output paths:269 /nix/store/7skcrzhgz4sn81xsq06ka2syfnknixix-unit-dbus-broker.service270error: Cannot build '/nix/store/ar1236792qqj00iiwya1cb0ps9iq6mvk-system-units.drv'.271 Reason: 7 dependencies failed.272 Output paths:273 /nix/store/jwg1v9p6zl9i8ymyc84xwn45k6zmnzh4-system-units274error: Cannot build '/nix/store/hgzng6pxlg1s9nvf7jfrj8f6jcnc6n8m-system-units.drv'.275 Reason: 7 dependencies failed.276 Output paths:277 /nix/store/nilpzwg8z0x6325cifj2ybfxfgq9h6mg-system-units278error: Cannot build '/nix/store/m3480bkyw4k2klyak71f8xjfm1gy8rsx-user-units.drv'.279 Reason: 2 dependencies failed.280 Output paths:281 /nix/store/rf8sw7j0dax1w75n87dfjpvdvb4bg6l1-user-units282error: Cannot build '/nix/store/p4h7gxaphwgnz6x5s6c2zcx5hgasabga-user-units.drv'.283 Reason: 2 dependencies failed.284 Output paths:285 /nix/store/ik3k7yxhd154v10b2xpahkznpf0r8z9g-user-units286error: Cannot build '/nix/store/c4jm34r14arnwsn1b1hmk6w6xvyscqg4-etc.drv'.287 Reason: 9 dependencies failed.288 Output paths:289 /nix/store/1xxqnb3255ibd79mf3dzlvgair82bfn6-etc290error: Cannot build '/nix/store/x5b2p8ps9qafg3rb0q8qwy0l8hl2ap9y-etc.drv'.291 Reason: 9 dependencies failed.292 Output paths:293 /nix/store/9a3f1mi985silbm63x5r5k2bja89ig26-etc294error: Cannot build '/nix/store/6qcb2gzfhny5f3ampcx5z400ixlmkwrb-activate.drv'.295 Reason: 1 dependency failed.296 Output paths:297 /nix/store/9kp4994pynj0phbd6f740qg9n5y7iscv-activate298error: Cannot build '/nix/store/vn76g4z36q2l6qc8b9hxmyrc3vljwzmk-activate.drv'.299 Reason: 1 dependency failed.300 Output paths:301 /nix/store/jamizxjxm7pccmfvr38jb4igrl57mc9w-activate302error: Cannot build '/nix/store/gf7qvj3hb18v4942isnz9q9vjnjgkcrl-nixos-system-host1-test.drv'.303 Reason: 3 dependencies failed.304 Output paths:305 /nix/store/zy35g8d1m7mj88r2mms7cn6xg716m15z-nixos-system-host1-test306error: Cannot build '/nix/store/gz2yng6pfjhz4x8n1vh9rv6jgvbdi80b-nixos-system-server-test.drv'.307 Reason: 3 dependencies failed.308 Output paths:309 /nix/store/pbd59nbf8cjylwifj5kghm73ic96bai7-nixos-system-server-test310error: Cannot build '/nix/store/gz8w8d8hilv37bfimacvqzxviyb7s8vd-closure-info.drv'.311 Reason: 1 dependency failed.312 Output paths:313 /nix/store/sf2fqmivm8mq9yg1qc6976spdk4fls4z-closure-info314error: Cannot build '/nix/store/kq0f27338vnjzzqfm877g6vfmj87385i-closure-info.drv'.315 Reason: 1 dependency failed.316 Output paths:317 /nix/store/v76wgxm3jp4gc6w8r385i34xc8bkbzaa-closure-info318error: Cannot build '/nix/store/3fpi2yzrdnn576q1z4hzv3vdaqsa0rbb-run-nixos-vm.drv'.319 Reason: 2 dependencies failed.320 Output paths:321 /nix/store/nkih7v67gh2rr99wrk5z22s28pmz6iy7-run-nixos-vm322error: Cannot build '/nix/store/m0scc7799d5rz16yc1ifwdndda7wnmxa-run-nixos-vm.drv'.323 Reason: 2 dependencies failed.324 Output paths:325 /nix/store/6yxjfchp3bz944r56jm6kbp7ychdh4r1-run-nixos-vm326error: Cannot build '/nix/store/maxsi7kf1lc3rl3hjgmy54fswabpx655-nixos-vm.drv'.327 Reason: 2 dependencies failed.328 Output paths:329 /nix/store/rqk08ccxv08r2s6hr8vqgmbsh5qynkx0-nixos-vm330error: Cannot build '/nix/store/miwjcxrwjd359rk0s2r3y07634vpx7rg-nixos-vm.drv'.331 Reason: 2 dependencies failed.332 Output paths:333 /nix/store/3p4a3rl3z17ivkf4w8kch171j37rgp3z-nixos-vm334error: Cannot build '/nix/store/zz61cn2gz7q7d38qfhxq5khzl6d7ff2s-driverConfiguration.json.drv'.335 Reason: 2 dependencies failed.336 Output paths:337 /nix/store/y7xvdfk5dhgnf6jwk8xfsrxprjrx0dmx-driverConfiguration.json338error: Cannot build '/nix/store/2ajyg8j4lfy9bn6mkg5azr7ffxhs7avj-nixos-test-driver-nix-grpc-store-acme-substituter.drv'.339 Reason: 1 dependency failed.340 Output paths:341 /nix/store/9zdkm6xvp5y9m9i0myf3aijafy6m2lnm-nixos-test-driver-nix-grpc-store-acme-substituter342error: Cannot build '/nix/store/g31c5s1l70sfvsdi8l55xkym2bmyb1k3-vm-test-run-nix-grpc-store-acme-substituter.drv'.343 Reason: 1 dependency failed.344 Output paths:345 /nix/store/27c7fsijh4d1g9ncs66rh08qlvmclx1b-vm-test-run-nix-grpc-store-acme-substituter