nixbot

builds

Mic92/nix-grpc-store build #568 failed

branch main · PR #150 · commit 8aa13c7a10 · · took 12m 18s · eval 19s

4 failed
failed attributes
status attribute duration
failed checks.aarch64-darwin.clang-tidy 1m 52s
nix-grpc-store-clang-tidy-0.1.0-beta.4: 85 | throw nix::Error("cannot read the spool file: %s", count == 0 ? "short file" : std::strerror …
nix-grpc-store-clang-tidy-0.1.0-beta.4:
   85 |                     throw nix::Error("cannot read the spool file: %s", count == 0 ? "short file" : std::strerror(errno));
      |                                                                                                    ^
../src/daemon/upload-spool.hh:106:30: error: parameter name 'fd' is too short, expected at least 3 characters [readability-identifier-length,-warnings-as-errors]
  106 |     static auto writeAll(int fd, std::span<const char> data, std::uint64_t offset) -> bool
      |                              ^
FAILED: [code=1] meson-internal__clang-tidy 
/nix/store/j2s018h6gc2q0z3sw002br2zas3m1l9d-meson-1.10.2/bin/meson --internal clangtidy /nix/var/nix/builds/nix-33170-698824128/source /nix/var/nix/builds/nix-33170-698824128/source/build --color always
ninja: build stopped: subcommand failed.
failed checks.aarch64-linux.clang-tidy 1m 20s
nix-grpc-store-clang-tidy-0.1.0-beta.4: 85 | throw nix::Error("cannot read the spool file: %s", count == 0 ? "short file" : std::strerror …
nix-grpc-store-clang-tidy-0.1.0-beta.4:
   85 |                     throw nix::Error("cannot read the spool file: %s", count == 0 ? "short file" : std::strerror(errno));
      |                                                                                                    ^
../src/daemon/upload-spool.hh:106:30: error: parameter name 'fd' is too short, expected at least 3 characters [readability-identifier-length,-warnings-as-errors]
  106 |     static auto writeAll(int fd, std::span<const char> data, std::uint64_t offset) -> bool
      |                              ^
FAILED: [code=1] meson-internal__clang-tidy 
/nix/store/sc7hggvmvma7m8bbgmp8gsa1q1x37aq8-meson-1.10.2/bin/meson --internal clangtidy /build/source /build/source/build --color always
ninja: build stopped: subcommand failed.
failed checks.aarch64-linux.farm 5m 2s
vm-test-run-nix-grpc-farm: exec(self.tests, symbols, None) ~~~~^^^^^^^^^^^^^^^^^^^^^^^^^^^ File "<string>", line 42, in <module> File "<string>", li …
vm-test-run-nix-grpc-farm:
    exec(self.tests, symbols, None)
    ~~~~^^^^^^^^^^^^^^^^^^^^^^^^^^^
  File "<string>", line 42, in <module>
  File "<string>", line 10, in run_e2e
  File "/nix/store/3fl7bdkdxk2k4nssy1d1161isbzn6bsr-python3-3.14.7/lib/python3.14/subprocess.py", line 578, in run
    raise CalledProcessError(retcode, process.args,
                             output=stdout, stderr=stderr)
subprocess.CalledProcessError: Command '['/nix/store/sdsxm86x3s3564mf39xgdkizl89p0r1p-nix-grpc-e2e/bin/nix-grpc-e2e', 'farm::serial::', '--test-threads=1', '--nocapture']' returned non-zero exit status 101.
failed checks.x86_64-linux.clang-tidy 1m 0s
nix-grpc-store-clang-tidy-0.1.0-beta.4: 85 | throw nix::Error("cannot read the spool file: %s", count == 0 ? "short file" : std::strerror …
nix-grpc-store-clang-tidy-0.1.0-beta.4:
   85 |                     throw nix::Error("cannot read the spool file: %s", count == 0 ? "short file" : std::strerror(errno));
      |                                                                                                    ^
../src/daemon/upload-spool.hh:106:30: error: parameter name 'fd' is too short, expected at least 3 characters [readability-identifier-length,-warnings-as-errors]
  106 |     static auto writeAll(int fd, std::span<const char> data, std::uint64_t offset) -> bool
      |                              ^
FAILED: [code=1] meson-internal__clang-tidy 
/nix/store/jaa89dphx07w3r26y7gh79a7b1mld5p4-meson-1.10.2/bin/meson --internal clangtidy /build/source /build/source/build --color always
ninja: build stopped: subcommand failed.
28 succeeded
succeeded attributes
status attribute duration
loading…
5 already built
skipped attributes
status attribute duration
loading…