nixbot

builds

Mic92/nix-grpc-store build #578 failed

branch main · PR #156 · commit f3b8483598 · · took 12m 8s · eval 19s

3 failed
failed attributes
status attribute duration
failed checks.aarch64-darwin.clang-tidy 2m 6s
nix-grpc-store-clang-tidy-0.1.0-beta.4: | ^~~~~~~~~ >>> /nix/store/l8sbl3yky84xqxj3a5hazrjdx52avn …
nix-grpc-store-clang-tidy-0.1.0-beta.4:
      |                                                          ^~~~~~~~~
>>> /nix/store/l8sbl3yky84xqxj3a5hazrjdx52avnf2-clang-tools-22.1.8/bin/clang-tidy --use-color -quiet -p /nix/var/nix/builds/nix-4997-3275984672/source/build /nix/var/nix/builds/nix-4997-3275984672/source/src/client/channel.cc
Errors encountered while running clang-tidy
[1/1] (1/2) Processing file /nix/var/nix/builds/nix-4997-3275984672/source/src/client/channel.cc.
[1/1] (2/2) Processing file /nix/var/nix/builds/nix-4997-3275984672/source/src/client/channel.cc.
FAILED: [code=1] meson-internal__clang-tidy 
/nix/store/j2s018h6gc2q0z3sw002br2zas3m1l9d-meson-1.10.2/bin/meson --internal clangtidy /nix/var/nix/builds/nix-4997-3275984672/source /nix/var/nix/builds/nix-4997-3275984672/source/build --color always
ninja: build stopped: subcommand failed.
failed checks.aarch64-linux.clang-tidy 1m 15s
nix-grpc-store-clang-tidy-0.1.0-beta.4: 18 | >>> /nix/store/7wgbxsfygsdmgsai483p205pkcpy6ls8-clang-tools-22.1.8/bin/clang-tidy --use-color -quiet -p /build/ …
nix-grpc-store-clang-tidy-0.1.0-beta.4:
   18 | 
>>> /nix/store/7wgbxsfygsdmgsai483p205pkcpy6ls8-clang-tools-22.1.8/bin/clang-tidy --use-color -quiet -p /build/source/build /build/source/src/client/channel.cc
Errors encountered while running clang-tidy
[1/1] (1/2) Processing file /build/source/src/client/channel.cc.
[1/1] (2/2) Processing file /build/source/src/client/channel.cc.
FAILED: [code=1] meson-internal__clang-tidy 
/nix/store/sc7hggvmvma7m8bbgmp8gsa1q1x37aq8-meson-1.10.2/bin/meson --internal clangtidy /build/source /build/source/build --color always
ninja: build stopped: subcommand failed.
failed checks.x86_64-linux.clang-tidy 54s
nix-grpc-store-clang-tidy-0.1.0-beta.4: 18 | >>> /nix/store/xvjhx2zrkdnccqgf9wbmzlbqqjnbjqdk-clang-tools-22.1.8/bin/clang-tidy --use-color -quiet -p /build/ …
nix-grpc-store-clang-tidy-0.1.0-beta.4:
   18 | 
>>> /nix/store/xvjhx2zrkdnccqgf9wbmzlbqqjnbjqdk-clang-tools-22.1.8/bin/clang-tidy --use-color -quiet -p /build/source/build /build/source/src/client/channel.cc
Errors encountered while running clang-tidy
[1/1] (1/2) Processing file /build/source/src/client/channel.cc.
[1/1] (2/2) Processing file /build/source/src/client/channel.cc.
FAILED: [code=1] meson-internal__clang-tidy 
/nix/store/jaa89dphx07w3r26y7gh79a7b1mld5p4-meson-1.10.2/bin/meson --internal clangtidy /build/source /build/source/build --color always
ninja: build stopped: subcommand failed.
29 succeeded
succeeded attributes
status attribute duration
loading…
5 already built
skipped attributes
status attribute duration
loading…