nixbot

builds

Mic92/nix-grpc-store build #607 failed

branch main · PR #177 · commit 844ecac1cc · · took 7m 33s · eval 26s

22 failed
failed attributes
status attribute duration
failed checks.aarch64-darwin.clang-tidy 4m 7s
nix-grpc-store-clang-tidy-0.1.0: 1243 | return status_internal::MakeError<StatusCode::kUnimplemented>(message, loc); | ^~~~~~ …
nix-grpc-store-clang-tidy-0.1.0:
 1243 |   return status_internal::MakeError<StatusCode::kUnimplemented>(message, loc);
      |                           ^~~~~~~~~
/nix/store/v5f7g13znbvq5mb4ghmjwg462xna46p4-abseil-cpp-20260817.0-dev/include/absl/status/status.h:1247:27: error: no member named 'MakeError' in namespace 'absl::status_internal' [clang-diagnostic-error]
 1247 |   return status_internal::MakeError<StatusCode::kUnknown>(message, loc);
      |                           ^~~~~~~~~
FAILED: [code=1] meson-internal__clang-tidy 
/nix/store/yjl5dwm08zmfsjrqyidrvcgm59qlgmxz-meson-1.12.1/bin/meson --internal clangtidy /nix/var/nix/builds/nix-90826-4205630675/source /nix/var/nix/builds/nix-90826-4205630675/source/build --color always
ninja: build stopped: subcommand failed.
failed checks.aarch64-darwin.exit-stress 6m 30s
nix-grpc-store-0.1.0: [12/50] Compiling C++ object scheduler-test.p/tests_scheduler-test.cc.o [13/50] Precompiling header ../pch/client_pch.hh [14/50] Precompil …
nix-grpc-store-0.1.0:
[12/50] Compiling C++ object scheduler-test.p/tests_scheduler-test.cc.o
[13/50] Precompiling header ../pch/client_pch.hh
[14/50] Precompiling header ../pch/daemon_pch.hh
[15/50] Compiling C++ object libnix-grpc-dispatcher.a.p/src_daemon_dispatcher.cc.o
[16/50] Compiling C++ object dispatcher-bench.p/tests_dispatcher-bench.cc.o
[17/50] Compiling C++ object scheduler-grpc-bench.p/meson-generated_.._nix_remote.grpc.pb.cc.o
[18/50] Compiling C++ object scheduler-grpc-bench.p/tests_scheduler-grpc-bench.cc.o
ninja: build stopped: subcommand failed.
failed checks.aarch64-darwin.plugin-dispatcher 2m 24s
nix-grpc-store-0.1.0: [12/50] Compiling C++ object scheduler-test.p/tests_scheduler-test.cc.o [13/50] Precompiling header ../pch/client_pch.hh [14/50] Precompil …
nix-grpc-store-0.1.0:
[12/50] Compiling C++ object scheduler-test.p/tests_scheduler-test.cc.o
[13/50] Precompiling header ../pch/client_pch.hh
[14/50] Precompiling header ../pch/daemon_pch.hh
[15/50] Compiling C++ object libnix-grpc-dispatcher.a.p/src_daemon_dispatcher.cc.o
[16/50] Compiling C++ object dispatcher-bench.p/tests_dispatcher-bench.cc.o
[17/50] Compiling C++ object scheduler-grpc-bench.p/meson-generated_.._nix_remote.grpc.pb.cc.o
[18/50] Compiling C++ object scheduler-grpc-bench.p/tests_scheduler-grpc-bench.cc.o
ninja: build stopped: subcommand failed.
dependency failed checks.aarch64-linux.acme-vm —
failed checks.aarch64-linux.clang-tidy 4m 9s
nix-grpc-store-clang-tidy-0.1.0: | static_assert ../src/client/build.cc:255:7: error: found assert() that could be replaced by static_assert() [cert-d …
nix-grpc-store-clang-tidy-0.1.0:
      |     static_assert
../src/client/build.cc:255:7: error: found assert() that could be replaced by static_assert() [cert-dcl03-c,misc-static-assert,-warnings-as-errors]
  255 |       assert(dep->waiting > 0);
      |       ^~~~~~
      |       static_assert
FAILED: [code=1] meson-internal__clang-tidy 
/nix/store/av7nrlz2yrbwwn4xmpdaz0swnqp36j1f-meson-1.12.1/bin/meson --internal clangtidy /build/source /build/source/build --color always
ninja: build stopped: subcommand failed.
failed checks.aarch64-linux.exit-stress 6m 54s
nix-grpc-store-0.1.0: [18/50] Compiling C++ object scheduler-test.p/tests_scheduler-test.cc.o [19/50] Precompiling header ../pch/client_pch.hh [20/50] Precompil …
nix-grpc-store-0.1.0:
[18/50] Compiling C++ object scheduler-test.p/tests_scheduler-test.cc.o
[19/50] Precompiling header ../pch/client_pch.hh
[20/50] Precompiling header ../pch/daemon_pch.hh
[21/50] Compiling C++ object dispatcher-bench.p/tests_dispatcher-bench.cc.o
[22/50] Compiling C++ object scheduler-grpc-bench.p/meson-generated_.._nix_remote.grpc.pb.cc.o
[23/50] Compiling C++ object libnix-grpc-dispatcher.a.p/src_daemon_dispatcher.cc.o
[24/50] Compiling C++ object scheduler-grpc-bench.p/tests_scheduler-grpc-bench.cc.o
ninja: build stopped: subcommand failed.
dependency failed checks.aarch64-linux.farm —
failed checks.aarch64-linux.fuzz 3m 21s
nix-grpc-store-fuzzers-0.1.0: 1247 | return status_internal::MakeError<StatusCode::kUnknown>(message, loc); | ^~~~~~~~~ 19 er …
nix-grpc-store-fuzzers-0.1.0:
 1247 |   return status_internal::MakeError<StatusCode::kUnknown>(message, loc);
      |                           ^~~~~~~~~
19 errors generated.
[38/94] Compiling C++ object fuzz-build-log.p/meson-generated_.._nix_remote.grpc.pb.cc.o
[39/94] Compiling C++ object fuzz-wire.p/fuzz_wire.cc.o
[40/94] Compiling C++ object fuzz-nar-frames.p/meson-generated_.._nix_remote.grpc.pb.cc.o
[41/94] Compiling C++ object fuzz-wire.p/meson-generated_.._nix_remote.grpc.pb.cc.o
ninja: build stopped: subcommand failed.
failed checks.aarch64-linux.plugin-dispatcher 2m 14s
nix-grpc-store-0.1.0: 19 errors generated. [20/50] Precompiling header ../pch/client_pch.hh [21/50] Compiling C++ object dispatcher-bench.p/tests_dispatcher-ben …
nix-grpc-store-0.1.0:
19 errors generated.
[20/50] Precompiling header ../pch/client_pch.hh
[21/50] Compiling C++ object dispatcher-bench.p/tests_dispatcher-bench.cc.o
[22/50] Precompiling header ../pch/daemon_pch.hh
[23/50] Compiling C++ object scheduler-grpc-bench.p/meson-generated_.._nix_remote.grpc.pb.cc.o
[24/50] Compiling C++ object libnix-grpc-dispatcher.a.p/src_daemon_dispatcher.cc.o
[25/50] Compiling C++ object scheduler-grpc-bench.p/tests_scheduler-grpc-bench.cc.o
ninja: build stopped: subcommand failed.
failed checks.aarch64-linux.sanitize-smoke 6m 53s
nix-grpc-store-asan-0.1.0: 19 errors generated. [19/50] Compiling C++ object dispatcher-bench.p/tests_dispatcher-bench.cc.o [20/50] Compiling C++ object schedul …
nix-grpc-store-asan-0.1.0:
19 errors generated.
[19/50] Compiling C++ object dispatcher-bench.p/tests_dispatcher-bench.cc.o
[20/50] Compiling C++ object scheduler-grpc-bench.p/meson-generated_.._nix_remote.grpc.pb.cc.o
[21/50] Precompiling header ../pch/client_pch.hh
[22/50] Precompiling header ../pch/daemon_pch.hh
[23/50] Compiling C++ object scheduler-grpc-bench.p/tests_scheduler-grpc-bench.cc.o
[24/50] Compiling C++ object libnix-grpc-dispatcher.a.p/src_daemon_dispatcher.cc.o
ninja: build stopped: subcommand failed.
dependency failed checks.aarch64-linux.vm —
dependency failed checks.aarch64-linux.vm-upload —
dependency failed checks.x86_64-linux.acme-vm —
failed checks.x86_64-linux.clang-tidy 4m 9s
nix-grpc-store-clang-tidy-0.1.0: | static_assert ../src/client/build.cc:255:7: error: found assert() that could be replaced by static_assert() [cert-d …
nix-grpc-store-clang-tidy-0.1.0:
      |     static_assert
../src/client/build.cc:255:7: error: found assert() that could be replaced by static_assert() [cert-dcl03-c,misc-static-assert,-warnings-as-errors]
  255 |       assert(dep->waiting > 0);
      |       ^~~~~~
      |       static_assert
FAILED: [code=1] meson-internal__clang-tidy 
/nix/store/r72868g8znkk4m8pmwsn3cf8v3h84mr0-meson-1.12.1/bin/meson --internal clangtidy /build/source /build/source/build --color always
ninja: build stopped: subcommand failed.
failed checks.x86_64-linux.exit-stress 6m 43s
nix-grpc-store-0.1.0: [18/50] Compiling C++ object scheduler-test.p/tests_scheduler-test.cc.o [19/50] Precompiling header ../pch/client_pch.hh [20/50] Precompil …
nix-grpc-store-0.1.0:
[18/50] Compiling C++ object scheduler-test.p/tests_scheduler-test.cc.o
[19/50] Precompiling header ../pch/client_pch.hh
[20/50] Precompiling header ../pch/daemon_pch.hh
[21/50] Compiling C++ object dispatcher-bench.p/tests_dispatcher-bench.cc.o
[22/50] Compiling C++ object scheduler-grpc-bench.p/meson-generated_.._nix_remote.grpc.pb.cc.o
[23/50] Compiling C++ object libnix-grpc-dispatcher.a.p/src_daemon_dispatcher.cc.o
[24/50] Compiling C++ object scheduler-grpc-bench.p/tests_scheduler-grpc-bench.cc.o
ninja: build stopped: subcommand failed.
dependency failed checks.x86_64-linux.farm —
failed checks.x86_64-linux.fuzz 3m 38s
nix-grpc-store-fuzzers-0.1.0: | ^~~~~~~~~ /nix/store/kdw9qqz0z8hb2i1sv5c629vjibibf4fh-abseil-cpp-20260817.0-dev/include/absl/sta …
nix-grpc-store-fuzzers-0.1.0:
      |                           ^~~~~~~~~
/nix/store/kdw9qqz0z8hb2i1sv5c629vjibibf4fh-abseil-cpp-20260817.0-dev/include/absl/status/status.h:1247:27: error: no member named 'MakeError' in namespace 'absl::status_internal'
 1247 |   return status_internal::MakeError<StatusCode::kUnknown>(message, loc);
      |                           ^~~~~~~~~
19 errors generated.
[44/94] Compiling C++ object fuzz-wire.p/meson-generated_.._nix_remote.grpc.pb.cc.o
[45/94] Compiling C++ object fuzz-acl.p/meson-generated_.._nix_remote.grpc.pb.cc.o
ninja: build stopped: subcommand failed.
dependency failed checks.x86_64-linux.k3s —
failed checks.x86_64-linux.plugin-dispatcher 2m 40s
nix-grpc-store-0.1.0: [18/50] Compiling C++ object scheduler-test.p/tests_scheduler-test.cc.o [19/50] Precompiling header ../pch/client_pch.hh [20/50] Precompil …
nix-grpc-store-0.1.0:
[18/50] Compiling C++ object scheduler-test.p/tests_scheduler-test.cc.o
[19/50] Precompiling header ../pch/client_pch.hh
[20/50] Precompiling header ../pch/daemon_pch.hh
[21/50] Compiling C++ object dispatcher-bench.p/tests_dispatcher-bench.cc.o
[22/50] Compiling C++ object scheduler-grpc-bench.p/meson-generated_.._nix_remote.grpc.pb.cc.o
[23/50] Compiling C++ object libnix-grpc-dispatcher.a.p/src_daemon_dispatcher.cc.o
[24/50] Compiling C++ object scheduler-grpc-bench.p/tests_scheduler-grpc-bench.cc.o
ninja: build stopped: subcommand failed.
failed checks.x86_64-linux.sanitize-smoke 6m 34s
nix-grpc-store-asan-0.1.0: 19 errors generated. [20/50] Precompiling header ../pch/client_pch.hh [21/50] Compiling C++ object dispatcher-bench.p/tests_dispatche …
nix-grpc-store-asan-0.1.0:
19 errors generated.
[20/50] Precompiling header ../pch/client_pch.hh
[21/50] Compiling C++ object dispatcher-bench.p/tests_dispatcher-bench.cc.o
[22/50] Compiling C++ object scheduler-grpc-bench.p/meson-generated_.._nix_remote.grpc.pb.cc.o
[23/50] Precompiling header ../pch/daemon_pch.hh
[24/50] Compiling C++ object libnix-grpc-dispatcher.a.p/src_daemon_dispatcher.cc.o
[25/50] Compiling C++ object scheduler-grpc-bench.p/tests_scheduler-grpc-bench.cc.o
ninja: build stopped: subcommand failed.
dependency failed checks.x86_64-linux.vm —
dependency failed checks.x86_64-linux.vm-upload —
20 succeeded
succeeded attributes
status attribute duration
loading…