nixbot

builds

Mic92/nix-grpc-store build #618 failed

branch main · PR #177 · commit 7447c796a9 · · took 29m 41s · eval 19s

5 failed
failed attributes
status attribute duration
failed checks.aarch64-linux.clang-tidy 1m 28s
nix-grpc-store-clang-tidy-0.1.0: | static_assert ../src/client/build.cc:259:7: error: found assert() that could be replaced by static_assert() [cert-d …
nix-grpc-store-clang-tidy-0.1.0:
      |     static_assert
../src/client/build.cc:259:7: error: found assert() that could be replaced by static_assert() [cert-dcl03-c,misc-static-assert,-warnings-as-errors]
  259 |       assert(dep->waiting > 0);
      |       ^~~~~~
      |       static_assert
FAILED: [code=1] meson-internal__clang-tidy 
/nix/store/av7nrlz2yrbwwn4xmpdaz0swnqp36j1f-meson-1.12.1/bin/meson --internal clangtidy /build/source /build/source/build --color always
ninja: build stopped: subcommand failed.
failed checks.aarch64-linux.farm 0s
rustfs-1.0.0: tribuchet: submitting build: code: 'The system is not in a state required for the operation's execution', message: "an output path is part of a di …
rustfs-1.0.0:
tribuchet: submitting build: code: 'The system is not in a state required for the operation's execution', message: "an output path is part of a different in-flight build"
failed checks.aarch64-linux.fuzz 53s
nix-grpc-store-fuzzers-0.1.0: /nix/store/sbw5f5r1jk2hkasnz47vmwjb9xwc5j9a-abseil-cpp-20260817.0-dev/include/absl/status/status.h:1247:27: error: no member named …
nix-grpc-store-fuzzers-0.1.0:
/nix/store/sbw5f5r1jk2hkasnz47vmwjb9xwc5j9a-abseil-cpp-20260817.0-dev/include/absl/status/status.h:1247:27: error: no member named 'MakeError' in namespace 'absl::status_internal'
 1247 |   return status_internal::MakeError<StatusCode::kUnknown>(message, loc);
      |                           ^~~~~~~~~
19 errors generated.
[41/102] Compiling C++ object fuzz-import-paths.p/meson-generated_.._nix_remote.grpc.pb.cc.o
[42/102] Compiling C++ object fuzz-build-log.p/meson-generated_.._nix_remote.grpc.pb.cc.o
[43/102] Compiling C++ object fuzz-nar-frames.p/meson-generated_.._nix_remote.grpc.pb.cc.o
ninja: build stopped: subcommand failed.
failed checks.x86_64-linux.clang-tidy 56s
nix-grpc-store-clang-tidy-0.1.0: | static_assert ../src/client/build.cc:259:7: error: found assert() that could be replaced by static_assert() [cert-d …
nix-grpc-store-clang-tidy-0.1.0:
      |     static_assert
../src/client/build.cc:259:7: error: found assert() that could be replaced by static_assert() [cert-dcl03-c,misc-static-assert,-warnings-as-errors]
  259 |       assert(dep->waiting > 0);
      |       ^~~~~~
      |       static_assert
FAILED: [code=1] meson-internal__clang-tidy 
/nix/store/r72868g8znkk4m8pmwsn3cf8v3h84mr0-meson-1.12.1/bin/meson --internal clangtidy /build/source /build/source/build --color always
ninja: build stopped: subcommand failed.
failed checks.x86_64-linux.fuzz 25s
nix-grpc-store-fuzzers-0.1.0: | ^~~~~~~~~ /nix/store/kdw9qqz0z8hb2i1sv5c629vjibibf4fh-abseil-cpp-20260817.0-dev/include/absl/sta …
nix-grpc-store-fuzzers-0.1.0:
      |                           ^~~~~~~~~
/nix/store/kdw9qqz0z8hb2i1sv5c629vjibibf4fh-abseil-cpp-20260817.0-dev/include/absl/status/status.h:1247:27: error: no member named 'MakeError' in namespace 'absl::status_internal'
 1247 |   return status_internal::MakeError<StatusCode::kUnknown>(message, loc);
      |                           ^~~~~~~~~
19 errors generated.
[50/102] Compiling C++ object fuzz-nar-frames.p/meson-generated_.._nix_remote.grpc.pb.cc.o
[51/102] Compiling C++ object fuzz-wire.p/meson-generated_.._nix_remote.grpc.pb.cc.o
ninja: build stopped: subcommand failed.
32 succeeded
succeeded attributes
status attribute duration
loading…
5 already built
skipped attributes
status attribute duration
loading…