nixbot

builds

Mic92/nix-grpc-store build #636 failed

branch main · PR #188 · commit 1462c989e6 · · took 12m 57s · eval 20s

8 failed
failed attributes
status attribute duration
failed checks.aarch64-darwin.clang-tidy 1m 11s
nix-grpc-store-clang-tidy-0.2.0: | contains "opening a connection to remote store") ../src/daemon/main.cc:148:42: er …
nix-grpc-store-clang-tidy-0.2.0:
      |                                       contains "opening a connection to remote store")
../src/daemon/main.cc:148:42: error: use 'contains' to check for membership [readability-container-contains,-warnings-as-errors]
  148 |                               && message.find("previously failed") != std::string_view::npos);
      |                                          ^~~~ ~~~~~~~~~~~~~~~~~~~~~~~~~~~~~~~~~~~~~~~~~~~~~~
      |                                          contains "previously failed")
FAILED: [code=1] meson-internal__clang-tidy 
/nix/store/yjl5dwm08zmfsjrqyidrvcgm59qlgmxz-meson-1.12.1/bin/meson --internal clangtidy /private/var/tb/4/scratch/125e35e546522f1d/build/source /private/var/tb/4/scratch/125e35e546522f1d/build/source/build --color always
ninja: build stopped: subcommand failed.
failed checks.aarch64-darwin.exit-stress 1m 50s
nix-grpc-store-0.2.0: 8/10 nix-grpc-store:upload-claims OK 0.96s 9/10 nix-grpc-store:oidc OK 1.12s 10/10 nix-grpc-store:far …
nix-grpc-store-0.2.0:
 8/10 nix-grpc-store:upload-claims OK              0.96s
 9/10 nix-grpc-store:oidc          OK              1.12s
10/10 nix-grpc-store:farm-client   OK              9.15s
Summary of Failures:
 6/10 nix-grpc-store:nar-fetcher   FAIL            0.73s   killed by signal 6 SIGABRT
Ok:                9   
Fail:              1   
Full log written to /private/var/tb/5/scratch/0f235ede71186998/build/source/build/meson-logs/testlog.txt
failed checks.aarch64-darwin.plugin-dispatcher 1m 15s
nix-grpc-store-0.2.0: 8/10 nix-grpc-store:upload-claims OK 2.18s 9/10 nix-grpc-store:oidc OK 2.45s 10/10 nix-grpc-store:far …
nix-grpc-store-0.2.0:
 8/10 nix-grpc-store:upload-claims OK              2.18s
 9/10 nix-grpc-store:oidc          OK              2.45s
10/10 nix-grpc-store:farm-client   OK             10.47s
Summary of Failures:
 6/10 nix-grpc-store:nar-fetcher   FAIL            1.78s   killed by signal 6 SIGABRT
Ok:                9   
Fail:              1   
Full log written to /private/var/tb/5/scratch/cbc45b37421ed9ed/build/source/build/meson-logs/testlog.txt
failed checks.aarch64-linux.clang-tidy 1m 28s
nix-grpc-store-clang-tidy-0.2.0: | contains "opening a connection to remote store") ../src/daemon/main.cc:148:42: er …
nix-grpc-store-clang-tidy-0.2.0:
      |                                       contains "opening a connection to remote store")
../src/daemon/main.cc:148:42: error: use 'contains' to check for membership [readability-container-contains,-warnings-as-errors]
  148 |                               && message.find("previously failed") != std::string_view::npos);
      |                                          ^~~~ ~~~~~~~~~~~~~~~~~~~~~~~~~~~~~~~~~~~~~~~~~~~~~~
      |                                          contains "previously failed")
FAILED: [code=1] meson-internal__clang-tidy 
/nix/store/av7nrlz2yrbwwn4xmpdaz0swnqp36j1f-meson-1.12.1/bin/meson --internal clangtidy /build/source /build/source/build --color always
ninja: build stopped: subcommand failed.
failed checks.aarch64-linux.farm 10m 30s
vm-test-run-nix-grpc-farm: exec(self.tests, symbols, None) ~~~~^^^^^^^^^^^^^^^^^^^^^^^^^^^ File "<string>", line 42, in <module> File "<string>", li …
vm-test-run-nix-grpc-farm:
    exec(self.tests, symbols, None)
    ~~~~^^^^^^^^^^^^^^^^^^^^^^^^^^^
  File "<string>", line 42, in <module>
  File "<string>", line 10, in run_e2e
  File "/nix/store/81ag9nxz1flw3xjkv1vvqg8y2ipx2ins-python3-3.14.7/lib/python3.14/subprocess.py", line 578, in run
    raise CalledProcessError(retcode, process.args,
                             output=stdout, stderr=stderr)
subprocess.CalledProcessError: Command '['/nix/store/4rs81gqp2fzbvxci04qb20hg0sfx3nad-nix-grpc-e2e/bin/nix-grpc-e2e', 'farm::serial::', '--test-threads=1', '--nocapture']' returned non-zero exit status 101.
failed checks.aarch64-linux.vm 1m 0s
vm-test-run-nix-grpc-store-main: exec(self.tests, symbols, None) ~~~~^^^^^^^^^^^^^^^^^^^^^^^^^^^ File "<string>", line 21, in <module> File "<string …
vm-test-run-nix-grpc-store-main:
    exec(self.tests, symbols, None)
    ~~~~^^^^^^^^^^^^^^^^^^^^^^^^^^^
  File "<string>", line 21, in <module>
  File "<string>", line 10, in run_e2e
  File "/nix/store/81ag9nxz1flw3xjkv1vvqg8y2ipx2ins-python3-3.14.7/lib/python3.14/subprocess.py", line 578, in run
    raise CalledProcessError(retcode, process.args,
                             output=stdout, stderr=stderr)
subprocess.CalledProcessError: Command '['/nix/store/4rs81gqp2fzbvxci04qb20hg0sfx3nad-nix-grpc-e2e/bin/nix-grpc-e2e', 'lifecycle::', '--test-threads=1', '--nocapture']' returned non-zero exit status 101.
failed checks.x86_64-linux.clang-tidy 55s
nix-grpc-store-clang-tidy-0.2.0: | contains "opening a connection to remote store") ../src/daemon/main.cc:148:42: er …
nix-grpc-store-clang-tidy-0.2.0:
      |                                       contains "opening a connection to remote store")
../src/daemon/main.cc:148:42: error: use 'contains' to check for membership [readability-container-contains,-warnings-as-errors]
  148 |                               && message.find("previously failed") != std::string_view::npos);
      |                                          ^~~~ ~~~~~~~~~~~~~~~~~~~~~~~~~~~~~~~~~~~~~~~~~~~~~~
      |                                          contains "previously failed")
FAILED: [code=1] meson-internal__clang-tidy 
/nix/store/r72868g8znkk4m8pmwsn3cf8v3h84mr0-meson-1.12.1/bin/meson --internal clangtidy /build/source /build/source/build --color always
ninja: build stopped: subcommand failed.
failed checks.x86_64-linux.vm 55s
vm-test-run-nix-grpc-store-main: exec(self.tests, symbols, None) ~~~~^^^^^^^^^^^^^^^^^^^^^^^^^^^ File "<string>", line 21, in <module> File "<string …
vm-test-run-nix-grpc-store-main:
    exec(self.tests, symbols, None)
    ~~~~^^^^^^^^^^^^^^^^^^^^^^^^^^^
  File "<string>", line 21, in <module>
  File "<string>", line 10, in run_e2e
  File "/nix/store/lb41b0anx1f98y9y5s9mdv97gjgsq740-python3-3.14.7/lib/python3.14/subprocess.py", line 578, in run
    raise CalledProcessError(retcode, process.args,
                             output=stdout, stderr=stderr)
subprocess.CalledProcessError: Command '['/nix/store/hava2pxkycydkrhd3yyx9h5rp74vbg0a-nix-grpc-e2e/bin/nix-grpc-e2e', 'lifecycle::', '--test-threads=1', '--nocapture']' returned non-zero exit status 101.
16 succeeded
succeeded attributes
status attribute duration
loading…
18 already built
skipped attributes
status attribute duration
loading…