nixbot

builds

Mic92/nix-grpc-store build #639 failed

branch main · PR #187 · commit ed63be8832 · · took 11m 19s · eval 18s

3 failed
failed attributes
status attribute duration
failed checks.aarch64-darwin.clang-tidy 2m 24s
nix-grpc-store-clang-tidy-0.2.0: [1/1] (2/2) Processing file /private/var/tb/4/scratch/4107b097abddb88a/build/source/src/daemon/sbpl.cc. >>> /nix/store/rnf8scxr …
nix-grpc-store-clang-tidy-0.2.0:
[1/1] (2/2) Processing file /private/var/tb/4/scratch/4107b097abddb88a/build/source/src/daemon/sbpl.cc.
>>> /nix/store/rnf8scxrdas1whzavr379xi6r7aj2pbd-clang-tools-22.1.8/bin/clang-tidy --use-color -quiet -p /private/var/tb/4/scratch/4107b097abddb88a/build/source/build /private/var/tb/4/scratch/4107b097abddb88a/build/source/src/client/channel.cc
Errors encountered while running clang-tidy
[1/1] (1/2) Processing file /private/var/tb/4/scratch/4107b097abddb88a/build/source/src/client/channel.cc.
[1/1] (2/2) Processing file /private/var/tb/4/scratch/4107b097abddb88a/build/source/src/client/channel.cc.
FAILED: [code=1] meson-internal__clang-tidy 
/nix/store/yjl5dwm08zmfsjrqyidrvcgm59qlgmxz-meson-1.12.1/bin/meson --internal clangtidy /private/var/tb/4/scratch/4107b097abddb88a/build/source /private/var/tb/4/scratch/4107b097abddb88a/build/source/build --color always
ninja: build stopped: subcommand failed.
failed checks.aarch64-linux.clang-tidy 1m 27s
nix-grpc-store-clang-tidy-0.2.0: [1/1] (2/2) Processing file /build/source/src/daemon/sandbox-linux.cc. ../src/daemon/sandbox-linux.cc:165:81: error: use a trai …
nix-grpc-store-clang-tidy-0.2.0:
[1/1] (2/2) Processing file /build/source/src/daemon/sandbox-linux.cc.
../src/daemon/sandbox-linux.cc:165:81: error: use a trailing return type for this lambda [modernize-use-trailing-return-type,-warnings-as-errors]
  165 |     return call(SYS_landlock_create_ruleset, &attr, sizeof(attr), 0U).transform([](long ruleset) {
      |                                                                                 ^
      |                                                                                                  -> nix::AutoCloseFD
FAILED: [code=1] meson-internal__clang-tidy 
/nix/store/av7nrlz2yrbwwn4xmpdaz0swnqp36j1f-meson-1.12.1/bin/meson --internal clangtidy /build/source /build/source/build --color always
ninja: build stopped: subcommand failed.
failed checks.x86_64-linux.clang-tidy 1m 37s
nix-grpc-store-clang-tidy-0.2.0: [1/1] (2/2) Processing file /build/source/src/daemon/sandbox-linux.cc. ../src/daemon/sandbox-linux.cc:165:81: error: use a trai …
nix-grpc-store-clang-tidy-0.2.0:
[1/1] (2/2) Processing file /build/source/src/daemon/sandbox-linux.cc.
../src/daemon/sandbox-linux.cc:165:81: error: use a trailing return type for this lambda [modernize-use-trailing-return-type,-warnings-as-errors]
  165 |     return call(SYS_landlock_create_ruleset, &attr, sizeof(attr), 0U).transform([](long ruleset) {
      |                                                                                 ^
      |                                                                                                  -> nix::AutoCloseFD
FAILED: [code=1] meson-internal__clang-tidy 
/nix/store/r72868g8znkk4m8pmwsn3cf8v3h84mr0-meson-1.12.1/bin/meson --internal clangtidy /build/source /build/source/build --color always
ninja: build stopped: subcommand failed.
2 cancelled
cancelled attributes
status attribute duration
loading…
17 succeeded
succeeded attributes
status attribute duration
loading…
20 already built
skipped attributes
status attribute duration
loading…