nixbot

builds

Mic92/nix-grpc-store build #642 failed

branch main · PR #189 · commit 7b7bfbb911 · · took 13m 35s · eval 22s

5 failed
failed attributes
status attribute duration
failed checks.aarch64-darwin.clang-tidy 1m 34s
nix-grpc-store-clang-tidy-0.2.0: [1/1] (2/2) Processing file /private/var/tb/1/scratch/8b5ebd70c8467d56/build/source/src/client/channel.cc. >>> /nix/store/rnf8s …
nix-grpc-store-clang-tidy-0.2.0:
[1/1] (2/2) Processing file /private/var/tb/1/scratch/8b5ebd70c8467d56/build/source/src/client/channel.cc.
>>> /nix/store/rnf8scxrdas1whzavr379xi6r7aj2pbd-clang-tools-22.1.8/bin/clang-tidy --use-color -quiet -p /private/var/tb/1/scratch/8b5ebd70c8467d56/build/source/build /private/var/tb/1/scratch/8b5ebd70c8467d56/build/source/src/daemon/sbpl.cc
Errors encountered while running clang-tidy
[1/1] (1/2) Processing file /private/var/tb/1/scratch/8b5ebd70c8467d56/build/source/src/daemon/sbpl.cc.
[1/1] (2/2) Processing file /private/var/tb/1/scratch/8b5ebd70c8467d56/build/source/src/daemon/sbpl.cc.
FAILED: [code=1] meson-internal__clang-tidy 
/nix/store/yjl5dwm08zmfsjrqyidrvcgm59qlgmxz-meson-1.12.1/bin/meson --internal clangtidy /private/var/tb/1/scratch/8b5ebd70c8467d56/build/source /private/var/tb/1/scratch/8b5ebd70c8467d56/build/source/build --color always
ninja: build stopped: subcommand failed.
failed checks.aarch64-linux.clang-tidy 1m 27s
nix-grpc-store-clang-tidy-0.2.0: | ^ >>> /nix/store/w7xl1p79akq4c6d2j6wpn7avfiiv2szw-clang-tools-22.1.8/bin/clang-tidy …
nix-grpc-store-clang-tidy-0.2.0:
      |                                     ^
>>> /nix/store/w7xl1p79akq4c6d2j6wpn7avfiiv2szw-clang-tools-22.1.8/bin/clang-tidy --use-color -quiet -p /build/source/build /build/source/src/daemon/sandbox-linux.cc
Errors encountered while running clang-tidy
[1/1] (1/2) Processing file /build/source/src/daemon/sandbox-linux.cc.
[1/1] (2/2) Processing file /build/source/src/daemon/sandbox-linux.cc.
FAILED: [code=1] meson-internal__clang-tidy 
/nix/store/av7nrlz2yrbwwn4xmpdaz0swnqp36j1f-meson-1.12.1/bin/meson --internal clangtidy /build/source /build/source/build --color always
ninja: build stopped: subcommand failed.
failed checks.aarch64-linux.helm 4s
nix-grpc-farm-helm-check: ==> Linting chart [INFO] Chart.yaml: icon is recommended 1 chart(s) linted, 0 chart(s) failed ==> Linting chart [INFO] Chart.yaml: ico …
nix-grpc-farm-helm-check:
==> Linting chart
[INFO] Chart.yaml: icon is recommended
1 chart(s) linted, 0 chart(s) failed
==> Linting chart
[INFO] Chart.yaml: icon is recommended
1 chart(s) linted, 0 chart(s) failed
Error: execution error at (nix-grpc-farm/templates/podmonitor.yaml:15:86): metrics.podMonitor needs the prometheus-operator CRDs (try metrics.vmPodScrape for VictoriaMetrics)
Use --debug flag to render out invalid YAML
failed checks.x86_64-linux.clang-tidy 56s
nix-grpc-store-clang-tidy-0.2.0: | ^ >>> /nix/store/f9hs9r4kcnics2v0l9dbd1b1arx09gza-clang-tools-22.1.8/bin/clang-tidy …
nix-grpc-store-clang-tidy-0.2.0:
      |                                     ^
>>> /nix/store/f9hs9r4kcnics2v0l9dbd1b1arx09gza-clang-tools-22.1.8/bin/clang-tidy --use-color -quiet -p /build/source/build /build/source/src/daemon/sandbox-linux.cc
Errors encountered while running clang-tidy
[1/1] (1/2) Processing file /build/source/src/daemon/sandbox-linux.cc.
[1/1] (2/2) Processing file /build/source/src/daemon/sandbox-linux.cc.
FAILED: [code=1] meson-internal__clang-tidy 
/nix/store/r72868g8znkk4m8pmwsn3cf8v3h84mr0-meson-1.12.1/bin/meson --internal clangtidy /build/source /build/source/build --color always
ninja: build stopped: subcommand failed.
failed checks.x86_64-linux.helm 6s
nix-grpc-farm-helm-check: ==> Linting chart [INFO] Chart.yaml: icon is recommended 1 chart(s) linted, 0 chart(s) failed ==> Linting chart [INFO] Chart.yaml: ico …
nix-grpc-farm-helm-check:
==> Linting chart
[INFO] Chart.yaml: icon is recommended
1 chart(s) linted, 0 chart(s) failed
==> Linting chart
[INFO] Chart.yaml: icon is recommended
1 chart(s) linted, 0 chart(s) failed
Error: execution error at (nix-grpc-farm/templates/podmonitor.yaml:15:86): metrics.podMonitor needs the prometheus-operator CRDs (try metrics.vmPodScrape for VictoriaMetrics)
Use --debug flag to render out invalid YAML
19 succeeded
succeeded attributes
status attribute duration
loading…
18 already built
skipped attributes
status attribute duration
loading…