nixbot

builds

Mic92/nix-grpc-store build #646 failed

branch main · commit d1e8acadeb · · took 9m 3s · eval 21s

17 failed
failed attributes
status attribute duration
dependency failed checks.aarch64-linux.acme-vm —
failed checks.aarch64-linux.exit-stress 8m 50s
nix-grpc-store-0.2.0: FAILED: [code=1] nix-grpc-daemon clang++ -o nix-grpc-daemon nix-grpc-daemon.p/meson-generated_.._nix_remote.pb.cc.o nix-grpc-daemon.p/me …
nix-grpc-store-0.2.0:
FAILED: [code=1] nix-grpc-daemon 
clang++  -o nix-grpc-daemon nix-grpc-daemon.p/meson-generated_.._nix_remote.pb.cc.o nix-grpc-daemon.p/meson-generated_.._nix_remote.grpc.pb.cc.o nix-grpc-daemon.p/meson-generated_.._eds.pb.cc.o nix-grpc-daemon.p/meson-generated_.._eds.grpc.pb.cc.o nix-grpc-daemon.p/src_daemon_main.cc.o nix-grpc-daemon.p/src_client_channel.cc.o nix-grpc-daemon.p/src_daemon_elector.cc.o nix-grpc-daemon.p/src_daemon_auth.cc.o nix-grpc-daemon.p/src_daemon_backend.cc.o nix-grpc-daemon.p/src_daemon_coordinator.cc.o nix-grpc-daemon.p/src_daemon_eds.cc.o nix-grpc-daemon.p/src_daemon_options.cc.o nix-grpc-daemon.p/src_daemon_sandbox-linux.cc.o -Wl,--as-needed -Wl,--n…
clang++: warning: argument unused during compilation: '-Wa,--compress-debug-sections' [-Wunused-command-line-argument]
mold: error: undefined symbol: _ZN3nix10string2IntITkSt8integralmEESt8optionalIT_ESt17basic_string_viewIcSt11char_traitsIcEE
>>> referenced by options.cc
>>>               nix-grpc-daemon.p/src_daemon_options.cc.o:(unsigned long nix::string2IntWithUnitPrefix<unsigned long>(std::basic_string_view<char, std::char_traits<char> >))
clang++: error: linker command failed with exit code 1 (use -v to see invocation)
ninja: build stopped: subcommand failed.
dependency failed checks.aarch64-linux.farm —
failed checks.aarch64-linux.fuzz 6m 3s
nix-grpc-store-fuzzers-0.2.0: >>> nix-grpc-daemon.p/src_daemon_options.cc.o:(unsigned long nix::string2IntWithUnitPrefix<unsigned long>(std::basic …
nix-grpc-store-fuzzers-0.2.0:
>>>               nix-grpc-daemon.p/src_daemon_options.cc.o:(unsigned long nix::string2IntWithUnitPrefix<unsigned long>(std::basic_string_view<char, std::char_traits<char> >))
clang++: error: linker command failed with exit code 1 (use -v to see invocation)
[101/109] Compiling C++ object fuzz-gen-seeds.p/meson-generated_.._nix_remote.grpc.pb.cc.o
[102/109] Compiling C++ object fuzz-gen-seeds.p/fuzz_gen-seeds.cc.o
[103/109] Compiling C++ object fuzz-xfcc.p/meson-generated_.._nix_remote.grpc.pb.cc.o
[104/109] Compiling C++ object fuzz-wire.p/meson-generated_.._nix_remote.grpc.pb.cc.o
[105/109] Compiling C++ object fuzz-acl.p/meson-generated_.._nix_remote.grpc.pb.cc.o
ninja: build stopped: subcommand failed.
failed checks.aarch64-linux.plugin-dispatcher 5m 57s
nix-grpc-store-0.2.0: FAILED: [code=1] nix-grpc-daemon clang++ -o nix-grpc-daemon nix-grpc-daemon.p/meson-generated_.._nix_remote.pb.cc.o nix-grpc-daemon.p/me …
nix-grpc-store-0.2.0:
FAILED: [code=1] nix-grpc-daemon 
clang++  -o nix-grpc-daemon nix-grpc-daemon.p/meson-generated_.._nix_remote.pb.cc.o nix-grpc-daemon.p/meson-generated_.._nix_remote.grpc.pb.cc.o nix-grpc-daemon.p/meson-generated_.._eds.pb.cc.o nix-grpc-daemon.p/meson-generated_.._eds.grpc.pb.cc.o nix-grpc-daemon.p/src_daemon_main.cc.o nix-grpc-daemon.p/src_client_channel.cc.o nix-grpc-daemon.p/src_daemon_elector.cc.o nix-grpc-daemon.p/src_daemon_auth.cc.o nix-grpc-daemon.p/src_daemon_backend.cc.o nix-grpc-daemon.p/src_daemon_coordinator.cc.o nix-grpc-daemon.p/src_daemon_eds.cc.o nix-grpc-daemon.p/src_daemon_options.cc.o nix-grpc-daemon.p/src_daemon_sandbox-linux.cc.o -Wl,--as-needed -Wl,--n…
clang++: warning: argument unused during compilation: '-Wa,--compress-debug-sections' [-Wunused-command-line-argument]
mold: error: undefined symbol: _ZN3nix10string2IntITkSt8integralmEESt8optionalIT_ESt17basic_string_viewIcSt11char_traitsIcEE
>>> referenced by options.cc
>>>               nix-grpc-daemon.p/src_daemon_options.cc.o:(unsigned long nix::string2IntWithUnitPrefix<unsigned long>(std::basic_string_view<char, std::char_traits<char> >))
clang++: error: linker command failed with exit code 1 (use -v to see invocation)
ninja: build stopped: subcommand failed.
failed checks.aarch64-linux.sanitize-smoke 8m 54s
nix-grpc-store-asan-0.2.0: FAILED: [code=1] nix-grpc-daemon clang++ -o nix-grpc-daemon nix-grpc-daemon.p/meson-generated_.._nix_remote.pb.cc.o nix-grpc-daemon …
nix-grpc-store-asan-0.2.0:
FAILED: [code=1] nix-grpc-daemon 
clang++  -o nix-grpc-daemon nix-grpc-daemon.p/meson-generated_.._nix_remote.pb.cc.o nix-grpc-daemon.p/meson-generated_.._nix_remote.grpc.pb.cc.o nix-grpc-daemon.p/meson-generated_.._eds.pb.cc.o nix-grpc-daemon.p/meson-generated_.._eds.grpc.pb.cc.o nix-grpc-daemon.p/src_daemon_main.cc.o nix-grpc-daemon.p/src_client_channel.cc.o nix-grpc-daemon.p/src_daemon_elector.cc.o nix-grpc-daemon.p/src_daemon_auth.cc.o nix-grpc-daemon.p/src_daemon_backend.cc.o nix-grpc-daemon.p/src_daemon_coordinator.cc.o nix-grpc-daemon.p/src_daemon_eds.cc.o nix-grpc-daemon.p/src_daemon_options.cc.o nix-grpc-daemon.p/src_daemon_sandbox-linux.cc.o -fsanitize=address,unde…
clang++: warning: argument unused during compilation: '-Wa,--compress-debug-sections' [-Wunused-command-line-argument]
mold: error: undefined symbol: _ZN3nix10string2IntITkSt8integralmEESt8optionalIT_ESt17basic_string_viewIcSt11char_traitsIcEE
>>> referenced by options.cc
>>>               nix-grpc-daemon.p/src_daemon_options.cc.o:(unsigned long nix::string2IntWithUnitPrefix<unsigned long>(std::basic_string_view<char, std::char_traits<char> >))
clang++: error: linker command failed with exit code 1 (use -v to see invocation)
ninja: build stopped: subcommand failed.
dependency failed checks.aarch64-linux.vm —
dependency failed checks.aarch64-linux.vm-upload —
dependency failed checks.x86_64-linux.acme-vm —
failed checks.x86_64-linux.exit-stress 4m 32s
nix-grpc-store-0.2.0: FAILED: [code=1] nix-grpc-daemon clang++ -o nix-grpc-daemon nix-grpc-daemon.p/meson-generated_.._nix_remote.pb.cc.o nix-grpc-daemon.p/me …
nix-grpc-store-0.2.0:
FAILED: [code=1] nix-grpc-daemon 
clang++  -o nix-grpc-daemon nix-grpc-daemon.p/meson-generated_.._nix_remote.pb.cc.o nix-grpc-daemon.p/meson-generated_.._nix_remote.grpc.pb.cc.o nix-grpc-daemon.p/meson-generated_.._eds.pb.cc.o nix-grpc-daemon.p/meson-generated_.._eds.grpc.pb.cc.o nix-grpc-daemon.p/src_daemon_main.cc.o nix-grpc-daemon.p/src_client_channel.cc.o nix-grpc-daemon.p/src_daemon_elector.cc.o nix-grpc-daemon.p/src_daemon_auth.cc.o nix-grpc-daemon.p/src_daemon_backend.cc.o nix-grpc-daemon.p/src_daemon_coordinator.cc.o nix-grpc-daemon.p/src_daemon_eds.cc.o nix-grpc-daemon.p/src_daemon_options.cc.o nix-grpc-daemon.p/src_daemon_sandbox-linux.cc.o -Wl,--as-needed -Wl,--n…
clang++: warning: argument unused during compilation: '-Wa,--compress-debug-sections' [-Wunused-command-line-argument]
mold: error: undefined symbol: _ZN3nix10string2IntITkSt8integralmEESt8optionalIT_ESt17basic_string_viewIcSt11char_traitsIcEE
>>> referenced by options.cc
>>>               nix-grpc-daemon.p/src_daemon_options.cc.o:(unsigned long nix::string2IntWithUnitPrefix<unsigned long>(std::basic_string_view<char, std::char_traits<char> >))
clang++: error: linker command failed with exit code 1 (use -v to see invocation)
ninja: build stopped: subcommand failed.
dependency failed checks.x86_64-linux.farm —
failed checks.x86_64-linux.fuzz 1m 58s
nix-grpc-store-fuzzers-0.2.0: [98/109] Compiling C++ object fuzz-wire.p/fuzz_wire.cc.o [99/109] Compiling C++ object fuzz-nar-frames.p/fuzz_nar-frames.cc.o [100 …
nix-grpc-store-fuzzers-0.2.0:
[98/109] Compiling C++ object fuzz-wire.p/fuzz_wire.cc.o
[99/109] Compiling C++ object fuzz-nar-frames.p/fuzz_nar-frames.cc.o
[100/109] Compiling C++ object fuzz-wire.p/meson-generated_.._nix_remote.grpc.pb.cc.o
[101/109] Compiling C++ object fuzz-acl.p/meson-generated_.._nix_remote.grpc.pb.cc.o
[102/109] Compiling C++ object fuzz-gen-seeds.p/meson-generated_.._nix_remote.grpc.pb.cc.o
[103/109] Compiling C++ object fuzz-xfcc.p/meson-generated_.._nix_remote.grpc.pb.cc.o
[104/109] Compiling C++ object fuzz-gen-seeds.p/fuzz_gen-seeds.cc.o
ninja: build stopped: subcommand failed.
dependency failed checks.x86_64-linux.k3s —
failed checks.x86_64-linux.plugin-dispatcher 2m 40s
nix-grpc-store-0.2.0: FAILED: [code=1] nix-grpc-daemon clang++ -o nix-grpc-daemon nix-grpc-daemon.p/meson-generated_.._nix_remote.pb.cc.o nix-grpc-daemon.p/me …
nix-grpc-store-0.2.0:
FAILED: [code=1] nix-grpc-daemon 
clang++  -o nix-grpc-daemon nix-grpc-daemon.p/meson-generated_.._nix_remote.pb.cc.o nix-grpc-daemon.p/meson-generated_.._nix_remote.grpc.pb.cc.o nix-grpc-daemon.p/meson-generated_.._eds.pb.cc.o nix-grpc-daemon.p/meson-generated_.._eds.grpc.pb.cc.o nix-grpc-daemon.p/src_daemon_main.cc.o nix-grpc-daemon.p/src_client_channel.cc.o nix-grpc-daemon.p/src_daemon_elector.cc.o nix-grpc-daemon.p/src_daemon_auth.cc.o nix-grpc-daemon.p/src_daemon_backend.cc.o nix-grpc-daemon.p/src_daemon_coordinator.cc.o nix-grpc-daemon.p/src_daemon_eds.cc.o nix-grpc-daemon.p/src_daemon_options.cc.o nix-grpc-daemon.p/src_daemon_sandbox-linux.cc.o -Wl,--as-needed -Wl,--n…
clang++: warning: argument unused during compilation: '-Wa,--compress-debug-sections' [-Wunused-command-line-argument]
mold: error: undefined symbol: _ZN3nix10string2IntITkSt8integralmEESt8optionalIT_ESt17basic_string_viewIcSt11char_traitsIcEE
>>> referenced by options.cc
>>>               nix-grpc-daemon.p/src_daemon_options.cc.o:(unsigned long nix::string2IntWithUnitPrefix<unsigned long>(std::basic_string_view<char, std::char_traits<char> >))
clang++: error: linker command failed with exit code 1 (use -v to see invocation)
ninja: build stopped: subcommand failed.
failed checks.x86_64-linux.sanitize-smoke 4m 32s
nix-grpc-store-asan-0.2.0: FAILED: [code=1] nix-grpc-daemon clang++ -o nix-grpc-daemon nix-grpc-daemon.p/meson-generated_.._nix_remote.pb.cc.o nix-grpc-daemon …
nix-grpc-store-asan-0.2.0:
FAILED: [code=1] nix-grpc-daemon 
clang++  -o nix-grpc-daemon nix-grpc-daemon.p/meson-generated_.._nix_remote.pb.cc.o nix-grpc-daemon.p/meson-generated_.._nix_remote.grpc.pb.cc.o nix-grpc-daemon.p/meson-generated_.._eds.pb.cc.o nix-grpc-daemon.p/meson-generated_.._eds.grpc.pb.cc.o nix-grpc-daemon.p/src_daemon_main.cc.o nix-grpc-daemon.p/src_client_channel.cc.o nix-grpc-daemon.p/src_daemon_elector.cc.o nix-grpc-daemon.p/src_daemon_auth.cc.o nix-grpc-daemon.p/src_daemon_backend.cc.o nix-grpc-daemon.p/src_daemon_coordinator.cc.o nix-grpc-daemon.p/src_daemon_eds.cc.o nix-grpc-daemon.p/src_daemon_options.cc.o nix-grpc-daemon.p/src_daemon_sandbox-linux.cc.o -fsanitize=address,unde…
clang++: warning: argument unused during compilation: '-Wa,--compress-debug-sections' [-Wunused-command-line-argument]
mold: error: undefined symbol: _ZN3nix10string2IntITkSt8integralmEESt8optionalIT_ESt17basic_string_viewIcSt11char_traitsIcEE
>>> referenced by options.cc
>>>               nix-grpc-daemon.p/src_daemon_options.cc.o:(unsigned long nix::string2IntWithUnitPrefix<unsigned long>(std::basic_string_view<char, std::char_traits<char> >))
clang++: error: linker command failed with exit code 1 (use -v to see invocation)
ninja: build stopped: subcommand failed.
dependency failed checks.x86_64-linux.vm —
dependency failed checks.x86_64-linux.vm-upload —
5 succeeded
succeeded attributes
status attribute duration
loading…
20 already built
skipped attributes
status attribute duration
loading…