nixbot

builds

Mic92/nix-grpc-store build #653 failed

branch main · commit ad23bfb4c9 · · took 11m 44s · eval 20s

4 failed
failed attributes
status attribute duration
failed checks.aarch64-darwin.clang-tidy 1m 27s
nix-grpc-store-clang-tidy-0.2.0: 60 | case 'G': shift = 30; break; | ^ ../src/daemon/options.cc:61:27: error: 40 is a …
nix-grpc-store-clang-tidy-0.2.0:
   60 |         case 'G': shift = 30; break;
      |                           ^
../src/daemon/options.cc:61:27: error: 40 is a magic number; consider replacing it with a named constant [cppcoreguidelines-avoid-magic-numbers,readability-magic-numbers,-warnings-as-errors]
   61 |         case 'T': shift = 40; break;
      |                           ^
FAILED: [code=1] meson-internal__clang-tidy 
/nix/store/yjl5dwm08zmfsjrqyidrvcgm59qlgmxz-meson-1.12.1/bin/meson --internal clangtidy /private/var/tb/6/scratch/13a1a6305105f7e1/build/source /private/var/tb/6/scratch/13a1a6305105f7e1/build/source/build --color always
ninja: build stopped: subcommand failed.
failed checks.aarch64-linux.clang-tidy 1m 45s
nix-grpc-store-clang-tidy-0.2.0: | ^ >>> /nix/store/w7xl1p79akq4c6d2j6wpn7avfiiv2szw-clang-tools-22.1.8/bin/clang-tidy --use-col …
nix-grpc-store-clang-tidy-0.2.0:
      |                           ^
>>> /nix/store/w7xl1p79akq4c6d2j6wpn7avfiiv2szw-clang-tools-22.1.8/bin/clang-tidy --use-color -quiet -p /build/source/build /build/source/src/daemon/sandbox-linux.cc
Errors encountered while running clang-tidy
[1/1] (1/2) Processing file /build/source/src/daemon/sandbox-linux.cc.
[1/1] (2/2) Processing file /build/source/src/daemon/sandbox-linux.cc.
FAILED: [code=1] meson-internal__clang-tidy 
/nix/store/av7nrlz2yrbwwn4xmpdaz0swnqp36j1f-meson-1.12.1/bin/meson --internal clangtidy /build/source /build/source/build --color always
ninja: build stopped: subcommand failed.
failed checks.x86_64-linux.clang-tidy 56s
nix-grpc-store-clang-tidy-0.2.0: | ^ >>> /nix/store/f9hs9r4kcnics2v0l9dbd1b1arx09gza-clang-tools-22.1.8/bin/clang-tidy --use-col …
nix-grpc-store-clang-tidy-0.2.0:
      |                           ^
>>> /nix/store/f9hs9r4kcnics2v0l9dbd1b1arx09gza-clang-tools-22.1.8/bin/clang-tidy --use-color -quiet -p /build/source/build /build/source/src/daemon/sandbox-linux.cc
Errors encountered while running clang-tidy
[1/1] (1/2) Processing file /build/source/src/daemon/sandbox-linux.cc.
[1/1] (2/2) Processing file /build/source/src/daemon/sandbox-linux.cc.
FAILED: [code=1] meson-internal__clang-tidy 
/nix/store/r72868g8znkk4m8pmwsn3cf8v3h84mr0-meson-1.12.1/bin/meson --internal clangtidy /build/source /build/source/build --color always
ninja: build stopped: subcommand failed.
failed checks.x86_64-linux.k3s 10m 51s
vm-test-run-nix-grpc-farm-k3s: machine # [ 508.111358] niks3-server[1184]: 2026/10/12 10:01:57 INFO Received complete push request method=POST path=/api/pushes …
vm-test-run-nix-grpc-farm-k3s:
machine # [  508.111358] niks3-server[1184]: 2026/10/12 10:01:57 INFO Received complete push request method=POST path=/api/pushes/25/complete
machine # [  508.112235] garage[835]: 2026-10-12T10:01:57.367101Z  INFO garage_api_common::generic_server: 192.168.1.1:47756 (key GK0123456789abcdef01234567) HEAD /farm/jz7biafi8rj5r3r392blyazw5mdpvy0d.narinfo
machine # [  508.114827] niks3-server[1184]: 2026/10/12 10:01:57 INFO Registered completed upload object_key=jz7biafi8rj5r3r392blyazw5mdpvy0d.narinfo
machine # [  508.125622] niks3-server[1184]: 2026/10/12 10:01:57 INFO Registered completed upload object_key=jz7biafi8rj5r3r392blyazw5mdpvy0d.ls
tribuchet: hub connection lost (event stream: code: 'Unknown error', message: "h2 protocol error: error reading a body from connection", source: hyper::Error(Body, Error { kind: Io(Custom { kind: BrokenPipe, error: "stream closed because of a broken pipe" }) }): error reading a body from connection: stream closed because of a broken pipe); reconnecting
tribuchet: hub connection lost (connecting to hub socket: transport error: No such file or directory (os error 2): No such file or directory (os error 2)); reconnecting
tribuchet: building on jamie
tribuchet: remote build failed: no connected worker builds for system x86_64-linux
18 succeeded
succeeded attributes
status attribute duration
loading…
20 already built
skipped attributes
status attribute duration
loading…