nixbot

builds

Mic92/nix-grpc-store build #662 failed

branch main · PR #206 · commit 9838328a49 · · took 16m 42s · eval 22s

1 failed
failed attributes
status attribute duration
failed checks.aarch64-darwin.exit-stress 5m 38s
nix-util-tests-run: [ SKIPPED ] 2 tests, listed below: [ SKIPPED ] CompressionDecompression/CompressionDecompressionTest.invalidDecompression/none [ SKIPPED …
nix-util-tests-run:
[  SKIPPED ] 2 tests, listed below:
[  SKIPPED ] CompressionDecompression/CompressionDecompressionTest.invalidDecompression/none
[  SKIPPED ] CompressionDecompression/CompressionDecompressionTest.truncatedInputIsRejected/none
[  FAILED  ] 2 tests, listed below:
[  FAILED  ] RootDeletePath.restrictiveDirectoryPermissions
[  FAILED  ] RootDeletePath.modeChangesDenied
 2 FAILED TESTS
  YOU HAVE 1 DISABLED TEST
36 succeeded
succeeded attributes
status attribute duration
loading…
5 already built
skipped attributes
status attribute duration
loading…