nixbot

builds

Mic92/nix-grpc-store build #670 failed

branch main · PR #206 · commit f92340b4df · · took 11m 47s · eval 21s

1 failed
failed attributes
status attribute duration
failed checks.aarch64-darwin.exit-stress 2m 28s
nix-util-tests-run: [ SKIPPED ] 2 tests, listed below: [ SKIPPED ] CompressionDecompression/CompressionDecompressionTest.invalidDecompression/none [ SKIPPED …
nix-util-tests-run:
[  SKIPPED ] 2 tests, listed below:
[  SKIPPED ] CompressionDecompression/CompressionDecompressionTest.invalidDecompression/none
[  SKIPPED ] CompressionDecompression/CompressionDecompressionTest.truncatedInputIsRejected/none
[  FAILED  ] 2 tests, listed below:
[  FAILED  ] RootDeletePath.restrictiveDirectoryPermissions
[  FAILED  ] RootDeletePath.modeChangesDenied
 2 FAILED TESTS
  YOU HAVE 1 DISABLED TEST
20 succeeded
succeeded attributes
status attribute duration
loading…
21 already built
skipped attributes
status attribute duration
loading…