nixbot

builds

Mic92/nix-grpc-store build #69 failed

branch main · PR #32 · commit bafb66a762 · · took 2m 8s

6 failed
failed attributes
status attribute duration
failed checks.aarch64-darwin.clang-tidy 12s
nix-grpc-store-clang-tidy-0.1.0: 1 | 0.1.0 | ^ /nix/store/mcbznvdb0xcncmv55gkg8gvyjjasn46k-abseil-cpp-20260107.1-dev/include/absl/meta/type_traits.h:2 …
nix-grpc-store-clang-tidy-0.1.0:
    1 | 0.1.0
      | ^
/nix/store/mcbznvdb0xcncmv55gkg8gvyjjasn46k-abseil-cpp-20260107.1-dev/include/absl/meta/type_traits.h:205:24: error: no template named 'result_of' in namespace 'std' [clang-diagnostic-error]
  205 | using result_of = std::result_of<F>;
      |                   ~~~~~^
FAILED: [code=1] meson-internal__clang-tidy 
/nix/store/by8lz2aj6nw13mm1mv08vr1gqlmz0ih5-meson-1.10.2/bin/meson --internal clangtidy /nix/var/nix/builds/nix-50194-160511831/source /nix/var/nix/builds/nix-50194-160511831/source/build --color always
ninja: build stopped: subcommand failed.
failed checks.aarch64-darwin.exit-stress 10s
nix-grpc-store-0.1.0: In file included from /nix/store/1yhx18kvaf265sfyf6vbzggdvya4q3i5-grpc-1.83.0/include/grpc/event_engine/slice_buffer.h:30: In file include …
nix-grpc-store-0.1.0:
In file included from /nix/store/1yhx18kvaf265sfyf6vbzggdvya4q3i5-grpc-1.83.0/include/grpc/event_engine/slice_buffer.h:30:
In file included from /nix/store/mcbznvdb0xcncmv55gkg8gvyjjasn46k-abseil-cpp-20260107.1-dev/include/absl/utility/utility.h:26:
/nix/store/mcbznvdb0xcncmv55gkg8gvyjjasn46k-abseil-cpp-20260107.1-dev/include/absl/meta/type_traits.h:205:24: error: no template named 'result_of' in namespace 'std'
  205 | using result_of = std::result_of<F>;
      |                   ~~~~~^
fatal error: too many errors emitted, stopping now [-ferror-limit=]
20 errors generated.
ninja: build stopped: subcommand failed.
dependency failed checks.aarch64-darwin.plugin-dispatcher
failed checks.aarch64-darwin.plugin-nix_2_31 10s
nix-grpc-store-0.1.0: In file included from /nix/store/kgsj106kmqmp2kk2m2vxrjkfaggvb66p-libcxx-21.1.6+apple-sdk-26.5/include/c++/v1/__format/formatter_floating_ …
nix-grpc-store-0.1.0:
In file included from /nix/store/kgsj106kmqmp2kk2m2vxrjkfaggvb66p-libcxx-21.1.6+apple-sdk-26.5/include/c++/v1/__format/formatter_floating_point.h:40:
In file included from /nix/store/kgsj106kmqmp2kk2m2vxrjkfaggvb66p-libcxx-21.1.6+apple-sdk-26.5/include/c++/v1/cmath:328:
../version:1:1: error: expected unqualified-id
    1 | 0.1.0
      | ^
fatal error: too many errors emitted, stopping now [-ferror-limit=]
20 errors generated.
ninja: build stopped: subcommand failed.
failed checks.aarch64-darwin.plugin-nix_2_34 11s
nix-grpc-store-0.1.0: In file included from /nix/store/1yhx18kvaf265sfyf6vbzggdvya4q3i5-grpc-1.83.0/include/grpc/event_engine/slice_buffer.h:30: In file include …
nix-grpc-store-0.1.0:
In file included from /nix/store/1yhx18kvaf265sfyf6vbzggdvya4q3i5-grpc-1.83.0/include/grpc/event_engine/slice_buffer.h:30:
In file included from /nix/store/mcbznvdb0xcncmv55gkg8gvyjjasn46k-abseil-cpp-20260107.1-dev/include/absl/utility/utility.h:26:
/nix/store/mcbznvdb0xcncmv55gkg8gvyjjasn46k-abseil-cpp-20260107.1-dev/include/absl/meta/type_traits.h:205:24: error: no template named 'result_of' in namespace 'std'
  205 | using result_of = std::result_of<F>;
      |                   ~~~~~^
fatal error: too many errors emitted, stopping now [-ferror-limit=]
20 errors generated.
ninja: build stopped: subcommand failed.
failed checks.aarch64-darwin.plugin-nix_2_35 10s
nix-grpc-store-0.1.0: In file included from /nix/store/1yhx18kvaf265sfyf6vbzggdvya4q3i5-grpc-1.83.0/include/grpc/event_engine/slice_buffer.h:30: In file include …
nix-grpc-store-0.1.0:
In file included from /nix/store/1yhx18kvaf265sfyf6vbzggdvya4q3i5-grpc-1.83.0/include/grpc/event_engine/slice_buffer.h:30:
In file included from /nix/store/mcbznvdb0xcncmv55gkg8gvyjjasn46k-abseil-cpp-20260107.1-dev/include/absl/utility/utility.h:26:
/nix/store/mcbznvdb0xcncmv55gkg8gvyjjasn46k-abseil-cpp-20260107.1-dev/include/absl/meta/type_traits.h:205:24: error: no template named 'result_of' in namespace 'std'
  205 | using result_of = std::result_of<F>;
      |                   ~~~~~^
fatal error: too many errors emitted, stopping now [-ferror-limit=]
20 errors generated.
ninja: build stopped: subcommand failed.
20 succeeded
succeeded attributes
status attribute duration
loading…