nixbot

builds

Mic92/nix-grpc-store build #90 failed

branch daemon-hygiene · PR #42 · commit dea7ef5028 · · took 4m 8s · eval 16s

3 failed
failed attributes
status attribute duration
failed checks.aarch64-darwin.clang-tidy 4m 1s
nix-grpc-store-clang-tidy-0.1.0: 805 | act.sa_handler = SIG_IGN; | ^ ../src/nix-grpc-daemon.cc:806:15: error: no header providing "SIGPIPE" …
nix-grpc-store-clang-tidy-0.1.0:
  805 |     act.sa_handler = SIG_IGN;
      |         ^
../src/nix-grpc-daemon.cc:806:15: error: no header providing "SIGPIPE" is directly included [misc-include-cleaner,-warnings-as-errors]
  806 |     sigaction(SIGPIPE, &act, nullptr);
      |               ^
FAILED: [code=1] meson-internal__clang-tidy 
/nix/store/735yy09gy9j1wzwrsd1v1xrgf6izyr5d-meson-1.10.2/bin/meson --internal clangtidy /nix/var/nix/builds/nix-81585-909638428/source /nix/var/nix/builds/nix-81585-909638428/source/build --color always
ninja: build stopped: subcommand failed.
failed checks.aarch64-linux.clang-tidy 1m 8s
nix-grpc-store-clang-tidy-0.1.0: >>> /nix/store/c33s2mld9r03fv11v9ad7dh5m9g8s1xp-clang-tools-22.1.8/bin/clang-tidy --use-color -quiet -p /build/source/build /bu …
nix-grpc-store-clang-tidy-0.1.0:
>>> /nix/store/c33s2mld9r03fv11v9ad7dh5m9g8s1xp-clang-tools-22.1.8/bin/clang-tidy --use-color -quiet -p /build/source/build /build/source/tests/farm-client-test.cc
Errors encountered while running clang-tidy
../tests/farm-client-test.cc:93:14: error: variable name 't0' is too short, expected at least 3 characters [readability-identifier-length,-warnings-as-errors]
   93 |         auto t0 = std::chrono::steady_clock::now();
      |              ^
FAILED: [code=1] meson-internal__clang-tidy 
/nix/store/4nhp26ss88i238s986fx3jcqcw4si9ly-meson-1.10.2/bin/meson --internal clangtidy /build/source /build/source/build --color always
ninja: build stopped: subcommand failed.
failed checks.x86_64-linux.clang-tidy 47s
nix-grpc-store-clang-tidy-0.1.0: >>> /nix/store/ck7w6mnxgy91d7kl1l3c531904k2nhk1-clang-tools-22.1.8/bin/clang-tidy --use-color -quiet -p /build/source/build /bu …
nix-grpc-store-clang-tidy-0.1.0:
>>> /nix/store/ck7w6mnxgy91d7kl1l3c531904k2nhk1-clang-tools-22.1.8/bin/clang-tidy --use-color -quiet -p /build/source/build /build/source/tests/farm-client-test.cc
Errors encountered while running clang-tidy
../tests/farm-client-test.cc:93:14: error: variable name 't0' is too short, expected at least 3 characters [readability-identifier-length,-warnings-as-errors]
   93 |         auto t0 = std::chrono::steady_clock::now();
      |              ^
FAILED: [code=1] meson-internal__clang-tidy 
/nix/store/azf6s3lpx8f53si93y8135mpyykjj72b-meson-1.10.2/bin/meson --internal clangtidy /build/source /build/source/build --color always
ninja: build stopped: subcommand failed.
23 succeeded
succeeded attributes
status attribute duration
loading…