nixbot

builds

Mic92/nixbot build #360 failed

branch main · PR #209 · commit 2b94bd2332 · · took 10m 31s · eval 18s

1 failed
failed attributes
status attribute duration
failed checks.x86_64-linux.nixbot-tests 31s
python3.14-nixbot-tests: E AssertionError: assert 'd0-L32' == 'd1-L1' E E - d1-L1 E + d0-L32 nixbot/tests/e2e/test_browse.py:95: …
python3.14-nixbot-tests:
E       AssertionError: assert 'd0-L32' == 'd1-L1'
E         
E         - d1-L1
E         + d0-L32
nixbot/tests/e2e/test_browse.py:95: AssertionError
=========================== short test summary info ============================
FAILED nixbot/tests/e2e/test_browse.py::test_structured_log_viewer - Assertio...
================== 1 failed, 792 passed, 12 skipped in 22.78s ==================
11 succeeded
succeeded attributes
status attribute duration
loading…
5 already built
skipped attributes
status attribute duration
loading…