nixbot

builds

Mic92/nixbot build #392 failed

branch main · PR #225 · commit e03de2e4ed · · took 9m 25s · eval 19s

6 failed
failed attributes
status attribute duration
failed checks.aarch64-darwin.nixbot-tests 34s
python3.14-nixbot-tests: nixbot/tests/test_orchestrator.py:2403: AssertionError ------------------------------ Captured log call ------------------------------- …
python3.14-nixbot-tests:
nixbot/tests/test_orchestrator.py:2403: AssertionError
------------------------------ Captured log call -------------------------------
WARNING  nixbot.memory:memory.py:99 could not read memory info, using conservative estimates
=========================== short test summary info ============================
FAILED nixbot/tests/test_orchestrator.py::test_inflight_share_fans_out_final_status - AssertionError: assert 1 == 2
FAILED nixbot/tests/test_orchestrator.py::test_linked_context_reported_on_eval_failure - AssertionError: assert 1 == 2
FAILED nixbot/tests/test_orchestrator.py::test_cancel_during_eval_resolves_linked_eval_contexts - AssertionError: assert 1 == 2
================== 3 failed, 814 passed, 28 skipped in 27.87s ==================
failed checks.aarch64-darwin.treefmt 2s
treefmt-check: with pytest.raises(CheckPermissionError): - await reporter.terminal_eval_finished( - EVENT, BUILD, EvalReport(success=Fals …
treefmt-check:
     with pytest.raises(CheckPermissionError):
-        await reporter.terminal_eval_finished(
-            EVENT, BUILD, EvalReport(success=False)
-        )
+        await reporter.terminal_eval_finished(EVENT, BUILD, EvalReport(success=False))
     with pytest.raises(CheckPermissionError):
         await reporter.build_finished(EVENT, BUILD, BuildResult("succeeded", 1, []))
     # Every phase still attempts to post. The forge is never latched off.
failed checks.aarch64-linux.nixbot-tests 39s
python3.14-nixbot-tests: =========================== short test summary info ============================ FAILED nixbot/tests/test_flake_prefetch.py::test_prefe …
python3.14-nixbot-tests:
=========================== short test summary info ============================
FAILED nixbot/tests/test_flake_prefetch.py::test_prefetch_integration - nixbo...
FAILED nixbot/tests/test_pipeline.py::test_full_pipeline - nixbot.nix_eval.Ev...
FAILED nixbot/tests/test_pipeline.py::test_cached_skip_on_second_run - Assert...
FAILED nixbot/tests/test_orchestrator.py::test_inflight_share_fans_out_final_status
FAILED nixbot/tests/test_orchestrator.py::test_linked_context_reported_on_eval_failure
FAILED nixbot/tests/test_orchestrator.py::test_cancel_during_eval_resolves_linked_eval_contexts
================== 6 failed, 827 passed, 12 skipped in 31.83s ==================
failed checks.aarch64-linux.treefmt 13s
treefmt-check: with pytest.raises(CheckPermissionError): - await reporter.terminal_eval_finished( - EVENT, BUILD, EvalReport(success=Fals …
treefmt-check:
     with pytest.raises(CheckPermissionError):
-        await reporter.terminal_eval_finished(
-            EVENT, BUILD, EvalReport(success=False)
-        )
+        await reporter.terminal_eval_finished(EVENT, BUILD, EvalReport(success=False))
     with pytest.raises(CheckPermissionError):
         await reporter.build_finished(EVENT, BUILD, BuildResult("succeeded", 1, []))
     # Every phase still attempts to post. The forge is never latched off.
failed checks.x86_64-linux.nixbot-tests 33s
python3.14-nixbot-tests: E AssertionError: assert 1 == 2 E + where 1 = len([('finished', 69, 'cancelled', 0)]) nixbot/tests/test_orchestrator.py:2 …
python3.14-nixbot-tests:
E       AssertionError: assert 1 == 2
E        +  where 1 = len([('finished', 69, 'cancelled', 0)])
nixbot/tests/test_orchestrator.py:2403: AssertionError
=========================== short test summary info ============================
FAILED nixbot/tests/test_orchestrator.py::test_inflight_share_fans_out_final_status
FAILED nixbot/tests/test_orchestrator.py::test_linked_context_reported_on_eval_failure
FAILED nixbot/tests/test_orchestrator.py::test_cancel_during_eval_resolves_linked_eval_contexts
================== 3 failed, 830 passed, 12 skipped in 25.22s ==================
failed checks.x86_64-linux.treefmt 10s
treefmt-check: with pytest.raises(CheckPermissionError): - await reporter.terminal_eval_finished( - EVENT, BUILD, EvalReport(success=Fals …
treefmt-check:
     with pytest.raises(CheckPermissionError):
-        await reporter.terminal_eval_finished(
-            EVENT, BUILD, EvalReport(success=False)
-        )
+        await reporter.terminal_eval_finished(EVENT, BUILD, EvalReport(success=False))
     with pytest.raises(CheckPermissionError):
         await reporter.build_finished(EVENT, BUILD, BuildResult("succeeded", 1, []))
     # Every phase still attempts to post. The forge is never latched off.
9 succeeded
succeeded attributes
status attribute duration
loading…
3 already built
skipped attributes
status attribute duration
loading…